# Logfile created on 2024-05-13 03:58:21 +0000 by logger.rb/v1.5.3 I, [2024-05-13T03:58:21.663116 #1530759] INFO -- : #, @formatter=nil, @logdev=#, @binmode=false, @mon_data=#, @mon_data_owner_object_id=860>>> I, [2024-05-13T03:58:21.663422 #1530759] INFO -- : $$$[beg] make update-unicode -j3 I, [2024-05-13T03:58:21.754776 #1530759] INFO -- : Downloading Unicode emoji 15.0 files... I, [2024-05-13T03:58:21.754845 #1530759] INFO -- : Downloading Unicode emoji 15.0 files... I, [2024-05-13T03:58:21.755153 #1530759] INFO -- : Downloading Unicode emoji 15.0 files... I, [2024-05-13T03:58:21.833603 #1530759] INFO -- : made symlink emoji/15.0/emoji-sequences.txt to /home/opc/ruby/src/master/.downloaded-cache/emoji/15.0/emoji-sequences.txt I, [2024-05-13T03:58:21.835474 #1530759] INFO -- : downloading emoji/15.0/emoji-sequences.txt ... downloading emoji/15.0/emoji-test.txt ... /home/opc/ruby/src/master/enc/unicode/data/emoji/15.0/emoji-sequences.txt already exists E, [2024-05-13T03:58:22.278271 #1530759] ERROR -- : /home/opc/ruby/src/master/tool/downloader.rb:302:in `rescue in download': failed to download emoji/15.0/emoji-test.txt (RuntimeError) E, [2024-05-13T03:58:22.278340 #1530759] ERROR -- : OpenURI::HTTPError: 403 Forbidden: https://www.unicode.org/Public/emoji/15.0/emoji-test.txt E, [2024-05-13T03:58:22.278351 #1530759] ERROR -- : from /home/opc/ruby/src/master/tool/downloader.rb:201:in `download' E, [2024-05-13T03:58:22.278362 #1530759] ERROR -- : from /home/opc/ruby/src/master/tool/downloader.rb:136:in `download' E, [2024-05-13T03:58:22.278370 #1530759] ERROR -- : from /home/opc/ruby/src/master/tool/downloader.rb:482:in `block in
' E, [2024-05-13T03:58:22.278379 #1530759] ERROR -- : from /home/opc/ruby/src/master/tool/downloader.rb:465:in `each' E, [2024-05-13T03:58:22.278387 #1530759] ERROR -- : from /home/opc/ruby/src/master/tool/downloader.rb:465:in `
' E, [2024-05-13T03:58:22.278395 #1530759] ERROR -- : /usr/local/lib/ruby/3.2.0/open-uri.rb:369:in `open_http': 403 Forbidden (OpenURI::HTTPError) E, [2024-05-13T03:58:22.278404 #1530759] ERROR -- : from /usr/local/lib/ruby/3.2.0/open-uri.rb:760:in `buffer_open' E, [2024-05-13T03:58:22.278412 #1530759] ERROR -- : from /usr/local/lib/ruby/3.2.0/open-uri.rb:214:in `block in open_loop' E, [2024-05-13T03:58:22.278420 #1530759] ERROR -- : from /usr/local/lib/ruby/3.2.0/open-uri.rb:212:in `catch' E, [2024-05-13T03:58:22.278428 #1530759] ERROR -- : from /usr/local/lib/ruby/3.2.0/open-uri.rb:212:in `open_loop' E, [2024-05-13T03:58:22.278437 #1530759] ERROR -- : from /usr/local/lib/ruby/3.2.0/open-uri.rb:153:in `open_uri' E, [2024-05-13T03:58:22.278445 #1530759] ERROR -- : from /usr/local/lib/ruby/3.2.0/open-uri.rb:740:in `open' E, [2024-05-13T03:58:22.278453 #1530759] ERROR -- : from /usr/local/lib/ruby/3.2.0/open-uri.rb:748:in `read' E, [2024-05-13T03:58:22.278464 #1530759] ERROR -- : from /home/opc/ruby/src/master/tool/downloader.rb:247:in `block in download' E, [2024-05-13T03:58:22.278473 #1530759] ERROR -- : from /home/opc/ruby/src/master/tool/downloader.rb:378:in `with_retry' E, [2024-05-13T03:58:22.278481 #1530759] ERROR -- : from /home/opc/ruby/src/master/tool/downloader.rb:246:in `download' E, [2024-05-13T03:58:22.278489 #1530759] ERROR -- : from /home/opc/ruby/src/master/tool/downloader.rb:136:in `download' E, [2024-05-13T03:58:22.278497 #1530759] ERROR -- : from /home/opc/ruby/src/master/tool/downloader.rb:482:in `block in
' E, [2024-05-13T03:58:22.278505 #1530759] ERROR -- : from /home/opc/ruby/src/master/tool/downloader.rb:465:in `each' E, [2024-05-13T03:58:22.278513 #1530759] ERROR -- : from /home/opc/ruby/src/master/tool/downloader.rb:465:in `
' E, [2024-05-13T03:58:22.281462 #1530759] ERROR -- : make: *** [uncommon.mk:1765: /home/opc/ruby/src/master/enc/unicode/data/emoji/15.0/emoji-zwj-sequences.txt] Error 1 E, [2024-05-13T03:58:22.281512 #1530759] ERROR -- : make: *** Waiting for unfinished jobs.... E, [2024-05-13T03:58:22.307185 #1530759] ERROR -- : /home/opc/ruby/src/master/tool/downloader.rb:302:in `rescue in download': failed to download emoji/15.0/emoji-test.txt (RuntimeError) E, [2024-05-13T03:58:22.307248 #1530759] ERROR -- : OpenURI::HTTPError: 403 Forbidden: https://www.unicode.org/Public/emoji/15.0/emoji-test.txt E, [2024-05-13T03:58:22.307260 #1530759] ERROR -- : from /home/opc/ruby/src/master/tool/downloader.rb:201:in `download' E, [2024-05-13T03:58:22.307270 #1530759] ERROR -- : from /home/opc/ruby/src/master/tool/downloader.rb:136:in `download' E, [2024-05-13T03:58:22.307278 #1530759] ERROR -- : from /home/opc/ruby/src/master/tool/downloader.rb:482:in `block in
' E, [2024-05-13T03:58:22.307287 #1530759] ERROR -- : from /home/opc/ruby/src/master/tool/downloader.rb:465:in `each' E, [2024-05-13T03:58:22.307295 #1530759] ERROR -- : from /home/opc/ruby/src/master/tool/downloader.rb:465:in `
' E, [2024-05-13T03:58:22.307303 #1530759] ERROR -- : /usr/local/lib/ruby/3.2.0/open-uri.rb:369:in `open_http': 403 Forbidden (OpenURI::HTTPError) E, [2024-05-13T03:58:22.307312 #1530759] ERROR -- : from /usr/local/lib/ruby/3.2.0/open-uri.rb:760:in `buffer_open' E, [2024-05-13T03:58:22.307320 #1530759] ERROR -- : from /usr/local/lib/ruby/3.2.0/open-uri.rb:214:in `block in open_loop' E, [2024-05-13T03:58:22.307328 #1530759] ERROR -- : from /usr/local/lib/ruby/3.2.0/open-uri.rb:212:in `catch' E, [2024-05-13T03:58:22.307336 #1530759] ERROR -- : from /usr/local/lib/ruby/3.2.0/open-uri.rb:212:in `open_loop' E, [2024-05-13T03:58:22.307345 #1530759] ERROR -- : from /usr/local/lib/ruby/3.2.0/open-uri.rb:153:in `open_uri' E, [2024-05-13T03:58:22.307353 #1530759] ERROR -- : from /usr/local/lib/ruby/3.2.0/open-uri.rb:740:in `open' E, [2024-05-13T03:58:22.307361 #1530759] ERROR -- : from /usr/local/lib/ruby/3.2.0/open-uri.rb:748:in `read' E, [2024-05-13T03:58:22.307369 #1530759] ERROR -- : from /home/opc/ruby/src/master/tool/downloader.rb:247:in `block in download' E, [2024-05-13T03:58:22.307378 #1530759] ERROR -- : from /home/opc/ruby/src/master/tool/downloader.rb:378:in `with_retry' E, [2024-05-13T03:58:22.307386 #1530759] ERROR -- : from /home/opc/ruby/src/master/tool/downloader.rb:246:in `download' E, [2024-05-13T03:58:22.307395 #1530759] ERROR -- : from /home/opc/ruby/src/master/tool/downloader.rb:136:in `download' E, [2024-05-13T03:58:22.307403 #1530759] ERROR -- : from /home/opc/ruby/src/master/tool/downloader.rb:482:in `block in
' E, [2024-05-13T03:58:22.307411 #1530759] ERROR -- : from /home/opc/ruby/src/master/tool/downloader.rb:465:in `each' E, [2024-05-13T03:58:22.307420 #1530759] ERROR -- : from /home/opc/ruby/src/master/tool/downloader.rb:465:in `
' E, [2024-05-13T03:58:22.310368 #1530759] ERROR -- : make: *** [uncommon.mk:1765: /home/opc/ruby/src/master/enc/unicode/data/emoji/15.0/emoji-test.txt] Error 1 E, [2024-05-13T03:58:22.741335 #1530759] ERROR -- : /home/opc/ruby/src/master/tool/downloader.rb:302:in `rescue in download': failed to download emoji/15.0/emoji-sequences.txt (RuntimeError) E, [2024-05-13T03:58:22.741408 #1530759] ERROR -- : EOFError: end of file reached: https://www.unicode.org/Public/emoji/15.0/emoji-sequences.txt E, [2024-05-13T03:58:22.741419 #1530759] ERROR -- : from /home/opc/ruby/src/master/tool/downloader.rb:201:in `download' E, [2024-05-13T03:58:22.741428 #1530759] ERROR -- : from /home/opc/ruby/src/master/tool/downloader.rb:136:in `download' E, [2024-05-13T03:58:22.741436 #1530759] ERROR -- : from /home/opc/ruby/src/master/tool/downloader.rb:482:in `block in
' E, [2024-05-13T03:58:22.741445 #1530759] ERROR -- : from /home/opc/ruby/src/master/tool/downloader.rb:465:in `each' E, [2024-05-13T03:58:22.741453 #1530759] ERROR -- : from /home/opc/ruby/src/master/tool/downloader.rb:465:in `
' E, [2024-05-13T03:58:22.741462 #1530759] ERROR -- : /usr/local/lib/ruby/3.2.0/net/protocol.rb:237:in `rbuf_fill': end of file reached (EOFError) E, [2024-05-13T03:58:22.741470 #1530759] ERROR -- : from /usr/local/lib/ruby/3.2.0/net/protocol.rb:199:in `readuntil' E, [2024-05-13T03:58:22.741478 #1530759] ERROR -- : from /usr/local/lib/ruby/3.2.0/net/protocol.rb:209:in `readline' E, [2024-05-13T03:58:22.741486 #1530759] ERROR -- : from /usr/local/lib/ruby/3.2.0/net/http/response.rb:158:in `read_status_line' E, [2024-05-13T03:58:22.741494 #1530759] ERROR -- : from /usr/local/lib/ruby/3.2.0/net/http/response.rb:147:in `read_new' E, [2024-05-13T03:58:22.741503 #1530759] ERROR -- : from /usr/local/lib/ruby/3.2.0/net/http.rb:1862:in `block in transport_request' E, [2024-05-13T03:58:22.741511 #1530759] ERROR -- : from /usr/local/lib/ruby/3.2.0/net/http.rb:1853:in `catch' E, [2024-05-13T03:58:22.741519 #1530759] ERROR -- : from /usr/local/lib/ruby/3.2.0/net/http.rb:1853:in `transport_request' E, [2024-05-13T03:58:22.741527 #1530759] ERROR -- : from /usr/local/lib/ruby/3.2.0/net/http.rb:1826:in `request' E, [2024-05-13T03:58:22.741535 #1530759] ERROR -- : from /usr/local/lib/ruby/3.2.0/open-uri.rb:333:in `block in open_http' E, [2024-05-13T03:58:22.741544 #1530759] ERROR -- : from /usr/local/lib/ruby/3.2.0/net/http.rb:1238:in `start' E, [2024-05-13T03:58:22.741552 #1530759] ERROR -- : from /usr/local/lib/ruby/3.2.0/open-uri.rb:327:in `open_http' E, [2024-05-13T03:58:22.741560 #1530759] ERROR -- : from /usr/local/lib/ruby/3.2.0/open-uri.rb:760:in `buffer_open' E, [2024-05-13T03:58:22.741568 #1530759] ERROR -- : from /usr/local/lib/ruby/3.2.0/open-uri.rb:214:in `block in open_loop' E, [2024-05-13T03:58:22.741576 #1530759] ERROR -- : from /usr/local/lib/ruby/3.2.0/open-uri.rb:212:in `catch' E, [2024-05-13T03:58:22.741584 #1530759] ERROR -- : from /usr/local/lib/ruby/3.2.0/open-uri.rb:212:in `open_loop' E, [2024-05-13T03:58:22.741592 #1530759] ERROR -- : from /usr/local/lib/ruby/3.2.0/open-uri.rb:153:in `open_uri' E, [2024-05-13T03:58:22.741600 #1530759] ERROR -- : from /usr/local/lib/ruby/3.2.0/open-uri.rb:740:in `open' E, [2024-05-13T03:58:22.741608 #1530759] ERROR -- : from /usr/local/lib/ruby/3.2.0/open-uri.rb:748:in `read' E, [2024-05-13T03:58:22.741616 #1530759] ERROR -- : from /home/opc/ruby/src/master/tool/downloader.rb:247:in `block in download' E, [2024-05-13T03:58:22.741624 #1530759] ERROR -- : from /home/opc/ruby/src/master/tool/downloader.rb:378:in `with_retry' E, [2024-05-13T03:58:22.741633 #1530759] ERROR -- : from /home/opc/ruby/src/master/tool/downloader.rb:246:in `download' E, [2024-05-13T03:58:22.741641 #1530759] ERROR -- : from /home/opc/ruby/src/master/tool/downloader.rb:136:in `download' E, [2024-05-13T03:58:22.741649 #1530759] ERROR -- : from /home/opc/ruby/src/master/tool/downloader.rb:482:in `block in
' E, [2024-05-13T03:58:22.741657 #1530759] ERROR -- : from /home/opc/ruby/src/master/tool/downloader.rb:465:in `each' E, [2024-05-13T03:58:22.741665 #1530759] ERROR -- : from /home/opc/ruby/src/master/tool/downloader.rb:465:in `
' E, [2024-05-13T03:58:22.744464 #1530759] ERROR -- : make: *** [uncommon.mk:1765: /home/opc/ruby/src/master/enc/unicode/data/emoji/15.0/emoji-sequences.txt] Error 1 E, [2024-05-13T03:58:22.744579 #1530759] ERROR -- : make: *** Deleting file '/home/opc/ruby/src/master/enc/unicode/data/emoji/15.0/emoji-sequences.txt' I, [2024-05-13T03:58:22.744714 #1530759] INFO -- : downloading emoji/15.0/emoji-test.txt ... I, [2024-05-13T03:58:22.744968 #1530759] INFO -- : $$$[end] "make update-unicode -j3" exit with 512. I, [2024-05-13T03:58:22.745015 #1530759] INFO -- : $$$[beg] make update-download -j3 I, [2024-05-13T03:58:22.909504 #1530759] INFO -- : tool/config.guess already exists I, [2024-05-13T03:58:22.909575 #1530759] INFO -- : tool/config.sub already exists I, [2024-05-13T03:58:22.912425 #1530759] INFO -- : Update minitest to ea9caafc0754b1d6236a490d59e624b53209734a I, [2024-05-13T03:58:22.912631 #1530759] INFO -- : Update power_assert to 84e85124c5014a139af39161d484156cfe87a9ed I, [2024-05-13T03:58:22.912873 #1530759] INFO -- : Update rbs to ba7872795d5de04adb8ff500c0e6afdc81a041dd I, [2024-05-13T03:58:22.915939 #1530759] INFO -- : echo ea9caafc0754b1d6236a490d59e624b53209734a | /bin/sh /home/opc/ruby/src/master/tool/ifchange /home/opc/ruby/src/master/.bundle/.timestamp/minitest.revision - I, [2024-05-13T03:58:22.916120 #1530759] INFO -- : echo 84e85124c5014a139af39161d484156cfe87a9ed | /bin/sh /home/opc/ruby/src/master/tool/ifchange /home/opc/ruby/src/master/.bundle/.timestamp/power_assert.revision - I, [2024-05-13T03:58:22.916284 #1530759] INFO -- : echo ba7872795d5de04adb8ff500c0e6afdc81a041dd | /bin/sh /home/opc/ruby/src/master/tool/ifchange /home/opc/ruby/src/master/.bundle/.timestamp/rbs.revision - I, [2024-05-13T03:58:22.922056 #1530759] INFO -- : /home/opc/ruby/src/master/.bundle/.timestamp/rbs.revision unchanged I, [2024-05-13T03:58:22.922307 #1530759] INFO -- : /home/opc/ruby/src/master/.bundle/.timestamp/power_assert.revision unchanged I, [2024-05-13T03:58:22.922575 #1530759] INFO -- : /home/opc/ruby/src/master/.bundle/.timestamp/minitest.revision unchanged I, [2024-05-13T03:58:22.924429 #1530759] INFO -- : Update typeprof to b19a6416da3a05d57fadd6ffdadb382b6d236ca5 I, [2024-05-13T03:58:22.931307 #1530759] INFO -- : echo b19a6416da3a05d57fadd6ffdadb382b6d236ca5 | /bin/sh /home/opc/ruby/src/master/tool/ifchange /home/opc/ruby/src/master/.bundle/.timestamp/typeprof.revision - I, [2024-05-13T03:58:22.939476 #1530759] INFO -- : /home/opc/ruby/src/master/.bundle/.timestamp/typeprof.revision unchanged I, [2024-05-13T03:58:23.013831 #1530759] INFO -- : Building power_assert@84e85124c5014a139af39161d484156cfe87a9ed to /home/opc/ruby/src/master/gems/power_assert-2.0.3.gem I, [2024-05-13T03:58:23.128280 #1530759] INFO -- : Successfully built RubyGem I, [2024-05-13T03:58:23.128338 #1530759] INFO -- : Name: power_assert I, [2024-05-13T03:58:23.128349 #1530759] INFO -- : Version: 2.0.4dev I, [2024-05-13T03:58:23.128358 #1530759] INFO -- : File: power_assert-2.0.4dev.gem I, [2024-05-13T03:58:23.211016 #1530759] INFO -- : $$$[end] "make update-download -j3" exit with 0. I, [2024-05-13T03:58:23.211090 #1530759] INFO -- : $$$[beg] make update-rubyspec -j3 I, [2024-05-13T03:58:23.300165 #1530759] INFO -- : make: Nothing to be done for 'update-rubyspec'. I, [2024-05-13T03:58:23.300332 #1530759] INFO -- : $$$[end] "make update-rubyspec -j3" exit with 0. I, [2024-05-13T03:58:23.300379 #1530759] INFO -- : $$$[beg] make update-src -j3 I, [2024-05-13T03:58:24.349696 #1530759] INFO -- : Already up to date. I, [2024-05-13T03:58:24.364589 #1530759] INFO -- : Latest commit hash = 3c16d93cd3 I, [2024-05-13T03:58:24.365215 #1530759] INFO -- : $$$[end] "make update-src -j3" exit with 0. I, [2024-05-13T03:58:24.365261 #1530759] INFO -- : $$$[beg] make after-update -j3 I, [2024-05-13T03:58:24.467976 #1530759] INFO -- : generating /home/opc/ruby/src/master/ext/ripper/eventids2table.c I, [2024-05-13T03:58:24.474533 #1530759] INFO -- : make[1]: Entering directory '/home/opc/ruby/src/master/ext/ripper' I, [2024-05-13T03:58:24.474586 #1530759] INFO -- : make[1]: Nothing to be done for 'src'. I, [2024-05-13T03:58:24.474599 #1530759] INFO -- : make[1]: Leaving directory '/home/opc/ruby/src/master/ext/ripper' I, [2024-05-13T03:58:24.501594 #1530759] INFO -- : /home/opc/ruby/src/master/revision.h updated I, [2024-05-13T03:58:24.502787 #1530759] INFO -- : generating aarch64-linux-fake.rb I, [2024-05-13T03:58:24.559440 #1530759] INFO -- : aarch64-linux-fake.rb updated I, [2024-05-13T03:58:24.560881 #1530759] INFO -- : generating enc.mk I, [2024-05-13T03:58:24.796739 #1530759] INFO -- : making srcs under enc I, [2024-05-13T03:58:24.838698 #1530759] INFO -- : make[1]: Entering directory '/home/opc/ruby/build/master' I, [2024-05-13T03:58:24.838787 #1530759] INFO -- : make[1]: Nothing to be done for 'srcs'. I, [2024-05-13T03:58:24.838807 #1530759] INFO -- : make[1]: Leaving directory '/home/opc/ruby/build/master' I, [2024-05-13T03:58:24.920291 #1530759] INFO -- : Update minitest to ea9caafc0754b1d6236a490d59e624b53209734a I, [2024-05-13T03:58:24.920359 #1530759] INFO -- : Update power_assert to 84e85124c5014a139af39161d484156cfe87a9ed I, [2024-05-13T03:58:24.920759 #1530759] INFO -- : Update rbs to ba7872795d5de04adb8ff500c0e6afdc81a041dd I, [2024-05-13T03:58:24.923564 #1530759] INFO -- : echo 84e85124c5014a139af39161d484156cfe87a9ed | /bin/sh /home/opc/ruby/src/master/tool/ifchange /home/opc/ruby/src/master/.bundle/.timestamp/power_assert.revision - I, [2024-05-13T03:58:24.923788 #1530759] INFO -- : echo ea9caafc0754b1d6236a490d59e624b53209734a | /bin/sh /home/opc/ruby/src/master/tool/ifchange /home/opc/ruby/src/master/.bundle/.timestamp/minitest.revision - I, [2024-05-13T03:58:24.923925 #1530759] INFO -- : echo ba7872795d5de04adb8ff500c0e6afdc81a041dd | /bin/sh /home/opc/ruby/src/master/tool/ifchange /home/opc/ruby/src/master/.bundle/.timestamp/rbs.revision - I, [2024-05-13T03:58:24.930093 #1530759] INFO -- : /home/opc/ruby/src/master/.bundle/.timestamp/rbs.revision unchanged I, [2024-05-13T03:58:24.930444 #1530759] INFO -- : /home/opc/ruby/src/master/.bundle/.timestamp/power_assert.revision unchanged I, [2024-05-13T03:58:24.930665 #1530759] INFO -- : /home/opc/ruby/src/master/.bundle/.timestamp/minitest.revision unchanged I, [2024-05-13T03:58:24.932849 #1530759] INFO -- : Update typeprof to b19a6416da3a05d57fadd6ffdadb382b6d236ca5 I, [2024-05-13T03:58:24.937736 #1530759] INFO -- : echo b19a6416da3a05d57fadd6ffdadb382b6d236ca5 | /bin/sh /home/opc/ruby/src/master/tool/ifchange /home/opc/ruby/src/master/.bundle/.timestamp/typeprof.revision - I, [2024-05-13T03:58:24.946204 #1530759] INFO -- : /home/opc/ruby/src/master/.bundle/.timestamp/typeprof.revision unchanged I, [2024-05-13T03:58:25.024348 #1530759] INFO -- : Building power_assert@84e85124c5014a139af39161d484156cfe87a9ed to /home/opc/ruby/src/master/gems/power_assert-2.0.3.gem I, [2024-05-13T03:58:25.132932 #1530759] INFO -- : Successfully built RubyGem I, [2024-05-13T03:58:25.132996 #1530759] INFO -- : Name: power_assert I, [2024-05-13T03:58:25.133007 #1530759] INFO -- : Version: 2.0.4dev I, [2024-05-13T03:58:25.133016 #1530759] INFO -- : File: power_assert-2.0.4dev.gem I, [2024-05-13T03:58:25.135173 #1530759] INFO -- : Extracting bundle gem power_assert-2.0.3... I, [2024-05-13T03:58:25.230797 #1530759] INFO -- : Try with hash version of bundled gems instead of gems/power_assert-2.0.3.gem. We don't use this gem with release version of Ruby. I, [2024-05-13T03:58:25.240740 #1530759] INFO -- : Unpacked gems/power_assert-2.0.4dev.gem I, [2024-05-13T03:58:25.242529 #1530759] INFO -- : $$$[end] "make after-update -j3" exit with 0. I, [2024-05-13T03:58:25.242672 #1530759] INFO -- : $$$[beg] make miniruby -j3 I, [2024-05-13T03:58:25.331161 #1530759] INFO -- : BASERUBY = /usr/local/bin/ruby --disable=gems I, [2024-05-13T03:58:25.331227 #1530759] INFO -- : CC = gcc I, [2024-05-13T03:58:25.331254 #1530759] INFO -- : LD = ld I, [2024-05-13T03:58:25.331264 #1530759] INFO -- : LDSHARED = gcc -shared I, [2024-05-13T03:58:25.331275 #1530759] INFO -- : CFLAGS = -O3 -fno-fast-math -ggdb3 -Wall -Wextra -Wdeprecated-declarations -Wdiv-by-zero -Wduplicated-cond -Wimplicit-function-declaration -Wimplicit-int -Wpointer-arith -Wwrite-strings -Wold-style-definition -Wimplicit-fallthrough=0 -Wmissing-noreturn -Wno-cast-function-type -Wno-constant-logical-operand -Wno-long-long -Wno-missing-field-initializers -Wno-overlength-strings -Wno-packed-bitfield-compat -Wno-parentheses-equality -Wno-self-assign -Wno-tautological-compare -Wno-unused-parameter -Wno-unused-value -Wsuggest-attribute=format -Wsuggest-attribute=noreturn -Wunused-variable -Wmisleading-indentation -Wundef I, [2024-05-13T03:58:25.331288 #1530759] INFO -- : XCFLAGS = -U_FORTIFY_SOURCE -D_FORTIFY_SOURCE=2 -fstack-protector-strong -msign-return-address=all -fno-strict-overflow -fvisibility=hidden -fexcess-precision=standard -DRUBY_EXPORT -fPIE -I. -I.ext/include/aarch64-linux -I/home/opc/ruby/src/master/include -I/home/opc/ruby/src/master -I/home/opc/ruby/src/master/prism -I/home/opc/ruby/src/master/enc/unicode/15.0.0 I, [2024-05-13T03:58:25.331297 #1530759] INFO -- : CPPFLAGS = I, [2024-05-13T03:58:25.331305 #1530759] INFO -- : DLDFLAGS = -Wl,--compress-debug-sections=zlib -fstack-protector-strong -pie I, [2024-05-13T03:58:25.331314 #1530759] INFO -- : SOLIBS = -lz -lrt -lrt -ldl -lcrypt -lm -lpthread I, [2024-05-13T03:58:25.331321 #1530759] INFO -- : LANG = en_US.UTF-8 I, [2024-05-13T03:58:25.331329 #1530759] INFO -- : LC_ALL = I, [2024-05-13T03:58:25.331337 #1530759] INFO -- : LC_CTYPE = I, [2024-05-13T03:58:25.331345 #1530759] INFO -- : MFLAGS = -j3 --jobserver-auth=4,5 I, [2024-05-13T03:58:25.331353 #1530759] INFO -- : RUSTC = rustc I, [2024-05-13T03:58:25.331361 #1530759] INFO -- : YJIT_RUSTC_ARGS = --crate-name=yjit --crate-type=staticlib --edition=2021 -g -C lto=thin -C opt-level=3 -C overflow-checks=on '--out-dir=/home/opc/ruby/build/master/yjit/target/release/' /home/opc/ruby/src/master/yjit/src/lib.rs I, [2024-05-13T03:58:25.332102 #1530759] INFO -- : gcc (GCC) 8.5.0 20210514 (Red Hat 8.5.0-10.1.0.1) I, [2024-05-13T03:58:25.332142 #1530759] INFO -- : Copyright (C) 2018 Free Software Foundation, Inc. I, [2024-05-13T03:58:25.332153 #1530759] INFO -- : This is free software; see the source for copying conditions. There is NO I, [2024-05-13T03:58:25.332162 #1530759] INFO -- : warranty; not even for MERCHANTABILITY or FITNESS FOR A PARTICULAR PURPOSE. I, [2024-05-13T03:58:25.332170 #1530759] INFO -- : I, [2024-05-13T03:58:25.356981 #1530759] INFO -- : compiling /home/opc/ruby/src/master/version.c I, [2024-05-13T03:58:25.499372 #1530759] INFO -- : linking miniruby I, [2024-05-13T03:58:26.393488 #1530759] INFO -- : $$$[end] "make miniruby -j3" exit with 0. I, [2024-05-13T03:58:26.393655 #1530759] INFO -- : $$$[beg] make ruby -j3 I, [2024-05-13T03:58:26.481609 #1530759] INFO -- : BASERUBY = /usr/local/bin/ruby --disable=gems I, [2024-05-13T03:58:26.481673 #1530759] INFO -- : CC = gcc I, [2024-05-13T03:58:26.481684 #1530759] INFO -- : LD = ld I, [2024-05-13T03:58:26.481693 #1530759] INFO -- : LDSHARED = gcc -shared I, [2024-05-13T03:58:26.481704 #1530759] INFO -- : CFLAGS = -O3 -fno-fast-math -ggdb3 -Wall -Wextra -Wdeprecated-declarations -Wdiv-by-zero -Wduplicated-cond -Wimplicit-function-declaration -Wimplicit-int -Wpointer-arith -Wwrite-strings -Wold-style-definition -Wimplicit-fallthrough=0 -Wmissing-noreturn -Wno-cast-function-type -Wno-constant-logical-operand -Wno-long-long -Wno-missing-field-initializers -Wno-overlength-strings -Wno-packed-bitfield-compat -Wno-parentheses-equality -Wno-self-assign -Wno-tautological-compare -Wno-unused-parameter -Wno-unused-value -Wsuggest-attribute=format -Wsuggest-attribute=noreturn -Wunused-variable -Wmisleading-indentation -Wundef I, [2024-05-13T03:58:26.481713 #1530759] INFO -- : XCFLAGS = -U_FORTIFY_SOURCE -D_FORTIFY_SOURCE=2 -fstack-protector-strong -msign-return-address=all -fno-strict-overflow -fvisibility=hidden -fexcess-precision=standard -DRUBY_EXPORT -fPIE -I. -I.ext/include/aarch64-linux -I/home/opc/ruby/src/master/include -I/home/opc/ruby/src/master -I/home/opc/ruby/src/master/prism -I/home/opc/ruby/src/master/enc/unicode/15.0.0 I, [2024-05-13T03:58:26.481725 #1530759] INFO -- : CPPFLAGS = I, [2024-05-13T03:58:26.481733 #1530759] INFO -- : DLDFLAGS = -Wl,--compress-debug-sections=zlib -fstack-protector-strong -pie I, [2024-05-13T03:58:26.481742 #1530759] INFO -- : SOLIBS = -lz -lrt -lrt -ldl -lcrypt -lm -lpthread I, [2024-05-13T03:58:26.481750 #1530759] INFO -- : LANG = en_US.UTF-8 I, [2024-05-13T03:58:26.481758 #1530759] INFO -- : LC_ALL = I, [2024-05-13T03:58:26.481766 #1530759] INFO -- : LC_CTYPE = I, [2024-05-13T03:58:26.481773 #1530759] INFO -- : MFLAGS = -j3 --jobserver-auth=4,5 I, [2024-05-13T03:58:26.481781 #1530759] INFO -- : RUSTC = rustc I, [2024-05-13T03:58:26.481790 #1530759] INFO -- : YJIT_RUSTC_ARGS = --crate-name=yjit --crate-type=staticlib --edition=2021 -g -C lto=thin -C opt-level=3 -C overflow-checks=on '--out-dir=/home/opc/ruby/build/master/yjit/target/release/' /home/opc/ruby/src/master/yjit/src/lib.rs I, [2024-05-13T03:58:26.482536 #1530759] INFO -- : gcc (GCC) 8.5.0 20210514 (Red Hat 8.5.0-10.1.0.1) I, [2024-05-13T03:58:26.482571 #1530759] INFO -- : Copyright (C) 2018 Free Software Foundation, Inc. I, [2024-05-13T03:58:26.482581 #1530759] INFO -- : This is free software; see the source for copying conditions. There is NO I, [2024-05-13T03:58:26.482591 #1530759] INFO -- : warranty; not even for MERCHANTABILITY or FITNESS FOR A PARTICULAR PURPOSE. I, [2024-05-13T03:58:26.482599 #1530759] INFO -- : I, [2024-05-13T03:58:26.662050 #1530759] INFO -- : builtin_binary.inc updated I, [2024-05-13T03:58:26.665409 #1530759] INFO -- : c5234a9416e4f20f175185e840b25b0f08674d14078ed7083f37e655458e3ca9 builtin_binary.inc I, [2024-05-13T03:58:26.666436 #1530759] INFO -- : compiling /home/opc/ruby/src/master/builtin.c I, [2024-05-13T03:58:26.994817 #1530759] INFO -- : linking static-library libruby-static.a I, [2024-05-13T03:58:29.767605 #1530759] INFO -- : linking ruby I, [2024-05-13T03:58:30.682758 #1530759] INFO -- : $$$[end] "make ruby -j3" exit with 0. I, [2024-05-13T03:58:30.682924 #1530759] INFO -- : $$$[beg] make all -j3 I, [2024-05-13T03:58:30.771713 #1530759] INFO -- : BASERUBY = /usr/local/bin/ruby --disable=gems I, [2024-05-13T03:58:30.771782 #1530759] INFO -- : CC = gcc I, [2024-05-13T03:58:30.771793 #1530759] INFO -- : LD = ld I, [2024-05-13T03:58:30.771802 #1530759] INFO -- : LDSHARED = gcc -shared I, [2024-05-13T03:58:30.771811 #1530759] INFO -- : CFLAGS = -O3 -fno-fast-math -ggdb3 -Wall -Wextra -Wdeprecated-declarations -Wdiv-by-zero -Wduplicated-cond -Wimplicit-function-declaration -Wimplicit-int -Wpointer-arith -Wwrite-strings -Wold-style-definition -Wimplicit-fallthrough=0 -Wmissing-noreturn -Wno-cast-function-type -Wno-constant-logical-operand -Wno-long-long -Wno-missing-field-initializers -Wno-overlength-strings -Wno-packed-bitfield-compat -Wno-parentheses-equality -Wno-self-assign -Wno-tautological-compare -Wno-unused-parameter -Wno-unused-value -Wsuggest-attribute=format -Wsuggest-attribute=noreturn -Wunused-variable -Wmisleading-indentation -Wundef I, [2024-05-13T03:58:30.771822 #1530759] INFO -- : XCFLAGS = -U_FORTIFY_SOURCE -D_FORTIFY_SOURCE=2 -fstack-protector-strong -msign-return-address=all -fno-strict-overflow -fvisibility=hidden -fexcess-precision=standard -DRUBY_EXPORT -fPIE -I. -I.ext/include/aarch64-linux -I/home/opc/ruby/src/master/include -I/home/opc/ruby/src/master -I/home/opc/ruby/src/master/prism -I/home/opc/ruby/src/master/enc/unicode/15.0.0 I, [2024-05-13T03:58:30.771830 #1530759] INFO -- : CPPFLAGS = I, [2024-05-13T03:58:30.771838 #1530759] INFO -- : DLDFLAGS = -Wl,--compress-debug-sections=zlib -fstack-protector-strong -pie I, [2024-05-13T03:58:30.771847 #1530759] INFO -- : SOLIBS = -lz -lrt -lrt -ldl -lcrypt -lm -lpthread I, [2024-05-13T03:58:30.771855 #1530759] INFO -- : LANG = en_US.UTF-8 I, [2024-05-13T03:58:30.771863 #1530759] INFO -- : LC_ALL = I, [2024-05-13T03:58:30.771871 #1530759] INFO -- : LC_CTYPE = I, [2024-05-13T03:58:30.771882 #1530759] INFO -- : MFLAGS = -j3 --jobserver-auth=4,5 I, [2024-05-13T03:58:30.771890 #1530759] INFO -- : RUSTC = rustc I, [2024-05-13T03:58:30.771898 #1530759] INFO -- : YJIT_RUSTC_ARGS = --crate-name=yjit --crate-type=staticlib --edition=2021 -g -C lto=thin -C opt-level=3 -C overflow-checks=on '--out-dir=/home/opc/ruby/build/master/yjit/target/release/' /home/opc/ruby/src/master/yjit/src/lib.rs I, [2024-05-13T03:58:30.772665 #1530759] INFO -- : gcc (GCC) 8.5.0 20210514 (Red Hat 8.5.0-10.1.0.1) I, [2024-05-13T03:58:30.772708 #1530759] INFO -- : Copyright (C) 2018 Free Software Foundation, Inc. I, [2024-05-13T03:58:30.772718 #1530759] INFO -- : This is free software; see the source for copying conditions. There is NO I, [2024-05-13T03:58:30.772727 #1530759] INFO -- : warranty; not even for MERCHANTABILITY or FITNESS FOR A PARTICULAR PURPOSE. I, [2024-05-13T03:58:30.772736 #1530759] INFO -- : I, [2024-05-13T03:58:30.805458 #1530759] INFO -- : generating encdb.h I, [2024-05-13T03:58:30.806777 #1530759] INFO -- : generating enc.mk I, [2024-05-13T03:58:30.842964 #1530759] INFO -- : encdb.h unchanged I, [2024-05-13T03:58:31.043369 #1530759] INFO -- : making srcs under enc I, [2024-05-13T03:58:31.043441 #1530759] INFO -- : making enc I, [2024-05-13T03:58:31.071464 #1530759] INFO -- : make[1]: Entering directory '/home/opc/ruby/build/master' I, [2024-05-13T03:58:31.071539 #1530759] INFO -- : make[1]: Nothing to be done for 'enc'. I, [2024-05-13T03:58:31.071550 #1530759] INFO -- : make[1]: Leaving directory '/home/opc/ruby/build/master' I, [2024-05-13T03:58:31.085848 #1530759] INFO -- : make[1]: Entering directory '/home/opc/ruby/build/master' I, [2024-05-13T03:58:31.085902 #1530759] INFO -- : make[1]: Nothing to be done for 'srcs'. I, [2024-05-13T03:58:31.085913 #1530759] INFO -- : make[1]: Leaving directory '/home/opc/ruby/build/master' I, [2024-05-13T03:58:31.086803 #1530759] INFO -- : generating transdb.h I, [2024-05-13T03:58:31.230646 #1530759] INFO -- : transdb.h unchanged I, [2024-05-13T03:58:31.232000 #1530759] INFO -- : generating makefiles ext/configure-ext.mk I, [2024-05-13T03:58:31.232220 #1530759] INFO -- : making trans I, [2024-05-13T03:58:31.271894 #1530759] INFO -- : ext/configure-ext.mk updated I, [2024-05-13T03:58:31.275220 #1530759] INFO -- : make[1]: Entering directory '/home/opc/ruby/build/master' I, [2024-05-13T03:58:31.280576 #1530759] INFO -- : make[1]: Entering directory '/home/opc/ruby/build/master' I, [2024-05-13T03:58:31.280638 #1530759] INFO -- : make[1]: Nothing to be done for 'trans'. I, [2024-05-13T03:58:31.280652 #1530759] INFO -- : make[1]: Leaving directory '/home/opc/ruby/build/master' I, [2024-05-13T03:58:31.986680 #1530759] INFO -- : making encs I, [2024-05-13T03:58:32.019629 #1530759] INFO -- : make[1]: Leaving directory '/home/opc/ruby/build/master' I, [2024-05-13T03:58:32.020310 #1530759] INFO -- : generating makefile exts.mk I, [2024-05-13T03:58:32.039986 #1530759] INFO -- : make[1]: Entering directory '/home/opc/ruby/build/master' I, [2024-05-13T03:58:32.040058 #1530759] INFO -- : make[1]: Nothing to be done for 'encs'. I, [2024-05-13T03:58:32.040069 #1530759] INFO -- : make[1]: Leaving directory '/home/opc/ruby/build/master' I, [2024-05-13T03:58:32.079473 #1530759] INFO -- : exts.mk unchanged I, [2024-05-13T03:58:32.084305 #1530759] INFO -- : make[1]: Entering directory '/home/opc/ruby/build/master' I, [2024-05-13T03:58:32.188706 #1530759] INFO -- : make[2]: Entering directory '/home/opc/ruby/build/master/ext/coverage' I, [2024-05-13T03:58:32.190477 #1530759] INFO -- : make[2]: Entering directory '/home/opc/ruby/build/master/ext/digest' I, [2024-05-13T03:58:32.191964 #1530759] INFO -- : make[2]: Entering directory '/home/opc/ruby/build/master/ext/date' I, [2024-05-13T03:58:32.193962 #1530759] INFO -- : make[2]: Leaving directory '/home/opc/ruby/build/master/ext/coverage' I, [2024-05-13T03:58:32.197705 #1530759] INFO -- : make[2]: Leaving directory '/home/opc/ruby/build/master/ext/date' I, [2024-05-13T03:58:32.198300 #1530759] INFO -- : make[2]: Leaving directory '/home/opc/ruby/build/master/ext/digest' I, [2024-05-13T03:58:32.205421 #1530759] INFO -- : make[2]: Entering directory '/home/opc/ruby/build/master/ext/fiddle' I, [2024-05-13T03:58:32.207746 #1530759] INFO -- : make[2]: Entering directory '/home/opc/ruby/build/master/ext/io/console' I, [2024-05-13T03:58:32.210400 #1530759] INFO -- : make[2]: Leaving directory '/home/opc/ruby/build/master/ext/io/console' I, [2024-05-13T03:58:32.212700 #1530759] INFO -- : make[2]: Entering directory '/home/opc/ruby/build/master/ext/json' I, [2024-05-13T03:58:32.216137 #1530759] INFO -- : make[2]: Entering directory '/home/opc/ruby/build/master/ext/monitor' I, [2024-05-13T03:58:32.216817 #1530759] INFO -- : make[2]: Leaving directory '/home/opc/ruby/build/master/ext/fiddle' I, [2024-05-13T03:58:32.220261 #1530759] INFO -- : make[2]: Leaving directory '/home/opc/ruby/build/master/ext/monitor' I, [2024-05-13T03:58:32.223303 #1530759] INFO -- : make[2]: Leaving directory '/home/opc/ruby/build/master/ext/json' I, [2024-05-13T03:58:32.223795 #1530759] INFO -- : make[2]: Entering directory '/home/opc/ruby/build/master/ext/objspace' I, [2024-05-13T03:58:32.227352 #1530759] INFO -- : make[2]: Entering directory '/home/opc/ruby/build/master/ext/pathname' I, [2024-05-13T03:58:32.230069 #1530759] INFO -- : make[2]: Leaving directory '/home/opc/ruby/build/master/ext/objspace' I, [2024-05-13T03:58:32.233136 #1530759] INFO -- : make[2]: Leaving directory '/home/opc/ruby/build/master/ext/pathname' I, [2024-05-13T03:58:32.236384 #1530759] INFO -- : make[2]: Entering directory '/home/opc/ruby/build/master/ext/psych' I, [2024-05-13T03:58:32.237473 #1530759] INFO -- : make[2]: Entering directory '/home/opc/ruby/build/master/ext/pty' I, [2024-05-13T03:58:32.239458 #1530759] INFO -- : make[2]: Entering directory '/home/opc/ruby/build/master/ext/openssl' I, [2024-05-13T03:58:32.248817 #1530759] INFO -- : make[2]: Leaving directory '/home/opc/ruby/build/master/ext/pty' I, [2024-05-13T03:58:32.252677 #1530759] INFO -- : make[2]: Leaving directory '/home/opc/ruby/build/master/ext/psych' I, [2024-05-13T03:58:32.256245 #1530759] INFO -- : make[2]: Entering directory '/home/opc/ruby/build/master/ext/rubyvm' I, [2024-05-13T03:58:32.259511 #1530759] INFO -- : make[2]: Leaving directory '/home/opc/ruby/build/master/ext/rubyvm' I, [2024-05-13T03:58:32.261001 #1530759] INFO -- : make[2]: Entering directory '/home/opc/ruby/build/master/ext/ripper' I, [2024-05-13T03:58:32.262158 #1530759] INFO -- : make[2]: Leaving directory '/home/opc/ruby/build/master/ext/openssl' I, [2024-05-13T03:58:32.267879 #1530759] INFO -- : make[2]: Leaving directory '/home/opc/ruby/build/master/ext/ripper' I, [2024-05-13T03:58:32.273818 #1530759] INFO -- : make[2]: Entering directory '/home/opc/ruby/build/master/ext/socket' I, [2024-05-13T03:58:32.274979 #1530759] INFO -- : make[2]: Entering directory '/home/opc/ruby/build/master/.bundle/gems/bigdecimal-3.1.7/ext/bigdecimal' I, [2024-05-13T03:58:32.275701 #1530759] INFO -- : make[2]: Entering directory '/home/opc/ruby/build/master/.bundle/gems/bigdecimal-3.1.8/ext/bigdecimal' I, [2024-05-13T03:58:32.284758 #1530759] INFO -- : make[2]: Leaving directory '/home/opc/ruby/build/master/ext/socket' I, [2024-05-13T03:58:32.290617 #1530759] INFO -- : make[2]: Entering directory '/home/opc/ruby/build/master/.bundle/gems/debug-1.9.2/ext/debug' I, [2024-05-13T03:58:32.306232 #1530759] INFO -- : make[2]: Leaving directory '/home/opc/ruby/build/master/.bundle/gems/bigdecimal-3.1.8/ext/bigdecimal' I, [2024-05-13T03:58:32.306370 #1530759] INFO -- : make[2]: Leaving directory '/home/opc/ruby/build/master/.bundle/gems/bigdecimal-3.1.7/ext/bigdecimal' I, [2024-05-13T03:58:32.308724 #1530759] INFO -- : make[2]: Entering directory '/home/opc/ruby/build/master/.bundle/gems/nkf-0.2.0/ext/nkf' I, [2024-05-13T03:58:32.310993 #1530759] INFO -- : make[2]: Entering directory '/home/opc/ruby/build/master/.bundle/gems/racc-1.7.3/ext/racc/cparse' I, [2024-05-13T03:58:32.323809 #1530759] INFO -- : make[2]: Leaving directory '/home/opc/ruby/build/master/.bundle/gems/debug-1.9.2/ext/debug' I, [2024-05-13T03:58:32.328970 #1530759] INFO -- : make[2]: Entering directory '/home/opc/ruby/build/master/.bundle/gems/rbs-3.4.4/ext/rbs_extension' I, [2024-05-13T03:58:32.342403 #1530759] INFO -- : make[2]: Leaving directory '/home/opc/ruby/build/master/.bundle/gems/nkf-0.2.0/ext/nkf' I, [2024-05-13T03:58:32.343431 #1530759] INFO -- : make[2]: Leaving directory '/home/opc/ruby/build/master/.bundle/gems/racc-1.7.3/ext/racc/cparse' I, [2024-05-13T03:58:32.345735 #1530759] INFO -- : make[2]: Entering directory '/home/opc/ruby/build/master/.bundle/gems/syslog-0.1.2/ext/syslog' I, [2024-05-13T03:58:32.362103 #1530759] INFO -- : make[2]: Leaving directory '/home/opc/ruby/build/master/.bundle/gems/rbs-3.4.4/ext/rbs_extension' I, [2024-05-13T03:58:32.366235 #1530759] INFO -- : make[2]: Entering directory '/home/opc/ruby/build/master/ext/digest/sha2' I, [2024-05-13T03:58:32.371198 #1530759] INFO -- : make[2]: Leaving directory '/home/opc/ruby/build/master/ext/digest/sha2' I, [2024-05-13T03:58:32.376224 #1530759] INFO -- : make[2]: Leaving directory '/home/opc/ruby/build/master/.bundle/gems/syslog-0.1.2/ext/syslog' I, [2024-05-13T03:58:32.414061 #1530759] INFO -- : make[2]: Entering directory '/home/opc/ruby/build/master' I, [2024-05-13T03:58:32.499360 #1530759] INFO -- : make[2]: 'ruby' is up to date. I, [2024-05-13T03:58:32.499456 #1530759] INFO -- : make[2]: Leaving directory '/home/opc/ruby/build/master' I, [2024-05-13T03:58:32.499603 #1530759] INFO -- : make[1]: Leaving directory '/home/opc/ruby/build/master' I, [2024-05-13T03:58:32.504012 #1530759] INFO -- : make[1]: Entering directory '/home/opc/ruby/build/master' I, [2024-05-13T03:58:32.504036 #1530759] INFO -- : make[1]: Nothing to be done for 'note'. I, [2024-05-13T03:58:32.504047 #1530759] INFO -- : make[1]: Leaving directory '/home/opc/ruby/build/master' I, [2024-05-13T03:58:32.504367 #1530759] INFO -- : $$$[end] "make all -j3" exit with 0. I, [2024-05-13T03:58:32.504539 #1530759] INFO -- : $$$[beg] make install -j3 I, [2024-05-13T03:58:32.598238 #1530759] INFO -- : Update minitest to ea9caafc0754b1d6236a490d59e624b53209734a I, [2024-05-13T03:58:32.598397 #1530759] INFO -- : Update power_assert to 84e85124c5014a139af39161d484156cfe87a9ed I, [2024-05-13T03:58:32.598768 #1530759] INFO -- : Update rbs to ba7872795d5de04adb8ff500c0e6afdc81a041dd I, [2024-05-13T03:58:32.601712 #1530759] INFO -- : echo ea9caafc0754b1d6236a490d59e624b53209734a | /bin/sh /home/opc/ruby/src/master/tool/ifchange /home/opc/ruby/src/master/.bundle/.timestamp/minitest.revision - I, [2024-05-13T03:58:32.601953 #1530759] INFO -- : echo 84e85124c5014a139af39161d484156cfe87a9ed | /bin/sh /home/opc/ruby/src/master/tool/ifchange /home/opc/ruby/src/master/.bundle/.timestamp/power_assert.revision - I, [2024-05-13T03:58:32.602123 #1530759] INFO -- : echo ba7872795d5de04adb8ff500c0e6afdc81a041dd | /bin/sh /home/opc/ruby/src/master/tool/ifchange /home/opc/ruby/src/master/.bundle/.timestamp/rbs.revision - I, [2024-05-13T03:58:32.607843 #1530759] INFO -- : /home/opc/ruby/src/master/.bundle/.timestamp/power_assert.revision unchanged I, [2024-05-13T03:58:32.608080 #1530759] INFO -- : /home/opc/ruby/src/master/.bundle/.timestamp/minitest.revision unchanged I, [2024-05-13T03:58:32.610118 #1530759] INFO -- : Update typeprof to b19a6416da3a05d57fadd6ffdadb382b6d236ca5 I, [2024-05-13T03:58:32.610692 #1530759] INFO -- : /home/opc/ruby/src/master/.bundle/.timestamp/rbs.revision unchanged I, [2024-05-13T03:58:32.612607 #1530759] INFO -- : BASERUBY = /usr/local/bin/ruby --disable=gems I, [2024-05-13T03:58:32.612681 #1530759] INFO -- : CC = gcc I, [2024-05-13T03:58:32.612715 #1530759] INFO -- : LD = ld I, [2024-05-13T03:58:32.612768 #1530759] INFO -- : LDSHARED = gcc -shared I, [2024-05-13T03:58:32.612797 #1530759] INFO -- : CFLAGS = -O3 -fno-fast-math -ggdb3 -Wall -Wextra -Wdeprecated-declarations -Wdiv-by-zero -Wduplicated-cond -Wimplicit-function-declaration -Wimplicit-int -Wpointer-arith -Wwrite-strings -Wold-style-definition -Wimplicit-fallthrough=0 -Wmissing-noreturn -Wno-cast-function-type -Wno-constant-logical-operand -Wno-long-long -Wno-missing-field-initializers -Wno-overlength-strings -Wno-packed-bitfield-compat -Wno-parentheses-equality -Wno-self-assign -Wno-tautological-compare -Wno-unused-parameter -Wno-unused-value -Wsuggest-attribute=format -Wsuggest-attribute=noreturn -Wunused-variable -Wmisleading-indentation -Wundef I, [2024-05-13T03:58:32.612810 #1530759] INFO -- : XCFLAGS = -U_FORTIFY_SOURCE -D_FORTIFY_SOURCE=2 -fstack-protector-strong -msign-return-address=all -fno-strict-overflow -fvisibility=hidden -fexcess-precision=standard -DRUBY_EXPORT -fPIE -I. -I.ext/include/aarch64-linux -I/home/opc/ruby/src/master/include -I/home/opc/ruby/src/master -I/home/opc/ruby/src/master/prism -I/home/opc/ruby/src/master/enc/unicode/15.0.0 I, [2024-05-13T03:58:32.612819 #1530759] INFO -- : CPPFLAGS = I, [2024-05-13T03:58:32.612827 #1530759] INFO -- : DLDFLAGS = -Wl,--compress-debug-sections=zlib -fstack-protector-strong -pie I, [2024-05-13T03:58:32.612836 #1530759] INFO -- : SOLIBS = -lz -lrt -lrt -ldl -lcrypt -lm -lpthread I, [2024-05-13T03:58:32.612845 #1530759] INFO -- : LANG = en_US.UTF-8 I, [2024-05-13T03:58:32.612853 #1530759] INFO -- : LC_ALL = I, [2024-05-13T03:58:32.612861 #1530759] INFO -- : LC_CTYPE = I, [2024-05-13T03:58:32.612870 #1530759] INFO -- : MFLAGS = -j3 --jobserver-auth=4,5 I, [2024-05-13T03:58:32.612878 #1530759] INFO -- : RUSTC = rustc I, [2024-05-13T03:58:32.612886 #1530759] INFO -- : YJIT_RUSTC_ARGS = --crate-name=yjit --crate-type=staticlib --edition=2021 -g -C lto=thin -C opt-level=3 -C overflow-checks=on '--out-dir=/home/opc/ruby/build/master/yjit/target/release/' /home/opc/ruby/src/master/yjit/src/lib.rs I, [2024-05-13T03:58:32.643345 #1530759] INFO -- : echo b19a6416da3a05d57fadd6ffdadb382b6d236ca5 | /bin/sh /home/opc/ruby/src/master/tool/ifchange /home/opc/ruby/src/master/.bundle/.timestamp/typeprof.revision - I, [2024-05-13T03:58:32.644275 #1530759] INFO -- : gcc (GCC) 8.5.0 20210514 (Red Hat 8.5.0-10.1.0.1) I, [2024-05-13T03:58:32.644317 #1530759] INFO -- : Copyright (C) 2018 Free Software Foundation, Inc. I, [2024-05-13T03:58:32.644327 #1530759] INFO -- : This is free software; see the source for copying conditions. There is NO I, [2024-05-13T03:58:32.644337 #1530759] INFO -- : warranty; not even for MERCHANTABILITY or FITNESS FOR A PARTICULAR PURPOSE. I, [2024-05-13T03:58:32.644345 #1530759] INFO -- : I, [2024-05-13T03:58:32.644804 #1530759] INFO -- : generating encdb.h I, [2024-05-13T03:58:32.646834 #1530759] INFO -- : generating enc.mk I, [2024-05-13T03:58:32.649563 #1530759] INFO -- : /home/opc/ruby/src/master/.bundle/.timestamp/typeprof.revision unchanged I, [2024-05-13T03:58:32.682906 #1530759] INFO -- : encdb.h unchanged I, [2024-05-13T03:58:32.775389 #1530759] INFO -- : Building power_assert@84e85124c5014a139af39161d484156cfe87a9ed to /home/opc/ruby/src/master/gems/power_assert-2.0.3.gem I, [2024-05-13T03:58:32.885288 #1530759] INFO -- : making srcs under enc I, [2024-05-13T03:58:32.885352 #1530759] INFO -- : making enc I, [2024-05-13T03:58:32.895326 #1530759] INFO -- : Successfully built RubyGem I, [2024-05-13T03:58:32.895380 #1530759] INFO -- : Name: power_assert I, [2024-05-13T03:58:32.895391 #1530759] INFO -- : Version: 2.0.4dev I, [2024-05-13T03:58:32.895399 #1530759] INFO -- : File: power_assert-2.0.4dev.gem I, [2024-05-13T03:58:32.899485 #1530759] INFO -- : Extracting bundle gem power_assert-2.0.3... I, [2024-05-13T03:58:32.913111 #1530759] INFO -- : make[1]: Entering directory '/home/opc/ruby/build/master' I, [2024-05-13T03:58:32.913184 #1530759] INFO -- : make[1]: Nothing to be done for 'enc'. I, [2024-05-13T03:58:32.913218 #1530759] INFO -- : make[1]: Leaving directory '/home/opc/ruby/build/master' I, [2024-05-13T03:58:32.928137 #1530759] INFO -- : make[1]: Entering directory '/home/opc/ruby/build/master' I, [2024-05-13T03:58:32.928192 #1530759] INFO -- : make[1]: Nothing to be done for 'srcs'. I, [2024-05-13T03:58:32.928207 #1530759] INFO -- : make[1]: Leaving directory '/home/opc/ruby/build/master' I, [2024-05-13T03:58:32.929013 #1530759] INFO -- : generating transdb.h I, [2024-05-13T03:58:32.999213 #1530759] INFO -- : Try with hash version of bundled gems instead of gems/power_assert-2.0.3.gem. We don't use this gem with release version of Ruby. I, [2024-05-13T03:58:33.010379 #1530759] INFO -- : Unpacked gems/power_assert-2.0.4dev.gem I, [2024-05-13T03:58:33.071641 #1530759] INFO -- : transdb.h unchanged I, [2024-05-13T03:58:33.072986 #1530759] INFO -- : generating makefiles ext/configure-ext.mk I, [2024-05-13T03:58:33.073135 #1530759] INFO -- : making trans I, [2024-05-13T03:58:33.112017 #1530759] INFO -- : ext/configure-ext.mk unchanged I, [2024-05-13T03:58:33.115132 #1530759] INFO -- : make[1]: Entering directory '/home/opc/ruby/build/master' I, [2024-05-13T03:58:33.121783 #1530759] INFO -- : make[1]: Entering directory '/home/opc/ruby/build/master' I, [2024-05-13T03:58:33.121844 #1530759] INFO -- : make[1]: Nothing to be done for 'trans'. I, [2024-05-13T03:58:33.121855 #1530759] INFO -- : make[1]: Leaving directory '/home/opc/ruby/build/master' I, [2024-05-13T03:58:33.295360 #1530759] INFO -- : making encs I, [2024-05-13T03:58:33.347936 #1530759] INFO -- : make[1]: Entering directory '/home/opc/ruby/build/master' I, [2024-05-13T03:58:33.348013 #1530759] INFO -- : make[1]: Nothing to be done for 'encs'. I, [2024-05-13T03:58:33.348024 #1530759] INFO -- : make[1]: Leaving directory '/home/opc/ruby/build/master' I, [2024-05-13T03:58:33.859395 #1530759] INFO -- : make[1]: Leaving directory '/home/opc/ruby/build/master' I, [2024-05-13T03:58:33.860066 #1530759] INFO -- : generating makefile exts.mk I, [2024-05-13T03:58:33.919342 #1530759] INFO -- : exts.mk unchanged I, [2024-05-13T03:58:33.924476 #1530759] INFO -- : make[1]: Entering directory '/home/opc/ruby/build/master' I, [2024-05-13T03:58:34.033705 #1530759] INFO -- : make[2]: Entering directory '/home/opc/ruby/build/master/ext/coverage' I, [2024-05-13T03:58:34.034983 #1530759] INFO -- : make[2]: Entering directory '/home/opc/ruby/build/master/ext/digest' I, [2024-05-13T03:58:34.035223 #1530759] INFO -- : make[2]: Entering directory '/home/opc/ruby/build/master/ext/date' I, [2024-05-13T03:58:34.038345 #1530759] INFO -- : make[2]: Leaving directory '/home/opc/ruby/build/master/ext/coverage' I, [2024-05-13T03:58:34.040658 #1530759] INFO -- : make[2]: Leaving directory '/home/opc/ruby/build/master/ext/date' I, [2024-05-13T03:58:34.043071 #1530759] INFO -- : make[2]: Leaving directory '/home/opc/ruby/build/master/ext/digest' I, [2024-05-13T03:58:34.049795 #1530759] INFO -- : make[2]: Entering directory '/home/opc/ruby/build/master/ext/io/console' I, [2024-05-13T03:58:34.050158 #1530759] INFO -- : make[2]: Entering directory '/home/opc/ruby/build/master/ext/fiddle' I, [2024-05-13T03:58:34.055070 #1530759] INFO -- : make[2]: Leaving directory '/home/opc/ruby/build/master/ext/io/console' I, [2024-05-13T03:58:34.057113 #1530759] INFO -- : make[2]: Entering directory '/home/opc/ruby/build/master/ext/json' I, [2024-05-13T03:58:34.058346 #1530759] INFO -- : make[2]: Leaving directory '/home/opc/ruby/build/master/ext/fiddle' I, [2024-05-13T03:58:34.060838 #1530759] INFO -- : make[2]: Entering directory '/home/opc/ruby/build/master/ext/monitor' I, [2024-05-13T03:58:34.064287 #1530759] INFO -- : make[2]: Leaving directory '/home/opc/ruby/build/master/ext/json' I, [2024-05-13T03:58:34.067239 #1530759] INFO -- : make[2]: Entering directory '/home/opc/ruby/build/master/ext/objspace' I, [2024-05-13T03:58:34.067613 #1530759] INFO -- : make[2]: Leaving directory '/home/opc/ruby/build/master/ext/monitor' I, [2024-05-13T03:58:34.071618 #1530759] INFO -- : make[2]: Entering directory '/home/opc/ruby/build/master/ext/pathname' I, [2024-05-13T03:58:34.073308 #1530759] INFO -- : make[2]: Leaving directory '/home/opc/ruby/build/master/ext/objspace' I, [2024-05-13T03:58:34.075720 #1530759] INFO -- : make[2]: Leaving directory '/home/opc/ruby/build/master/ext/pathname' I, [2024-05-13T03:58:34.079576 #1530759] INFO -- : make[2]: Entering directory '/home/opc/ruby/build/master/ext/psych' I, [2024-05-13T03:58:34.079858 #1530759] INFO -- : make[2]: Entering directory '/home/opc/ruby/build/master/ext/pty' I, [2024-05-13T03:58:34.083934 #1530759] INFO -- : make[2]: Entering directory '/home/opc/ruby/build/master/ext/openssl' I, [2024-05-13T03:58:34.085140 #1530759] INFO -- : make[2]: Leaving directory '/home/opc/ruby/build/master/ext/pty' I, [2024-05-13T03:58:34.099803 #1530759] INFO -- : make[2]: Leaving directory '/home/opc/ruby/build/master/ext/psych' I, [2024-05-13T03:58:34.101805 #1530759] INFO -- : make[2]: Entering directory '/home/opc/ruby/build/master/ext/rubyvm' I, [2024-05-13T03:58:34.103515 #1530759] INFO -- : make[2]: Entering directory '/home/opc/ruby/build/master/ext/ripper' I, [2024-05-13T03:58:34.105529 #1530759] INFO -- : make[2]: Leaving directory '/home/opc/ruby/build/master/ext/rubyvm' I, [2024-05-13T03:58:34.107403 #1530759] INFO -- : make[2]: Leaving directory '/home/opc/ruby/build/master/ext/openssl' I, [2024-05-13T03:58:34.112249 #1530759] INFO -- : make[2]: Leaving directory '/home/opc/ruby/build/master/ext/ripper' I, [2024-05-13T03:58:34.117571 #1530759] INFO -- : make[2]: Entering directory '/home/opc/ruby/build/master/ext/socket' I, [2024-05-13T03:58:34.118551 #1530759] INFO -- : make[2]: Entering directory '/home/opc/ruby/build/master/.bundle/gems/bigdecimal-3.1.7/ext/bigdecimal' I, [2024-05-13T03:58:34.120443 #1530759] INFO -- : make[2]: Entering directory '/home/opc/ruby/build/master/.bundle/gems/bigdecimal-3.1.8/ext/bigdecimal' I, [2024-05-13T03:58:34.128012 #1530759] INFO -- : make[2]: Leaving directory '/home/opc/ruby/build/master/ext/socket' I, [2024-05-13T03:58:34.134594 #1530759] INFO -- : make[2]: Entering directory '/home/opc/ruby/build/master/.bundle/gems/debug-1.9.2/ext/debug' I, [2024-05-13T03:58:34.149952 #1530759] INFO -- : make[2]: Leaving directory '/home/opc/ruby/build/master/.bundle/gems/bigdecimal-3.1.7/ext/bigdecimal' I, [2024-05-13T03:58:34.151787 #1530759] INFO -- : make[2]: Leaving directory '/home/opc/ruby/build/master/.bundle/gems/bigdecimal-3.1.8/ext/bigdecimal' I, [2024-05-13T03:58:34.152510 #1530759] INFO -- : make[2]: Entering directory '/home/opc/ruby/build/master/.bundle/gems/nkf-0.2.0/ext/nkf' I, [2024-05-13T03:58:34.155409 #1530759] INFO -- : make[2]: Entering directory '/home/opc/ruby/build/master/.bundle/gems/racc-1.7.3/ext/racc/cparse' I, [2024-05-13T03:58:34.167119 #1530759] INFO -- : make[2]: Leaving directory '/home/opc/ruby/build/master/.bundle/gems/debug-1.9.2/ext/debug' I, [2024-05-13T03:58:34.175318 #1530759] INFO -- : make[2]: Entering directory '/home/opc/ruby/build/master/.bundle/gems/rbs-3.4.4/ext/rbs_extension' I, [2024-05-13T03:58:34.183925 #1530759] INFO -- : make[2]: Leaving directory '/home/opc/ruby/build/master/.bundle/gems/nkf-0.2.0/ext/nkf' I, [2024-05-13T03:58:34.186978 #1530759] INFO -- : make[2]: Entering directory '/home/opc/ruby/build/master/.bundle/gems/syslog-0.1.2/ext/syslog' I, [2024-05-13T03:58:34.187905 #1530759] INFO -- : make[2]: Leaving directory '/home/opc/ruby/build/master/.bundle/gems/racc-1.7.3/ext/racc/cparse' I, [2024-05-13T03:58:34.209315 #1530759] INFO -- : make[2]: Leaving directory '/home/opc/ruby/build/master/.bundle/gems/rbs-3.4.4/ext/rbs_extension' I, [2024-05-13T03:58:34.214034 #1530759] INFO -- : make[2]: Entering directory '/home/opc/ruby/build/master/ext/digest/sha2' I, [2024-05-13T03:58:34.217416 #1530759] INFO -- : make[2]: Leaving directory '/home/opc/ruby/build/master/.bundle/gems/syslog-0.1.2/ext/syslog' I, [2024-05-13T03:58:34.219248 #1530759] INFO -- : make[2]: Leaving directory '/home/opc/ruby/build/master/ext/digest/sha2' I, [2024-05-13T03:58:34.259704 #1530759] INFO -- : make[2]: Entering directory '/home/opc/ruby/build/master' I, [2024-05-13T03:58:34.342799 #1530759] INFO -- : make[2]: 'ruby' is up to date. I, [2024-05-13T03:58:34.342880 #1530759] INFO -- : make[2]: Leaving directory '/home/opc/ruby/build/master' I, [2024-05-13T03:58:34.343003 #1530759] INFO -- : make[1]: Leaving directory '/home/opc/ruby/build/master' I, [2024-05-13T03:58:34.347463 #1530759] INFO -- : make[1]: Entering directory '/home/opc/ruby/build/master' I, [2024-05-13T03:58:34.347513 #1530759] INFO -- : make[1]: Nothing to be done for 'note'. I, [2024-05-13T03:58:34.347524 #1530759] INFO -- : make[1]: Leaving directory '/home/opc/ruby/build/master' I, [2024-05-13T03:58:34.347642 #1530759] INFO -- : ./miniruby -I/home/opc/ruby/src/master/lib -I. -I.ext/common /home/opc/ruby/src/master/tool/runruby.rb --extout=.ext -- --disable-gems -r./aarch64-linux-fake /home/opc/ruby/src/master/tool/rbinstall.rb --make="make" --dest-dir="" --extout=".ext" --ext-build-dir="./ext" --mflags="-j3 --jobserver-auth=4,5" --make-flags=" -j3 --jobserver-auth=4,5" --data-mode=0644 --prog-mode=0755 --installed-list .installed.list --mantype="doc" --gnumake --install=all --exclude=doc I, [2024-05-13T03:58:34.496059 #1530759] INFO -- : Installing to I, [2024-05-13T03:58:34.496146 #1530759] INFO -- : installing binary commands: /home/opc/ruby/install/master/bin I, [2024-05-13T03:58:34.507767 #1530759] INFO -- : installing base libraries: /home/opc/ruby/install/master/lib I, [2024-05-13T03:58:34.508252 #1530759] INFO -- : installing arch files: /home/opc/ruby/install/master/lib/ruby/3.4.0+0/aarch64-linux I, [2024-05-13T03:58:34.508367 #1530759] INFO -- : installing pkgconfig data: /home/opc/ruby/install/master/lib/pkgconfig I, [2024-05-13T03:58:34.508440 #1530759] INFO -- : installing extension objects: /home/opc/ruby/install/master/lib/ruby/3.4.0+0/aarch64-linux I, [2024-05-13T03:58:34.520938 #1530759] INFO -- : installing extension objects: /home/opc/ruby/install/master/lib/ruby/site_ruby/3.4.0+0/aarch64-linux I, [2024-05-13T03:58:34.520981 #1530759] INFO -- : installing extension objects: /home/opc/ruby/install/master/lib/ruby/vendor_ruby/3.4.0+0/aarch64-linux I, [2024-05-13T03:58:34.521071 #1530759] INFO -- : installing extension headers: /home/opc/ruby/install/master/include/ruby-3.4.0+0/aarch64-linux I, [2024-05-13T03:58:34.521389 #1530759] INFO -- : installing extension scripts: /home/opc/ruby/install/master/lib/ruby/3.4.0+0 I, [2024-05-13T03:58:34.530428 #1530759] INFO -- : installing extension scripts: /home/opc/ruby/install/master/lib/ruby/site_ruby/3.4.0+0 I, [2024-05-13T03:58:34.530459 #1530759] INFO -- : installing extension scripts: /home/opc/ruby/install/master/lib/ruby/vendor_ruby/3.4.0+0 I, [2024-05-13T03:58:34.530470 #1530759] INFO -- : installing extension headers: /home/opc/ruby/install/master/include/ruby-3.4.0+0/ruby I, [2024-05-13T03:58:34.530598 #1530759] INFO -- : installing command scripts: /home/opc/ruby/install/master/bin I, [2024-05-13T03:58:34.530726 #1530759] INFO -- : installing library scripts: /home/opc/ruby/install/master/lib/ruby/3.4.0+0 I, [2024-05-13T03:58:34.614806 #1530759] INFO -- : installing common headers: /home/opc/ruby/install/master/include/ruby-3.4.0+0 I, [2024-05-13T03:58:34.630373 #1530759] INFO -- : installing manpages: /home/opc/ruby/install/master/share/man/man1 I, [2024-05-13T03:58:34.630643 #1530759] INFO -- : installing default gems from lib: /home/opc/ruby/install/master/lib/ruby/gems/3.4.0+0 I, [2024-05-13T03:58:34.670566 #1530759] INFO -- : benchmark 0.3.0 I, [2024-05-13T03:58:34.683998 #1530759] INFO -- : bundler 2.6.0.dev I, [2024-05-13T03:58:34.688871 #1530759] INFO -- : cgi 0.4.1 I, [2024-05-13T03:58:34.690061 #1530759] INFO -- : delegate 0.3.1 I, [2024-05-13T03:58:34.691139 #1530759] INFO -- : did_you_mean 1.6.3 I, [2024-05-13T03:58:34.692411 #1530759] INFO -- : english 0.8.0 I, [2024-05-13T03:58:34.693657 #1530759] INFO -- : erb 4.0.4 I, [2024-05-13T03:58:34.696183 #1530759] INFO -- : error_highlight 0.6.0 I, [2024-05-13T03:58:34.697326 #1530759] INFO -- : fileutils 1.7.2 I, [2024-05-13T03:58:34.698420 #1530759] INFO -- : find 0.2.0 I, [2024-05-13T03:58:34.699503 #1530759] INFO -- : forwardable 1.3.3 I, [2024-05-13T03:58:34.700621 #1530759] INFO -- : ipaddr 1.2.6 I, [2024-05-13T03:58:34.701761 #1530759] INFO -- : irb 1.13.1 I, [2024-05-13T03:58:34.704366 #1530759] INFO -- : logger 1.6.0 I, [2024-05-13T03:58:34.706816 #1530759] INFO -- : net-http 0.4.1 I, [2024-05-13T03:58:34.708317 #1530759] INFO -- : net-protocol 0.2.2 I, [2024-05-13T03:58:34.709510 #1530759] INFO -- : open-uri 0.4.1 I, [2024-05-13T03:58:34.710664 #1530759] INFO -- : open3 0.2.1 I, [2024-05-13T03:58:34.711754 #1530759] INFO -- : optparse 0.5.0 I, [2024-05-13T03:58:34.712908 #1530759] INFO -- : ostruct 0.6.0 I, [2024-05-13T03:58:34.714018 #1530759] INFO -- : pp 0.5.0 I, [2024-05-13T03:58:34.715154 #1530759] INFO -- : prettyprint 0.2.0 I, [2024-05-13T03:58:34.716273 #1530759] INFO -- : prism 0.29.0 I, [2024-05-13T03:58:34.717531 #1530759] INFO -- : pstore 0.1.3 I, [2024-05-13T03:58:34.718788 #1530759] INFO -- : rdoc 6.6.3.1 I, [2024-05-13T03:58:34.722713 #1530759] INFO -- : readline 0.0.4 I, [2024-05-13T03:58:34.723809 #1530759] INFO -- : reline 0.5.6 I, [2024-05-13T03:58:34.725001 #1530759] INFO -- : resolv 0.4.0 I, [2024-05-13T03:58:34.726156 #1530759] INFO -- : ruby2_keywords 0.0.5 I, [2024-05-13T03:58:34.727253 #1530759] INFO -- : securerandom 0.3.1 I, [2024-05-13T03:58:34.728367 #1530759] INFO -- : set 1.1.0 I, [2024-05-13T03:58:34.729556 #1530759] INFO -- : shellwords 0.2.0 I, [2024-05-13T03:58:34.730676 #1530759] INFO -- : singleton 0.2.0 I, [2024-05-13T03:58:34.731786 #1530759] INFO -- : syntax_suggest 2.0.0 I, [2024-05-13T03:58:34.736059 #1530759] INFO -- : tempfile 0.2.1 I, [2024-05-13T03:58:34.737250 #1530759] INFO -- : time 0.3.0 I, [2024-05-13T03:58:34.738402 #1530759] INFO -- : timeout 0.4.1 I, [2024-05-13T03:58:34.739519 #1530759] INFO -- : tmpdir 0.2.0 I, [2024-05-13T03:58:34.740691 #1530759] INFO -- : tsort 0.2.0 I, [2024-05-13T03:58:34.741852 #1530759] INFO -- : un 0.3.0 I, [2024-05-13T03:58:34.742956 #1530759] INFO -- : uri 0.13.0 I, [2024-05-13T03:58:34.744147 #1530759] INFO -- : weakref 0.1.3 I, [2024-05-13T03:58:34.745341 #1530759] INFO -- : yaml 0.3.0 I, [2024-05-13T03:58:34.746490 #1530759] INFO -- : installing default gems from ext: /home/opc/ruby/install/master/lib/ruby/gems/3.4.0+0 I, [2024-05-13T03:58:34.757712 #1530759] INFO -- : date 3.3.4 I, [2024-05-13T03:58:34.758941 #1530759] INFO -- : digest 3.1.1 I, [2024-05-13T03:58:34.760082 #1530759] INFO -- : etc 1.4.3 I, [2024-05-13T03:58:34.761414 #1530759] INFO -- : fcntl 1.1.0 I, [2024-05-13T03:58:34.762568 #1530759] INFO -- : fiddle 1.1.3 I, [2024-05-13T03:58:34.763716 #1530759] INFO -- : io-console 0.7.2 I, [2024-05-13T03:58:34.764877 #1530759] INFO -- : io-nonblock 0.3.0 I, [2024-05-13T03:58:34.766055 #1530759] INFO -- : io-wait 0.3.1 I, [2024-05-13T03:58:34.767174 #1530759] INFO -- : json 2.7.2 I, [2024-05-13T03:58:34.768665 #1530759] INFO -- : openssl 3.2.0 I, [2024-05-13T03:58:34.770361 #1530759] INFO -- : pathname 0.3.0 I, [2024-05-13T03:58:34.771499 #1530759] INFO -- : psych 5.1.2 I, [2024-05-13T03:58:34.772776 #1530759] INFO -- : stringio 3.1.1 I, [2024-05-13T03:58:34.773997 #1530759] INFO -- : strscan 3.1.1 I, [2024-05-13T03:58:34.775144 #1530759] INFO -- : zlib 3.1.0 I, [2024-05-13T03:58:34.776079 #1530759] INFO -- : installing bundled gems: /home/opc/ruby/install/master/lib/ruby/gems/3.4.0+0 I, [2024-05-13T03:58:34.776764 #1530759] INFO -- : minitest 5.22.3 I, [2024-05-13T03:58:34.790862 #1530759] INFO -- : rake 13.2.1 I, [2024-05-13T03:58:34.804350 #1530759] INFO -- : test-unit 3.6.2 I, [2024-05-13T03:58:34.820595 #1530759] INFO -- : rexml 3.2.6 I, [2024-05-13T03:58:34.834310 #1530759] INFO -- : rss 0.3.0 I, [2024-05-13T03:58:34.844092 #1530759] INFO -- : net-ftp 0.3.4 I, [2024-05-13T03:58:34.847760 #1530759] INFO -- : net-imap 0.4.11 I, [2024-05-13T03:58:34.864873 #1530759] INFO -- : net-pop 0.1.2 I, [2024-05-13T03:58:34.867747 #1530759] INFO -- : net-smtp 0.5.0 I, [2024-05-13T03:58:34.870956 #1530759] INFO -- : matrix 0.4.2 I, [2024-05-13T03:58:34.876620 #1530759] INFO -- : prime 0.1.2 I, [2024-05-13T03:58:34.887144 #1530759] INFO -- : rbs 3.4.4 I, [2024-05-13T03:58:34.985204 #1530759] INFO -- : typeprof 0.21.11 I, [2024-05-13T03:58:34.993059 #1530759] INFO -- : debug 1.9.2 I, [2024-05-13T03:58:35.003249 #1530759] INFO -- : racc 1.7.3 I, [2024-05-13T03:58:35.012861 #1530759] INFO -- : mutex_m 0.2.0 I, [2024-05-13T03:58:35.016777 #1530759] INFO -- : getoptlong 0.2.1 I, [2024-05-13T03:58:35.021218 #1530759] INFO -- : base64 0.2.0 I, [2024-05-13T03:58:35.023908 #1530759] INFO -- : bigdecimal 3.1.8 I, [2024-05-13T03:58:35.029771 #1530759] INFO -- : observer 0.1.2 I, [2024-05-13T03:58:35.032689 #1530759] INFO -- : abbrev 0.1.2 I, [2024-05-13T03:58:35.035611 #1530759] INFO -- : resolv-replace 0.1.1 I, [2024-05-13T03:58:35.038600 #1530759] INFO -- : rinda 0.2.0 I, [2024-05-13T03:58:35.042013 #1530759] INFO -- : drb 2.2.1 I, [2024-05-13T03:58:35.046491 #1530759] INFO -- : nkf 0.2.0 I, [2024-05-13T03:58:35.054003 #1530759] INFO -- : syslog 0.1.2 I, [2024-05-13T03:58:35.058305 #1530759] INFO -- : csv 3.3.0 I, [2024-05-13T03:58:35.067301 #1530759] INFO -- : installing bundled gem cache: /home/opc/ruby/install/master/lib/ruby/gems/3.4.0+0/cache I, [2024-05-13T03:58:35.069231 #1530759] INFO -- : skipped bundled gems: I, [2024-05-13T03:58:35.069263 #1530759] INFO -- : power_assert-2.0.4dev.gem not found in bundled_gems I, [2024-05-13T03:58:35.071945 #1530759] INFO -- : $$$[end] "make install -j3" exit with 0. I, [2024-05-13T03:58:35.072088 #1530759] INFO -- : $$$[beg] make yes-btest TESTOPTS='-q -j3' I, [2024-05-13T03:58:57.828367 #1530759] INFO -- : PASS all 1936 tests E, [2024-05-13T03:58:57.830459 #1530759] ERROR -- : I, [2024-05-13T03:58:57.830597 #1530759] INFO -- : $$$[end] "make yes-btest TESTOPTS='-q -j3'" exit with 0. I, [2024-05-13T03:58:57.830745 #1530759] INFO -- : $$$[beg] make yes-test-basic TESTS='-j3' I, [2024-05-13T03:58:57.923119 #1530759] INFO -- : BASERUBY = /usr/local/bin/ruby --disable=gems I, [2024-05-13T03:58:57.923186 #1530759] INFO -- : CC = gcc I, [2024-05-13T03:58:57.923198 #1530759] INFO -- : LD = ld I, [2024-05-13T03:58:57.923207 #1530759] INFO -- : LDSHARED = gcc -shared I, [2024-05-13T03:58:57.923217 #1530759] INFO -- : CFLAGS = -O3 -fno-fast-math -ggdb3 -Wall -Wextra -Wdeprecated-declarations -Wdiv-by-zero -Wduplicated-cond -Wimplicit-function-declaration -Wimplicit-int -Wpointer-arith -Wwrite-strings -Wold-style-definition -Wimplicit-fallthrough=0 -Wmissing-noreturn -Wno-cast-function-type -Wno-constant-logical-operand -Wno-long-long -Wno-missing-field-initializers -Wno-overlength-strings -Wno-packed-bitfield-compat -Wno-parentheses-equality -Wno-self-assign -Wno-tautological-compare -Wno-unused-parameter -Wno-unused-value -Wsuggest-attribute=format -Wsuggest-attribute=noreturn -Wunused-variable -Wmisleading-indentation -Wundef I, [2024-05-13T03:58:57.923229 #1530759] INFO -- : XCFLAGS = -U_FORTIFY_SOURCE -D_FORTIFY_SOURCE=2 -fstack-protector-strong -msign-return-address=all -fno-strict-overflow -fvisibility=hidden -fexcess-precision=standard -DRUBY_EXPORT -fPIE -I. -I.ext/include/aarch64-linux -I/home/opc/ruby/src/master/include -I/home/opc/ruby/src/master -I/home/opc/ruby/src/master/prism -I/home/opc/ruby/src/master/enc/unicode/15.0.0 I, [2024-05-13T03:58:57.923238 #1530759] INFO -- : CPPFLAGS = I, [2024-05-13T03:58:57.923246 #1530759] INFO -- : DLDFLAGS = -Wl,--compress-debug-sections=zlib -fstack-protector-strong -pie I, [2024-05-13T03:58:57.923255 #1530759] INFO -- : SOLIBS = -lz -lrt -lrt -ldl -lcrypt -lm -lpthread I, [2024-05-13T03:58:57.923263 #1530759] INFO -- : LANG = en_US.UTF-8 I, [2024-05-13T03:58:57.923271 #1530759] INFO -- : LC_ALL = I, [2024-05-13T03:58:57.923279 #1530759] INFO -- : LC_CTYPE = I, [2024-05-13T03:58:57.923288 #1530759] INFO -- : MFLAGS = I, [2024-05-13T03:58:57.923295 #1530759] INFO -- : RUSTC = rustc I, [2024-05-13T03:58:57.923304 #1530759] INFO -- : YJIT_RUSTC_ARGS = --crate-name=yjit --crate-type=staticlib --edition=2021 -g -C lto=thin -C opt-level=3 -C overflow-checks=on '--out-dir=/home/opc/ruby/build/master/yjit/target/release/' /home/opc/ruby/src/master/yjit/src/lib.rs I, [2024-05-13T03:58:57.924018 #1530759] INFO -- : gcc (GCC) 8.5.0 20210514 (Red Hat 8.5.0-10.1.0.1) I, [2024-05-13T03:58:57.924036 #1530759] INFO -- : Copyright (C) 2018 Free Software Foundation, Inc. I, [2024-05-13T03:58:57.924045 #1530759] INFO -- : This is free software; see the source for copying conditions. There is NO I, [2024-05-13T03:58:57.924054 #1530759] INFO -- : warranty; not even for MERCHANTABILITY or FITNESS FOR A PARTICULAR PURPOSE. I, [2024-05-13T03:58:57.924062 #1530759] INFO -- : I, [2024-05-13T03:58:58.080330 #1530759] INFO -- : Checking leaked global symbols...none I, [2024-05-13T03:58:58.134039 #1530759] INFO -- : /home/opc/ruby/src/master/basictest/test.rb:assignment ....................................................................................................................................................................................................................................................................................................................................................................................OK 372 I, [2024-05-13T03:58:58.134120 #1530759] INFO -- : /home/opc/ruby/src/master/basictest/test.rb:condition ..OK 2 I, [2024-05-13T03:58:58.134136 #1530759] INFO -- : /home/opc/ruby/src/master/basictest/test.rb:if/unless ...OK 3 I, [2024-05-13T03:58:58.134188 #1530759] INFO -- : /home/opc/ruby/src/master/basictest/test.rb:case .....OK 5 I, [2024-05-13T03:58:58.134777 #1530759] INFO -- : /home/opc/ruby/src/master/basictest/test.rb:while/until ........OK 8 I, [2024-05-13T03:58:58.134905 #1530759] INFO -- : /home/opc/ruby/src/master/basictest/test.rb:exception ..........OK 10 I, [2024-05-13T03:58:58.135550 #1530759] INFO -- : /home/opc/ruby/src/master/basictest/test.rb:array .......................................OK 39 I, [2024-05-13T03:58:58.135822 #1530759] INFO -- : /home/opc/ruby/src/master/basictest/test.rb:hash ...........................OK 27 I, [2024-05-13T03:58:58.137772 #1530759] INFO -- : /home/opc/ruby/src/master/basictest/test.rb:iterator ...........................................................................................................OK 107 I, [2024-05-13T03:58:58.138539 #1530759] INFO -- : /home/opc/ruby/src/master/basictest/test.rb:float ................................................................................OK 80 I, [2024-05-13T03:58:58.142105 #1530759] INFO -- : /home/opc/ruby/src/master/basictest/test.rb:bignum ...............................OK 31 I, [2024-05-13T03:58:58.143702 #1530759] INFO -- : /home/opc/ruby/src/master/basictest/test.rb:string & char ..............................................................OK 62 I, [2024-05-13T03:58:58.143782 #1530759] INFO -- : /home/opc/ruby/src/master/basictest/test.rb:assignment ..........OK 10 I, [2024-05-13T03:58:58.143858 #1530759] INFO -- : /home/opc/ruby/src/master/basictest/test.rb:call ......OK 6 I, [2024-05-13T03:58:58.144040 #1530759] INFO -- : /home/opc/ruby/src/master/basictest/test.rb:proc .........OK 9 I, [2024-05-13T03:58:58.244358 #1530759] INFO -- : /home/opc/ruby/src/master/basictest/test.rb:signal ..OK 2 I, [2024-05-13T03:58:58.245892 #1530759] INFO -- : /home/opc/ruby/src/master/basictest/test.rb:eval ...........................OK 27 I, [2024-05-13T03:58:58.376738 #1530759] INFO -- : /home/opc/ruby/src/master/basictest/test.rb:system ........OK 8 I, [2024-05-13T03:58:58.376823 #1530759] INFO -- : /home/opc/ruby/src/master/basictest/test.rb:const .....OK 5 I, [2024-05-13T03:58:58.376992 #1530759] INFO -- : /home/opc/ruby/src/master/basictest/test.rb:clone .....OK 5 I, [2024-05-13T03:58:58.377557 #1530759] INFO -- : /home/opc/ruby/src/master/basictest/test.rb:marshal ....OK 4 I, [2024-05-13T03:58:58.377650 #1530759] INFO -- : /home/opc/ruby/src/master/basictest/test.rb:pack ....OK 4 I, [2024-05-13T03:58:58.377696 #1530759] INFO -- : /home/opc/ruby/src/master/basictest/test.rb:math ..OK 2 I, [2024-05-13T03:58:58.377756 #1530759] INFO -- : /home/opc/ruby/src/master/basictest/test.rb:struct ......OK 6 I, [2024-05-13T03:58:58.377922 #1530759] INFO -- : /home/opc/ruby/src/master/basictest/test.rb:variable ............OK 12 I, [2024-05-13T03:58:58.377964 #1530759] INFO -- : /home/opc/ruby/src/master/basictest/test.rb:trace ...OK 3 I, [2024-05-13T03:58:58.378092 #1530759] INFO -- : /home/opc/ruby/src/master/basictest/test.rb:defined? ............OK 12 I, [2024-05-13T03:58:58.378180 #1530759] INFO -- : /home/opc/ruby/src/master/basictest/test.rb:alias ......OK 6 I, [2024-05-13T03:58:58.378697 #1530759] INFO -- : /home/opc/ruby/src/master/basictest/test.rb:path .......................OK 23 I, [2024-05-13T03:58:58.445924 #1530759] INFO -- : /home/opc/ruby/src/master/basictest/test.rb:gc ....OK 4 I, [2024-05-13T03:58:58.448211 #1530759] INFO -- : I, [2024-05-13T03:58:58.448245 #1530759] INFO -- : test succeeded I, [2024-05-13T03:58:58.448917 #1530759] INFO -- : $$$[end] "make yes-test-basic TESTS='-j3'" exit with 0. I, [2024-05-13T03:58:58.449162 #1530759] INFO -- : $$$[beg] make yes-test-all TESTOPTS='--stderr-on-failure' TESTS='-j3' I, [2024-05-13T03:58:58.574265 #1530759] INFO -- : BASERUBY = /usr/local/bin/ruby --disable=gems I, [2024-05-13T03:58:58.574363 #1530759] INFO -- : CC = gcc I, [2024-05-13T03:58:58.574375 #1530759] INFO -- : LD = ld I, [2024-05-13T03:58:58.574384 #1530759] INFO -- : LDSHARED = gcc -shared I, [2024-05-13T03:58:58.574397 #1530759] INFO -- : CFLAGS = -O3 -fno-fast-math -ggdb3 -Wall -Wextra -Wdeprecated-declarations -Wdiv-by-zero -Wduplicated-cond -Wimplicit-function-declaration -Wimplicit-int -Wpointer-arith -Wwrite-strings -Wold-style-definition -Wimplicit-fallthrough=0 -Wmissing-noreturn -Wno-cast-function-type -Wno-constant-logical-operand -Wno-long-long -Wno-missing-field-initializers -Wno-overlength-strings -Wno-packed-bitfield-compat -Wno-parentheses-equality -Wno-self-assign -Wno-tautological-compare -Wno-unused-parameter -Wno-unused-value -Wsuggest-attribute=format -Wsuggest-attribute=noreturn -Wunused-variable -Wmisleading-indentation -Wundef I, [2024-05-13T03:58:58.574406 #1530759] INFO -- : XCFLAGS = -U_FORTIFY_SOURCE -D_FORTIFY_SOURCE=2 -fstack-protector-strong -msign-return-address=all -fno-strict-overflow -fvisibility=hidden -fexcess-precision=standard -DRUBY_EXPORT -fPIE -I. -I.ext/include/aarch64-linux -I/home/opc/ruby/src/master/include -I/home/opc/ruby/src/master -I/home/opc/ruby/src/master/prism -I/home/opc/ruby/src/master/enc/unicode/15.0.0 I, [2024-05-13T03:58:58.574416 #1530759] INFO -- : CPPFLAGS = I, [2024-05-13T03:58:58.574424 #1530759] INFO -- : DLDFLAGS = -Wl,--compress-debug-sections=zlib -fstack-protector-strong -pie I, [2024-05-13T03:58:58.574433 #1530759] INFO -- : SOLIBS = -lz -lrt -lrt -ldl -lcrypt -lm -lpthread I, [2024-05-13T03:58:58.574441 #1530759] INFO -- : LANG = en_US.UTF-8 I, [2024-05-13T03:58:58.574450 #1530759] INFO -- : LC_ALL = I, [2024-05-13T03:58:58.574458 #1530759] INFO -- : LC_CTYPE = I, [2024-05-13T03:58:58.574466 #1530759] INFO -- : MFLAGS = I, [2024-05-13T03:58:58.574474 #1530759] INFO -- : RUSTC = rustc I, [2024-05-13T03:58:58.574482 #1530759] INFO -- : YJIT_RUSTC_ARGS = --crate-name=yjit --crate-type=staticlib --edition=2021 -g -C lto=thin -C opt-level=3 -C overflow-checks=on '--out-dir=/home/opc/ruby/build/master/yjit/target/release/' /home/opc/ruby/src/master/yjit/src/lib.rs I, [2024-05-13T03:58:58.575273 #1530759] INFO -- : gcc (GCC) 8.5.0 20210514 (Red Hat 8.5.0-10.1.0.1) I, [2024-05-13T03:58:58.575296 #1530759] INFO -- : Copyright (C) 2018 Free Software Foundation, Inc. I, [2024-05-13T03:58:58.575306 #1530759] INFO -- : This is free software; see the source for copying conditions. There is NO I, [2024-05-13T03:58:58.575315 #1530759] INFO -- : warranty; not even for MERCHANTABILITY or FITNESS FOR A PARTICULAR PURPOSE. I, [2024-05-13T03:58:58.575323 #1530759] INFO -- : I, [2024-05-13T03:58:58.577461 #1530759] INFO -- : generating enc.mk I, [2024-05-13T03:58:58.816420 #1530759] INFO -- : generating encdb.h I, [2024-05-13T03:58:58.853149 #1530759] INFO -- : encdb.h unchanged I, [2024-05-13T03:58:58.854539 #1530759] INFO -- : making enc I, [2024-05-13T03:58:58.881906 #1530759] INFO -- : make[1]: Entering directory '/home/opc/ruby/build/master' I, [2024-05-13T03:58:58.881948 #1530759] INFO -- : make[1]: Nothing to be done for 'enc'. I, [2024-05-13T03:58:58.881958 #1530759] INFO -- : make[1]: Leaving directory '/home/opc/ruby/build/master' I, [2024-05-13T03:58:58.882772 #1530759] INFO -- : making srcs under enc I, [2024-05-13T03:58:58.924527 #1530759] INFO -- : make[1]: Entering directory '/home/opc/ruby/build/master' I, [2024-05-13T03:58:58.924591 #1530759] INFO -- : make[1]: Nothing to be done for 'srcs'. I, [2024-05-13T03:58:58.924602 #1530759] INFO -- : make[1]: Leaving directory '/home/opc/ruby/build/master' I, [2024-05-13T03:58:58.925762 #1530759] INFO -- : generating transdb.h I, [2024-05-13T03:58:59.070054 #1530759] INFO -- : transdb.h unchanged I, [2024-05-13T03:58:59.071526 #1530759] INFO -- : making trans I, [2024-05-13T03:58:59.120460 #1530759] INFO -- : make[1]: Entering directory '/home/opc/ruby/build/master' I, [2024-05-13T03:58:59.120545 #1530759] INFO -- : make[1]: Nothing to be done for 'trans'. I, [2024-05-13T03:58:59.120556 #1530759] INFO -- : make[1]: Leaving directory '/home/opc/ruby/build/master' I, [2024-05-13T03:58:59.121517 #1530759] INFO -- : making encs I, [2024-05-13T03:58:59.174027 #1530759] INFO -- : make[1]: Entering directory '/home/opc/ruby/build/master' I, [2024-05-13T03:58:59.174100 #1530759] INFO -- : make[1]: Nothing to be done for 'encs'. I, [2024-05-13T03:58:59.174111 #1530759] INFO -- : make[1]: Leaving directory '/home/opc/ruby/build/master' I, [2024-05-13T03:58:59.176108 #1530759] INFO -- : generating makefiles ext/configure-ext.mk I, [2024-05-13T03:58:59.216004 #1530759] INFO -- : ext/configure-ext.mk updated I, [2024-05-13T03:58:59.219879 #1530759] INFO -- : make[1]: Entering directory '/home/opc/ruby/build/master' I, [2024-05-13T03:59:01.293202 #1530759] INFO -- : make[1]: Leaving directory '/home/opc/ruby/build/master' I, [2024-05-13T03:59:01.293970 #1530759] INFO -- : generating makefile exts.mk I, [2024-05-13T03:59:01.352605 #1530759] INFO -- : exts.mk unchanged I, [2024-05-13T03:59:01.357531 #1530759] INFO -- : make[1]: Entering directory '/home/opc/ruby/build/master' I, [2024-05-13T03:59:01.660030 #1530759] INFO -- : make[2]: Entering directory '/home/opc/ruby/build/master/ext/coverage' I, [2024-05-13T03:59:01.664753 #1530759] INFO -- : make[2]: Leaving directory '/home/opc/ruby/build/master/ext/coverage' I, [2024-05-13T03:59:01.670468 #1530759] INFO -- : make[2]: Entering directory '/home/opc/ruby/build/master/ext/date' I, [2024-05-13T03:59:01.675750 #1530759] INFO -- : make[2]: Leaving directory '/home/opc/ruby/build/master/ext/date' I, [2024-05-13T03:59:01.679274 #1530759] INFO -- : make[2]: Entering directory '/home/opc/ruby/build/master/ext/digest' I, [2024-05-13T03:59:01.688166 #1530759] INFO -- : make[2]: Leaving directory '/home/opc/ruby/build/master/ext/digest' I, [2024-05-13T03:59:01.711212 #1530759] INFO -- : make[2]: Entering directory '/home/opc/ruby/build/master/ext/digest/sha2' I, [2024-05-13T03:59:01.716188 #1530759] INFO -- : make[2]: Leaving directory '/home/opc/ruby/build/master/ext/digest/sha2' I, [2024-05-13T03:59:01.734196 #1530759] INFO -- : make[2]: Entering directory '/home/opc/ruby/build/master/ext/fiddle' I, [2024-05-13T03:59:01.744342 #1530759] INFO -- : make[2]: Leaving directory '/home/opc/ruby/build/master/ext/fiddle' I, [2024-05-13T03:59:01.748756 #1530759] INFO -- : make[2]: Entering directory '/home/opc/ruby/build/master/ext/io/console' I, [2024-05-13T03:59:01.753219 #1530759] INFO -- : make[2]: Leaving directory '/home/opc/ruby/build/master/ext/io/console' I, [2024-05-13T03:59:01.764442 #1530759] INFO -- : make[2]: Entering directory '/home/opc/ruby/build/master/ext/json' I, [2024-05-13T03:59:01.774027 #1530759] INFO -- : make[2]: Leaving directory '/home/opc/ruby/build/master/ext/json' I, [2024-05-13T03:59:01.787196 #1530759] INFO -- : make[2]: Entering directory '/home/opc/ruby/build/master/ext/monitor' I, [2024-05-13T03:59:01.791453 #1530759] INFO -- : make[2]: Leaving directory '/home/opc/ruby/build/master/ext/monitor' I, [2024-05-13T03:59:01.797516 #1530759] INFO -- : make[2]: Entering directory '/home/opc/ruby/build/master/ext/objspace' I, [2024-05-13T03:59:01.803524 #1530759] INFO -- : make[2]: Leaving directory '/home/opc/ruby/build/master/ext/objspace' I, [2024-05-13T03:59:01.822441 #1530759] INFO -- : make[2]: Entering directory '/home/opc/ruby/build/master/ext/openssl' I, [2024-05-13T03:59:01.844207 #1530759] INFO -- : make[2]: Leaving directory '/home/opc/ruby/build/master/ext/openssl' I, [2024-05-13T03:59:01.848624 #1530759] INFO -- : make[2]: Entering directory '/home/opc/ruby/build/master/ext/pathname' I, [2024-05-13T03:59:01.852929 #1530759] INFO -- : make[2]: Leaving directory '/home/opc/ruby/build/master/ext/pathname' I, [2024-05-13T03:59:01.859236 #1530759] INFO -- : make[2]: Entering directory '/home/opc/ruby/build/master/ext/psych' I, [2024-05-13T03:59:01.880778 #1530759] INFO -- : make[2]: Leaving directory '/home/opc/ruby/build/master/ext/psych' I, [2024-05-13T03:59:01.885344 #1530759] INFO -- : make[2]: Entering directory '/home/opc/ruby/build/master/ext/pty' I, [2024-05-13T03:59:01.889895 #1530759] INFO -- : make[2]: Leaving directory '/home/opc/ruby/build/master/ext/pty' I, [2024-05-13T03:59:01.903382 #1530759] INFO -- : make[2]: Entering directory '/home/opc/ruby/build/master/ext/ripper' I, [2024-05-13T03:59:01.911167 #1530759] INFO -- : make[2]: Leaving directory '/home/opc/ruby/build/master/ext/ripper' I, [2024-05-13T03:59:01.913153 #1530759] INFO -- : make[2]: Entering directory '/home/opc/ruby/build/master/ext/rubyvm' I, [2024-05-13T03:59:01.916639 #1530759] INFO -- : make[2]: Leaving directory '/home/opc/ruby/build/master/ext/rubyvm' I, [2024-05-13T03:59:01.928762 #1530759] INFO -- : make[2]: Entering directory '/home/opc/ruby/build/master/ext/socket' I, [2024-05-13T03:59:01.939540 #1530759] INFO -- : make[2]: Leaving directory '/home/opc/ruby/build/master/ext/socket' I, [2024-05-13T03:59:01.955165 #1530759] INFO -- : make[2]: Entering directory '/home/opc/ruby/build/master/.bundle/gems/bigdecimal-3.1.7/ext/bigdecimal' I, [2024-05-13T03:59:01.985841 #1530759] INFO -- : make[2]: Leaving directory '/home/opc/ruby/build/master/.bundle/gems/bigdecimal-3.1.7/ext/bigdecimal' I, [2024-05-13T03:59:01.988547 #1530759] INFO -- : make[2]: Entering directory '/home/opc/ruby/build/master/.bundle/gems/bigdecimal-3.1.8/ext/bigdecimal' I, [2024-05-13T03:59:02.020435 #1530759] INFO -- : make[2]: Leaving directory '/home/opc/ruby/build/master/.bundle/gems/bigdecimal-3.1.8/ext/bigdecimal' I, [2024-05-13T03:59:02.023136 #1530759] INFO -- : make[2]: Entering directory '/home/opc/ruby/build/master/.bundle/gems/debug-1.9.2/ext/debug' I, [2024-05-13T03:59:02.053755 #1530759] INFO -- : make[2]: Leaving directory '/home/opc/ruby/build/master/.bundle/gems/debug-1.9.2/ext/debug' I, [2024-05-13T03:59:02.056252 #1530759] INFO -- : make[2]: Entering directory '/home/opc/ruby/build/master/.bundle/gems/nkf-0.2.0/ext/nkf' I, [2024-05-13T03:59:02.086468 #1530759] INFO -- : make[2]: Leaving directory '/home/opc/ruby/build/master/.bundle/gems/nkf-0.2.0/ext/nkf' I, [2024-05-13T03:59:02.089150 #1530759] INFO -- : make[2]: Entering directory '/home/opc/ruby/build/master/.bundle/gems/racc-1.7.3/ext/racc/cparse' I, [2024-05-13T03:59:02.120087 #1530759] INFO -- : make[2]: Leaving directory '/home/opc/ruby/build/master/.bundle/gems/racc-1.7.3/ext/racc/cparse' I, [2024-05-13T03:59:02.123140 #1530759] INFO -- : make[2]: Entering directory '/home/opc/ruby/build/master/.bundle/gems/rbs-3.4.4/ext/rbs_extension' I, [2024-05-13T03:59:02.153457 #1530759] INFO -- : make[2]: Leaving directory '/home/opc/ruby/build/master/.bundle/gems/rbs-3.4.4/ext/rbs_extension' I, [2024-05-13T03:59:02.155975 #1530759] INFO -- : make[2]: Entering directory '/home/opc/ruby/build/master/.bundle/gems/syslog-0.1.2/ext/syslog' I, [2024-05-13T03:59:02.187339 #1530759] INFO -- : make[2]: Leaving directory '/home/opc/ruby/build/master/.bundle/gems/syslog-0.1.2/ext/syslog' I, [2024-05-13T03:59:02.225751 #1530759] INFO -- : make[2]: Entering directory '/home/opc/ruby/build/master' I, [2024-05-13T03:59:02.309248 #1530759] INFO -- : make[2]: 'ruby' is up to date. I, [2024-05-13T03:59:02.309324 #1530759] INFO -- : make[2]: Leaving directory '/home/opc/ruby/build/master' I, [2024-05-13T03:59:02.309690 #1530759] INFO -- : make[1]: Leaving directory '/home/opc/ruby/build/master' I, [2024-05-13T03:59:02.314048 #1530759] INFO -- : make[1]: Entering directory '/home/opc/ruby/build/master' I, [2024-05-13T03:59:02.314106 #1530759] INFO -- : make[1]: Nothing to be done for 'note'. I, [2024-05-13T03:59:02.314117 #1530759] INFO -- : make[1]: Leaving directory '/home/opc/ruby/build/master' I, [2024-05-13T03:59:02.427133 #1530759] INFO -- : Run options: I, [2024-05-13T03:59:02.427211 #1530759] INFO -- : --seed=53996 I, [2024-05-13T03:59:02.427223 #1530759] INFO -- : "--ruby=./miniruby -I/home/opc/ruby/src/master/lib -I. -I.ext/common /home/opc/ruby/src/master/tool/runruby.rb --extout=.ext -- --disable-gems" I, [2024-05-13T03:59:02.427233 #1530759] INFO -- : --excludes-dir=/home/opc/ruby/src/master/test/.excludes I, [2024-05-13T03:59:02.427242 #1530759] INFO -- : --name=!/memory_leak/ I, [2024-05-13T03:59:02.427250 #1530759] INFO -- : --stderr-on-failure I, [2024-05-13T03:59:02.427258 #1530759] INFO -- : -j3 I, [2024-05-13T03:59:02.427266 #1530759] INFO -- : I, [2024-05-13T03:59:02.427275 #1530759] INFO -- : # Running tests: I, [2024-05-13T03:59:02.427283 #1530759] INFO -- : I, [2024-05-13T03:59:02.565339 #1530759] INFO -- : [ 1/885] 1571634=test_severity I, [2024-05-13T03:59:02.568925 #1530759] INFO -- : [ 2/885] 1571636=test_ractor I, [2024-05-13T03:59:02.575974 #1530759] INFO -- : [ 3/885] 1571635=test_case I, [2024-05-13T03:59:02.578644 #1530759] INFO -- : [ 4/885] 1571635=test_gem_package_tar_writer I, [2024-05-13T03:59:02.579673 #1530759] INFO -- : [ 5/885] 1571636=test_str2big I, [2024-05-13T03:59:02.585304 #1530759] INFO -- : [ 6/885] 1571634=test_utf16 I, [2024-05-13T03:59:02.590194 #1530759] INFO -- : [ 7/885] 1571636=test_http I, [2024-05-13T03:59:02.687150 #1530759] INFO -- : [ 8/885] 1571634=attribute_write_test I, [2024-05-13T03:59:02.716454 #1530759] INFO -- : [ 9/885] 1571634=test_set I, [2024-05-13T03:59:02.731624 #1530759] INFO -- : [ 10/885] 1571634=test_rdoc_markup_to_rdoc I, [2024-05-13T03:59:02.865367 #1530759] INFO -- : [ 11/885] 1571635=test_argf I, [2024-05-13T03:59:02.915444 #1530759] INFO -- : [ 12/885] 1571634=test_yaml I, [2024-05-13T03:59:02.998391 #1530759] INFO -- : [ 13/885] 1571634=test_x509name I, [2024-05-13T03:59:03.061441 #1530759] INFO -- : [ 14/885] 1571634=test_gem_dependency I, [2024-05-13T03:59:03.359969 #1530759] INFO -- : [ 15/885] 1571634=test_yjit I, [2024-05-13T03:59:03.365681 #1530759] INFO -- : [ 16/885] 1571634=test_cclass I, [2024-05-13T03:59:03.492766 #1530759] INFO -- : [ 17/885] 1571634=test_gem_uninstaller I, [2024-05-13T03:59:04.665848 #1530759] INFO -- : [ 18/885] 1571634=test_m17n I, [2024-05-13T03:59:04.736016 #1530759] INFO -- : [ 19/885] 1571634=test_method I, [2024-05-13T03:59:06.462434 #1530759] INFO -- : [ 20/885] 1571635=test_filter I, [2024-05-13T03:59:06.500828 #1530759] INFO -- : [ 21/885] 1571635=test_parser_events I, [2024-05-13T03:59:06.706883 #1530759] INFO -- : [ 22/885] 1571635=test_pkcs12 I, [2024-05-13T03:59:07.382859 #1530759] INFO -- : [ 23/885] 1571635=test_gem_remote_fetcher I, [2024-05-13T03:59:08.679855 #1530759] INFO -- : [ 24/885] 1571634=test_json_tree I, [2024-05-13T03:59:08.685921 #1530759] INFO -- : [ 25/885] 1571634=test_koi8 I, [2024-05-13T03:59:08.693455 #1530759] INFO -- : [ 26/885] 1571634=test_pty I, [2024-05-13T03:59:08.694487 #1530759] INFO -- : Leaked file descriptor: TestPTY#test_open_with_block: 8 # I, [2024-05-13T03:59:08.694972 #1530759] INFO -- : Leaked file descriptor: TestPTY#test_open_with_block: 9 # I, [2024-05-13T03:59:08.718993 #1530759] INFO -- : COMMAND PID USER FD TYPE DEVICE SIZE/OFF NODE NAME I, [2024-05-13T03:59:08.719061 #1530759] INFO -- : ruby 1571634 opc 8r REG 252,0 6940392 13705429 /var/lib/sss/mc/group I, [2024-05-13T03:59:08.719073 #1530759] INFO -- : ruby 1571634 opc 9u unix 0x0000000000000000 0t0 2958699726 type=STREAM I, [2024-05-13T03:59:09.199970 #1530759] INFO -- : [ 27/885] 1571634=test_gem_dependency_installer I, [2024-05-13T03:59:09.207545 #1530759] INFO -- : [ 28/885] 1571635=test_http I, [2024-05-13T03:59:09.249883 #1530759] INFO -- : [ 29/885] 1571635=parser_test I, [2024-05-13T03:59:09.283300 #1530759] INFO -- : [ 30/885] 1571635=test_hash I, [2024-05-13T03:59:11.399933 #1530759] INFO -- : [ 31/885] 1571634=encoding_test I, [2024-05-13T03:59:11.407201 #1530759] INFO -- : [ 32/885] 1571636=test_scan_args I, [2024-05-13T03:59:11.418354 #1530759] INFO -- : [ 33/885] 1571636=test_gem_commands_specification_command I, [2024-05-13T03:59:11.494457 #1530759] INFO -- : [ 34/885] 1571634=test_gem_commands_which_command I, [2024-05-13T03:59:11.521769 #1530759] INFO -- : [ 35/885] 1571634=test_gem_request I, [2024-05-13T03:59:11.741995 #1530759] INFO -- : [ 36/885] 1571636=test_gem_package_old I, [2024-05-13T03:59:11.769190 #1530759] INFO -- : [ 37/885] 1571634=test_gem_commands_push_command I, [2024-05-13T03:59:11.795887 #1530759] INFO -- : [ 38/885] 1571636=locals_test I, [2024-05-13T03:59:12.263822 #1530759] INFO -- : [ 39/885] 1571636=test_too_many_dummy_encodings I, [2024-05-13T03:59:12.317060 #1530759] INFO -- : [ 40/885] 1571636=test_method_cache I, [2024-05-13T03:59:12.324800 #1530759] INFO -- : [ 41/885] 1571636=test_sprintf_comb I, [2024-05-13T03:59:12.417260 #1530759] INFO -- : [ 42/885] 1571634=test_gem_source_local I, [2024-05-13T03:59:12.469903 #1530759] INFO -- : [ 43/885] 1571636=desugar_compiler_test I, [2024-05-13T03:59:12.482036 #1530759] INFO -- : [ 44/885] 1571636=test_win32ole I, [2024-05-13T03:59:12.487385 #1530759] INFO -- : [ 45/885] 1571636=test_internal_ivar I, [2024-05-13T03:59:12.491505 #1530759] INFO -- : [ 46/885] 1571636=test_rendering I, [2024-05-13T03:59:12.550572 #1530759] INFO -- : [ 47/885] 1571636=test_gem_gemcutter_utilities I, [2024-05-13T03:59:12.660481 #1530759] INFO -- : [ 48/885] 1571634=test_rdoc_task I, [2024-05-13T03:59:12.669188 #1530759] INFO -- : [ 49/885] 1571634=test_tracepoint I, [2024-05-13T03:59:12.676671 #1530759] INFO -- : [ 50/885] 1571635=test_settracefunc I, [2024-05-13T03:59:12.968657 #1530759] INFO -- : [ 51/885] 1571634=test_gem_text I, [2024-05-13T03:59:13.011683 #1530759] INFO -- : [ 52/885] 1571636=test_backtrace I, [2024-05-13T03:59:13.084811 #1530759] INFO -- : [ 53/885] 1571634=test_framework I, [2024-05-13T03:59:13.085582 #1530759] INFO -- : [ 54/885] 1571634=test_weakmap I, [2024-05-13T03:59:13.522525 #1530759] INFO -- : [ 55/885] 1571635=test_coderange I, [2024-05-13T03:59:13.532223 #1530759] INFO -- : [ 56/885] 1571635=test_inadvertent_creation I, [2024-05-13T03:59:13.671961 #1530759] INFO -- : [ 57/885] 1571635=test_ansi_with_terminfo I, [2024-05-13T03:59:13.696177 #1530759] INFO -- : [ 58/885] 1571635=test_pack I, [2024-05-13T03:59:13.706815 #1530759] INFO -- : [ 59/885] 1571635=test_cgi_tag_helper I, [2024-05-13T03:59:13.728790 #1530759] INFO -- : [ 60/885] 1571635=test_pinned I, [2024-05-13T03:59:13.757131 #1530759] INFO -- : [ 61/885] 1571635=test_rdoc_generator_json_index I, [2024-05-13T03:59:13.944719 #1530759] INFO -- : [ 62/885] 1571635=test_date_time I, [2024-05-13T03:59:13.957527 #1530759] INFO -- : [ 63/885] 1571635=test_nil2vtempty I, [2024-05-13T03:59:13.964838 #1530759] INFO -- : [ 64/885] 1571635=test_case I, [2024-05-13T03:59:14.028820 #1530759] INFO -- : [ 65/885] 1571635=test_open-uri I, [2024-05-13T03:59:14.329475 #1530759] INFO -- : [ 66/885] 1571636=test_enc_associate I, [2024-05-13T03:59:14.405809 #1530759] INFO -- : [ 67/885] 1571635=test_enumerator I, [2024-05-13T03:59:14.768718 #1530759] INFO -- : [ 68/885] 1571636=test_gem_command_manager I, [2024-05-13T03:59:15.121570 #1530759] INFO -- : [ 69/885] 1571636=test_rdoc_context I, [2024-05-13T03:59:15.891283 #1530759] INFO -- : [ 70/885] 1571636=test_array I, [2024-05-13T03:59:15.900700 #1530759] INFO -- : [ 71/885] 1571636=test_iso_8859 I, [2024-05-13T03:59:15.953991 #1530759] INFO -- : [ 72/885] 1571636=ripper_test I, [2024-05-13T03:59:16.607251 #1530759] INFO -- : [ 73/885] 1571636=test_libs I, [2024-05-13T03:59:16.614834 #1530759] INFO -- : [ 74/885] 1571636=test_gc I, [2024-05-13T03:59:16.620298 #1530759] INFO -- : [ 75/885] 1571636=comments_test I, [2024-05-13T03:59:16.624358 #1530759] INFO -- : [ 76/885] 1571636=test_qsort I, [2024-05-13T03:59:16.633005 #1530759] INFO -- : [ 77/885] 1571636=test_math I, [2024-05-13T03:59:16.653709 #1530759] INFO -- : [ 78/885] 1571636=test_safe_load I, [2024-05-13T03:59:16.667295 #1530759] INFO -- : [ 79/885] 1571636=test_sprintf I, [2024-05-13T03:59:16.860224 #1530759] INFO -- : [ 80/885] 1571636=index_write_test I, [2024-05-13T03:59:16.877306 #1530759] INFO -- : [ 81/885] 1571636=test_rdoc_parser_rd I, [2024-05-13T03:59:16.891744 #1530759] INFO -- : [ 82/885] 1571636=test_const I, [2024-05-13T03:59:16.963162 #1530759] INFO -- : [ 83/885] 1571636=test_exit I, [2024-05-13T03:59:17.070142 #1530759] INFO -- : [ 84/885] 1571636=test_class I, [2024-05-13T03:59:17.517889 #1530759] INFO -- : [ 85/885] 1571634=test_recorder I, [2024-05-13T03:59:17.526685 #1530759] INFO -- : [ 86/885] 1571634=test_yaml_special_cases I, [2024-05-13T03:59:17.539718 #1530759] INFO -- : [ 87/885] 1571634=test_gem_commands_sources_command I, [2024-05-13T03:59:17.743465 #1530759] INFO -- : [ 88/885] 1571634=test_name_error I, [2024-05-13T03:59:17.839070 #1530759] INFO -- : [ 89/885] 1571634=json_addition_test I, [2024-05-13T03:59:17.848986 #1530759] INFO -- : [ 90/885] 1571634=test_gem_source_list I, [2024-05-13T03:59:17.934328 #1530759] INFO -- : [ 91/885] 1571634=test_gem_specification I, [2024-05-13T03:59:20.171180 #1530759] INFO -- : [ 92/885] 1571636=test_flush I, [2024-05-13T03:59:20.172584 #1530759] INFO -- : [ 93/885] 1571636=test_pkey_rsa I, [2024-05-13T03:59:20.325377 #1530759] INFO -- : [ 94/885] 1571634=test_numhash I, [2024-05-13T03:59:20.333708 #1530759] INFO -- : [ 95/885] 1571634=test_system I, [2024-05-13T03:59:20.474787 #1530759] INFO -- : [ 96/885] 1571636=test_win32ole_variable I, [2024-05-13T03:59:20.522075 #1530759] INFO -- : [ 97/885] 1571636=test_rdoc_cross_reference I, [2024-05-13T03:59:20.914144 #1530759] INFO -- : [ 98/885] 1571636=test_parse I, [2024-05-13T03:59:21.279849 #1530759] INFO -- : [ 99/885] 1571634=test_rdoc_class_module I, [2024-05-13T03:59:21.364242 #1530759] INFO -- : [100/885] 1571636=test_method_cache I, [2024-05-13T03:59:21.365671 #1530759] INFO -- : [101/885] 1571636=test_cp949 I, [2024-05-13T03:59:21.374721 #1530759] INFO -- : [102/885] 1571636=test_jaro_winkler I, [2024-05-13T03:59:21.383559 #1530759] INFO -- : [103/885] 1571636=test_gem_resolver_vendor_set I, [2024-05-13T03:59:21.412076 #1530759] INFO -- : [104/885] 1571636=test_condition I, [2024-05-13T03:59:21.413935 #1530759] INFO -- : [105/885] 1571636=test_gem_dependency_resolution_error I, [2024-05-13T03:59:21.424660 #1530759] INFO -- : [106/885] 1571636=test_sleep I, [2024-05-13T03:59:21.798295 #1530759] INFO -- : [107/885] 1571634=test_mixed_unicode_escapes I, [2024-05-13T03:59:21.818073 #1530759] INFO -- : [108/885] 1571634=test_fileutils I, [2024-05-13T03:59:22.174722 #1530759] INFO -- : Leaked file descriptor: TestFileUtils#test_chown_error: 11 # I, [2024-05-13T03:59:22.205697 #1530759] INFO -- : COMMAND PID USER FD TYPE DEVICE SIZE/OFF NODE NAME I, [2024-05-13T03:59:22.205771 #1530759] INFO -- : ruby 1571634 opc 11r REG 252,0 9253600 13705411 /var/lib/sss/mc/passwd I, [2024-05-13T03:59:22.410327 #1530759] INFO -- : [109/885] 1571634=test_sorted_set I, [2024-05-13T03:59:22.552356 #1530759] INFO -- : [110/885] 1571634=test_emoji I, [2024-05-13T03:59:22.754758 #1530759] INFO -- : [111/885] 1571634=test_stack I, [2024-05-13T03:59:23.367242 #1530759] INFO -- : [112/885] 1571634=test_windows_1252 I, [2024-05-13T03:59:23.446568 #1530759] INFO -- : [113/885] 1571634=test_face I, [2024-05-13T03:59:23.471023 #1530759] INFO -- : [114/885] 1571634=test_sizeof I, [2024-05-13T03:59:23.475856 #1530759] INFO -- : [115/885] 1571636=test_date_attr I, [2024-05-13T03:59:23.492648 #1530759] INFO -- : [116/885] 1571636=test_gem_request_set_lockfile_parser I, [2024-05-13T03:59:23.637745 #1530759] INFO -- : [117/885] 1571636=test_stringchar I, [2024-05-13T03:59:23.713636 #1530759] INFO -- : [118/885] 1571636=warnings_test I, [2024-05-13T03:59:23.732817 #1530759] INFO -- : [119/885] 1571636=test_econv I, [2024-05-13T03:59:24.656721 #1530759] INFO -- : [120/885] 1571636=test_gem_install_update_options I, [2024-05-13T03:59:24.802448 #1530759] INFO -- : [121/885] 1571636=test_basicinstructions I, [2024-05-13T03:59:24.871785 #1530759] INFO -- : [122/885] 1571636=test_utf32 I, [2024-05-13T03:59:24.883026 #1530759] INFO -- : [123/885] 1571636=test_gem_resolver_git_specification I, [2024-05-13T03:59:25.190166 #1530759] INFO -- : [124/885] 1571636=test_gem_security I, [2024-05-13T03:59:25.967524 #1530759] INFO -- : [125/885] 1571634=test_key_actor_emacs I, [2024-05-13T03:59:26.285302 #1530759] INFO -- : [126/885] 1571634=test_date_ractor I, [2024-05-13T03:59:26.295132 #1530759] INFO -- : [127/885] 1571634=test_erb I, [2024-05-13T03:59:26.428642 #1530759] INFO -- : [128/885] 1571634=test_variable I, [2024-05-13T03:59:26.455276 #1530759] INFO -- : [129/885] 1571634=test_hash I, [2024-05-13T03:59:26.476721 #1530759] INFO -- : [130/885] 1571634=test_rdoc_tom_doc I, [2024-05-13T03:59:26.493011 #1530759] INFO -- : [131/885] 1571634=test_optarg I, [2024-05-13T03:59:26.585563 #1530759] INFO -- : [132/885] 1571634=test_gem_commands_pristine_command I, [2024-05-13T03:59:27.930396 #1530759] INFO -- : [133/885] 1571634=test_gem_impossible_dependencies_error I, [2024-05-13T03:59:27.942490 #1530759] INFO -- : [134/885] 1571634=test_pp I, [2024-05-13T03:59:27.980993 #1530759] INFO -- : [135/885] 1571634=test_gem_resolver_requirement_list I, [2024-05-13T03:59:27.986818 #1530759] INFO -- : [136/885] 1571634=memsize_test I, [2024-05-13T03:59:27.996056 #1530759] INFO -- : [137/885] 1571634=test_exception I, [2024-05-13T03:59:28.125172 #1530759] INFO -- : [138/885] 1571634=test_raise_exception I, [2024-05-13T03:59:28.307220 #1530759] INFO -- : [139/885] 1571635=test_arith_seq_beg_len_step I, [2024-05-13T03:59:28.317024 #1530759] INFO -- : [140/885] 1571635=test_noarg I, [2024-05-13T03:59:28.490876 #1530759] INFO -- : [141/885] 1571635=test_undef I, [2024-05-13T03:59:28.504628 #1530759] INFO -- : [142/885] 1571635=test_rdoc_generator_darkfish I, [2024-05-13T03:59:28.606170 #1530759] INFO -- : [143/885] 1571634=test_gem_resolver_lock_set I, [2024-05-13T03:59:28.629745 #1530759] INFO -- : [144/885] 1571634=test_random I, [2024-05-13T03:59:28.644865 #1530759] INFO -- : [145/885] 1571634=test_gem_command I, [2024-05-13T03:59:28.759188 #1530759] INFO -- : [146/885] 1571634=test_asn1 I, [2024-05-13T03:59:28.789609 #1530759] INFO -- : [147/885] 1571634=test_gem_commands_open_command I, [2024-05-13T03:59:28.860969 #1530759] INFO -- : [148/885] 1571635=test_verbose I, [2024-05-13T03:59:28.877808 #1530759] INFO -- : [149/885] 1571634=test_normalize I, [2024-05-13T03:59:28.880249 #1530759] INFO -- : [150/885] 1571634=test_emoji_breaks I, [2024-05-13T03:59:28.885337 #1530759] INFO -- : [151/885] 1571634=test_assignment I, [2024-05-13T03:59:28.900811 #1530759] INFO -- : [152/885] 1571635=test_gem_update_suggestion I, [2024-05-13T03:59:28.993227 #1530759] INFO -- : [153/885] 1571635=!Nothing_to_test I, [2024-05-13T03:59:28.994771 #1530759] INFO -- : [154/885] 1571635=test_fd_setsize I, [2024-05-13T03:59:29.006269 #1530759] INFO -- : [155/885] 1571635=test_process I, [2024-05-13T03:59:29.035468 #1530759] INFO -- : [156/885] 1571635=test_forwardable I, [2024-05-13T03:59:29.053555 #1530759] INFO -- : [157/885] 1571635=test_array_create I, [2024-05-13T03:59:29.167365 #1530759] INFO -- : [158/885] 1571635=test_dir_m17n I, [2024-05-13T03:59:30.106255 #1530759] INFO -- : [159/885] 1571634=test_memory_view I, [2024-05-13T03:59:30.283474 #1530759] INFO -- : [160/885] 1571635=test_complex I, [2024-05-13T03:59:30.384483 #1530759] INFO -- : [161/885] 1571635=test_threadgroup I, [2024-05-13T03:59:30.387356 #1530759] INFO -- : [162/885] 1571634=test_shapes I, [2024-05-13T03:59:30.398400 #1530759] INFO -- : [163/885] 1571634=test_did_you_mean I, [2024-05-13T03:59:30.460353 #1530759] INFO -- : [164/885] 1571634=test_rdoc_extend I, [2024-05-13T03:59:30.474797 #1530759] INFO -- : [165/885] 1571634=test_cesu8 I, [2024-05-13T03:59:30.480019 #1530759] INFO -- : [166/885] 1571634=test_storage I, [2024-05-13T03:59:30.485262 #1530759] INFO -- : [167/885] 1571634=test_err_in_callback I, [2024-05-13T03:59:30.496782 #1530759] INFO -- : [168/885] 1571634=test_method_name_check I, [2024-05-13T03:59:30.512660 #1530759] INFO -- : [169/885] 1571634=test_merge_keys I, [2024-05-13T03:59:30.515601 #1530759] INFO -- : [170/885] 1571634=test_string I, [2024-05-13T03:59:30.525007 #1530759] INFO -- : [171/885] 1571634=test_iterator I, [2024-05-13T03:59:30.614987 #1530759] INFO -- : [172/885] 1571634=test_gem_commands_install_command I, [2024-05-13T03:59:31.396692 #1530759] INFO -- : [173/885] 1571635=test_kernel I, [2024-05-13T03:59:32.000249 #1530759] INFO -- : [174/885] 1571635=test_rendering I, [2024-05-13T03:59:32.047239 #1530759] INFO -- : [175/885] 1571635=pattern_test I, [2024-05-13T03:59:32.087217 #1530759] INFO -- : [176/885] 1571635=test_gem_rdoc I, [2024-05-13T03:59:32.223779 #1530759] INFO -- : [177/885] 1571635=test_dot_dot I, [2024-05-13T03:59:32.228321 #1530759] INFO -- : [178/885] 1571635=test_yamldbm I, [2024-05-13T03:59:32.230239 #1530759] INFO -- : [179/885] 1571635=test_gem_spec_fetcher I, [2024-05-13T03:59:32.360054 #1530759] INFO -- : [180/885] 1571634=test_unicode_escape I, [2024-05-13T03:59:32.433768 #1530759] INFO -- : [181/885] 1571635=test_default_gems I, [2024-05-13T03:59:32.446337 #1530759] INFO -- : [182/885] 1571634=test_switch_hitter I, [2024-05-13T03:59:32.455927 #1530759] INFO -- : [183/885] 1571634=test_backtrace I, [2024-05-13T03:59:32.462867 #1530759] INFO -- : [184/885] 1571634=test_gbk I, [2024-05-13T03:59:32.474096 #1530759] INFO -- : [185/885] 1571634=test_gem_commands_dependency_command I, [2024-05-13T03:59:32.479907 #1530759] INFO -- : [186/885] 1571635=test_rdoc_method_attr I, [2024-05-13T03:59:32.577518 #1530759] INFO -- : [187/885] 1571634=test_enumerable I, [2024-05-13T03:59:32.588210 #1530759] INFO -- : [188/885] 1571634=test_set I, [2024-05-13T03:59:32.614694 #1530759] INFO -- : [189/885] 1571634=static_literals_test I, [2024-05-13T03:59:32.616020 #1530759] INFO -- : [190/885] 1571634=test_tree_spell_checker I, [2024-05-13T03:59:32.626066 #1530759] INFO -- : [191/885] 1571635=test_grapheme_breaks I, [2024-05-13T03:59:32.645045 #1530759] INFO -- : [192/885] 1571635=test_hash_create I, [2024-05-13T03:59:32.650121 #1530759] INFO -- : [193/885] 1571635=test_case_mapping I, [2024-05-13T03:59:32.662267 #1530759] INFO -- : [194/885] 1571635=test_rational I, [2024-05-13T03:59:32.684739 #1530759] INFO -- : [195/885] 1571635=test_gem_ext_cargo_builder_unit I, [2024-05-13T03:59:32.692111 #1530759] INFO -- : [196/885] 1571634=test_ractor I, [2024-05-13T03:59:32.702171 #1530759] INFO -- : [197/885] 1571634=test_rdoc_rubygems_hook I, [2024-05-13T03:59:32.720706 #1530759] INFO -- : [198/885] 1571635=test_gem_resolver_api_specification I, [2024-05-13T03:59:32.782194 #1530759] INFO -- : [199/885] 1571635=test_webauthn_listener I, [2024-05-13T03:59:32.784310 #1530759] INFO -- : [200/885] 1571634=test_key_event_record I, [2024-05-13T03:59:32.792709 #1530759] INFO -- : [201/885] 1571634=test_date_parse I, [2024-05-13T03:59:32.826908 #1530759] INFO -- : Leaked file descriptor: WebauthnListenerTest#test_wait_for_otp_code_options_request: 10 : # I, [2024-05-13T03:59:32.857842 #1530759] INFO -- : COMMAND PID USER FD TYPE DEVICE SIZE/OFF NODE NAME I, [2024-05-13T03:59:32.857922 #1530759] INFO -- : ruby 1571635 opc 10u IPv4 2958702953 0t0 TCP localhost:35769->localhost:39062 (CLOSE_WAIT) I, [2024-05-13T03:59:32.915061 #1530759] INFO -- : [202/885] 1571634=test_mdns I, [2024-05-13T03:59:32.925572 #1530759] INFO -- : [203/885] 1571635=test_open3 I, [2024-05-13T03:59:32.937870 #1530759] INFO -- : [204/885] 1571634=test_arity I, [2024-05-13T03:59:32.942874 #1530759] INFO -- : [205/885] 1571634=test_thread I, [2024-05-13T03:59:32.956790 #1530759] INFO -- : [206/885] 1571634=test_pkey_ec I, [2024-05-13T03:59:32.979094 #1530759] INFO -- : [207/885] 1571634=test_svcb_https I, [2024-05-13T03:59:32.986240 #1530759] INFO -- : [208/885] 1571634=test_buffering I, [2024-05-13T03:59:33.045059 #1530759] INFO -- : [209/885] 1571634=test_data_error I, [2024-05-13T03:59:33.288952 #1530759] INFO -- : [210/885] 1571634=test_files_sample I, [2024-05-13T03:59:33.304832 #1530759] INFO -- : [211/885] 1571634=test_rdoc_stats I, [2024-05-13T03:59:33.372131 #1530759] INFO -- : [212/885] 1571634=test_rubyoptions I, [2024-05-13T03:59:34.095115 #1530759] INFO -- : .Closed file descriptor: TestOpen3#test_stdin: 10 I, [2024-05-13T03:59:35.598070 #1530759] INFO -- : [213/885] 1571635=test_optimization I, [2024-05-13T03:59:37.805815 #1530759] INFO -- : [214/885] 1571636=test_force_exit I, [2024-05-13T03:59:37.840137 #1530759] INFO -- : [215/885] 1571636=test_shift_jis I, [2024-05-13T03:59:37.861394 #1530759] INFO -- : [216/885] 1571636=test_rdoc_store I, [2024-05-13T03:59:38.495193 #1530759] INFO -- : [217/885] 1571636=regexp_test I, [2024-05-13T03:59:38.513754 #1530759] INFO -- : [218/885] 1571636=test_yield I, [2024-05-13T03:59:39.929897 #1530759] INFO -- : [219/885] 1571634=test_remote_fetch_error I, [2024-05-13T03:59:39.999827 #1530759] INFO -- : [220/885] 1571634=test_show_source I, [2024-05-13T03:59:40.011024 #1530759] INFO -- : [221/885] 1571634=test_queue I, [2024-05-13T03:59:40.026258 #1530759] INFO -- : [222/885] 1571634=test_gem_resolver_lock_specification I, [2024-05-13T03:59:40.076081 #1530759] INFO -- : [223/885] 1571634=test_boolean I, [2024-05-13T03:59:40.087455 #1530759] INFO -- : [224/885] 1571634=test_rdoc_i18n_locale I, [2024-05-13T03:59:40.387134 #1530759] INFO -- : [225/885] 1571634=test_gc_compact I, [2024-05-13T03:59:41.238901 #1530759] INFO -- : [226/885] 1571636=test_dryrun I, [2024-05-13T03:59:41.265583 #1530759] INFO -- : [227/885] 1571636=test_gem_uri_formatter I, [2024-05-13T03:59:41.285734 #1530759] INFO -- : [228/885] 1571636=test_prettyprint I, [2024-05-13T03:59:41.325162 #1530759] INFO -- : [229/885] 1571636=test_ole_methods I, [2024-05-13T03:59:41.338035 #1530759] INFO -- : [230/885] 1571636=test_cgi_util I, [2024-05-13T03:59:41.602234 #1530759] INFO -- : [231/885] 1571636=test_clone I, [2024-05-13T03:59:41.720982 #1530759] INFO -- : [232/885] 1571636=test_enc_raise I, [2024-05-13T03:59:41.738707 #1530759] INFO -- : [233/885] 1571636=test_gem_commands_stale_command I, [2024-05-13T03:59:41.744279 #1530759] INFO -- : [234/885] 1571636=ruby_parser_test I, [2024-05-13T03:59:41.753370 #1530759] INFO -- : [235/885] 1571636=test_rdoc_markup_to_tt_only I, [2024-05-13T03:59:41.837986 #1530759] INFO -- : [236/885] 1571636=test_date_strftime I, [2024-05-13T03:59:42.225544 #1530759] INFO -- : [237/885] 1571636=json_parser_test I, [2024-05-13T03:59:42.254234 #1530759] INFO -- : [238/885] 1571635=test_ws I, [2024-05-13T03:59:42.259861 #1530759] INFO -- : [239/885] 1571636=test_gem_commands_cert_command I, [2024-05-13T03:59:42.267269 #1530759] INFO -- : [240/885] 1571635=test_singleton I, [2024-05-13T03:59:42.275673 #1530759] INFO -- : [241/885] 1571635=test_fstring I, [2024-05-13T03:59:42.409752 #1530759] INFO -- : [242/885] 1571635=test_numeric I, [2024-05-13T03:59:42.426991 #1530759] INFO -- : [243/885] 1571635=test_rdoc_require I, [2024-05-13T03:59:42.446751 #1530759] INFO -- : [244/885] 1571635=test_gem_ext_rake_builder I, [2024-05-13T03:59:43.057957 #1530759] INFO -- : [245/885] 1571635=test_word I, [2024-05-13T03:59:43.105586 #1530759] INFO -- : [246/885] 1571635=test_timeout I, [2024-05-13T03:59:43.125973 #1530759] INFO -- : [247/885] 1571634=test_rdoc_markup_to_bs I, [2024-05-13T03:59:43.176168 #1530759] INFO -- : [248/885] 1571634=test_key_name_check I, [2024-05-13T03:59:43.185600 #1530759] INFO -- : [249/885] 1571634=test_rdoc_markup_raw I, [2024-05-13T03:59:43.261796 #1530759] INFO -- : [250/885] 1571634=test_instrumentation_api I, [2024-05-13T03:59:43.979229 #1530759] INFO -- : [251/885] 1571635=test_weakref I, [2024-05-13T03:59:44.063907 #1530759] INFO -- : [252/885] 1571636=test_rdoc_alias I, [2024-05-13T03:59:44.069224 #1530759] INFO -- : [253/885] 1571636=test_rdoc_context_section I, [2024-05-13T03:59:44.109133 #1530759] INFO -- : [254/885] 1571636=test_io_buffer I, [2024-05-13T03:59:44.179134 #1530759] INFO -- : [255/885] 1571635=test_deprecated I, [2024-05-13T03:59:44.180219 #1530759] INFO -- : [256/885] 1571635=test_optparse I, [2024-05-13T03:59:44.181433 #1530759] INFO -- : [257/885] 1571635=test_bash_completion I, [2024-05-13T03:59:44.187982 #1530759] INFO -- : [258/885] 1571635=test_exception I, [2024-05-13T03:59:44.207750 #1530759] INFO -- : [259/885] 1571636=test_files_test_2 I, [2024-05-13T03:59:46.190038 #1530759] INFO -- : [260/885] 1571634=test_div I, [2024-05-13T03:59:46.207770 #1530759] INFO -- : [261/885] 1571634=test_rdoc_markup_to_html_crossref I, [2024-05-13T03:59:46.546015 #1530759] INFO -- : [262/885] 1571634=test_syntax I, [2024-05-13T03:59:46.712420 #1530759] INFO -- : [263/885] 1571635=test_scalar I, [2024-05-13T03:59:46.728741 #1530759] INFO -- : [264/885] 1571635=test_class_name_check I, [2024-05-13T03:59:46.790818 #1530759] INFO -- : [265/885] 1571635=test_basicsocket I, [2024-05-13T03:59:46.810261 #1530759] INFO -- : [266/885] 1571635=test_zsh_completion I, [2024-05-13T03:59:46.821686 #1530759] INFO -- : [267/885] 1571635=test_gem_commands_environment_command I, [2024-05-13T03:59:46.890944 #1530759] INFO -- : [268/885] 1571635=test_pkcs7 I, [2024-05-13T03:59:46.981667 #1530759] INFO -- : [269/885] 1571636=test_pack I, [2024-05-13T03:59:47.056623 #1530759] INFO -- : [270/885] 1571635=test_gem_unsatisfiable_dependency_error I, [2024-05-13T03:59:47.073354 #1530759] INFO -- : [271/885] 1571635=test_literal I, [2024-05-13T03:59:47.224036 #1530759] INFO -- : [272/885] 1571636=test_thread I, [2024-05-13T03:59:47.429804 #1530759] INFO -- : [273/885] 1571636=test_config I, [2024-05-13T03:59:47.487114 #1530759] INFO -- : [274/885] 1571636=test_complex2 I, [2024-05-13T03:59:47.498590 #1530759] INFO -- : [275/885] 1571636=test_gem_security_signer I, [2024-05-13T03:59:47.598406 #1530759] INFO -- : [276/885] 1571636=test_gem_util I, [2024-05-13T03:59:47.607859 #1530759] INFO -- : [277/885] 1571635=test_input_method I, [2024-05-13T03:59:47.692714 #1530759] INFO -- : [278/885] 1571635=test_io I, [2024-05-13T03:59:47.760640 #1530759] INFO -- : [279/885] 1571636=test_rdoc_i18n_text I, [2024-05-13T03:59:47.766412 #1530759] INFO -- : [280/885] 1571636=test_null I, [2024-05-13T03:59:47.787207 #1530759] INFO -- : [281/885] 1571636=test_ractor I, [2024-05-13T03:59:47.828795 #1530759] INFO -- : [282/885] 1571636=test_data I, [2024-05-13T03:59:47.832563 #1530759] INFO -- : [283/885] 1571636=test_memory_view I, [2024-05-13T03:59:47.860153 #1530759] INFO -- : [284/885] 1571636=test_multi_irb_commands I, [2024-05-13T03:59:47.864544 #1530759] INFO -- : [285/885] 1571636=test_pkey_dh I, [2024-05-13T03:59:47.879185 #1530759] INFO -- : [286/885] 1571635=test_m17n_comb I, [2024-05-13T03:59:49.204193 #1530759] INFO -- : [287/885] 1571636=test_win32ole_typelib I, [2024-05-13T03:59:49.216772 #1530759] INFO -- : [288/885] 1571636=test_pkey I, [2024-05-13T03:59:49.225581 #1530759] INFO -- : [289/885] 1571636=test_external_new I, [2024-05-13T03:59:49.230286 #1530759] INFO -- : [290/885] 1571636=test_bigzero I, [2024-05-13T03:59:49.242299 #1530759] INFO -- : [291/885] 1571636=test_gem_platform I, [2024-05-13T03:59:49.371263 #1530759] INFO -- : [292/885] 1571636=test_gem_commands_query_command I, [2024-05-13T03:59:50.037733 #1530759] INFO -- : [293/885] 1571636=redundant_return_test I, [2024-05-13T03:59:50.048845 #1530759] INFO -- : [294/885] 1571636=test_rand I, [2024-05-13T03:59:50.408035 #1530759] INFO -- : [295/885] 1571636=test_string_processing I, [2024-05-13T03:59:50.418088 #1530759] INFO -- : [296/885] 1571636=test_random_formatter I, [2024-05-13T03:59:50.429748 #1530759] INFO -- : [297/885] 1571636=test_rdoc_markup_attributes I, [2024-05-13T03:59:50.453033 #1530759] INFO -- : [298/885] 1571636=test_rdoc_code_object I, [2024-05-13T03:59:50.825267 #1530759] INFO -- : [299/885] 1571636=test_process I, [2024-05-13T03:59:50.890172 #1530759] INFO -- : [300/885] 1571635=test_gem_source_specific_file I, [2024-05-13T03:59:50.975083 #1530759] INFO -- : [301/885] 1571635=test_provider I, [2024-05-13T03:59:50.984915 #1530759] INFO -- : [302/885] 1571635=test_euc_kr I, [2024-05-13T03:59:50.995477 #1530759] INFO -- : [303/885] 1571635=test_bmethod I, [2024-05-13T03:59:51.005542 #1530759] INFO -- : [304/885] 1571635=test_gem_doctor I, [2024-05-13T03:59:51.065456 #1530759] INFO -- : [305/885] 1571635=json_fixtures_test I, [2024-05-13T03:59:51.075195 #1530759] INFO -- : [306/885] 1571635=test_len I, [2024-05-13T03:59:51.082935 #1530759] INFO -- : [307/885] 1571635=test_kwargs I, [2024-05-13T03:59:51.096963 #1530759] INFO -- : [308/885] 1571635=test_rdoc_parser_c I, [2024-05-13T03:59:51.419700 #1530759] INFO -- : [309/885] 1571635=test_pack I, [2024-05-13T03:59:51.630330 #1530759] INFO -- : [310/885] 1571635=test_io_wait I, [2024-05-13T03:59:51.972700 #1530759] INFO -- : [311/885] 1571635=parse_test I, [2024-05-13T03:59:53.956051 #1530759] INFO -- : [312/885] 1571634=test_tsort I, [2024-05-13T03:59:53.961267 #1530759] INFO -- : [313/885] 1571634=test_typeddata I, [2024-05-13T03:59:54.201665 #1530759] INFO -- : [314/885] 1571634=test_gem_commands_fetch_command I, [2024-05-13T03:59:54.405553 #1530759] INFO -- : [315/885] 1571634=test_securerandom I, [2024-05-13T03:59:54.450406 #1530759] INFO -- : [316/885] 1571634=test_gem_commands_outdated_command I, [2024-05-13T03:59:54.512317 #1530759] INFO -- : [317/885] 1571634=test_gem_dependency_list I, [2024-05-13T03:59:54.623507 #1530759] INFO -- : [318/885] 1571634=test_rdoc_parser_changelog I, [2024-05-13T03:59:54.695977 #1530759] INFO -- : [319/885] 1571634=parameters_signature_test I, [2024-05-13T03:59:54.704706 #1530759] INFO -- : [320/885] 1571634=test_require I, [2024-05-13T03:59:54.712636 #1530759] INFO -- : [321/885] 1571634=test_stringify_symbols I, [2024-05-13T03:59:54.718895 #1530759] INFO -- : [322/885] 1571634=test_objspace I, [2024-05-13T03:59:55.194924 #1530759] INFO -- : [323/885] 1571635=test_rdoc_text I, [2024-05-13T03:59:55.240985 #1530759] INFO -- : [324/885] 1571635=library_symbols_testLeaked file descriptor: TestProcess#test_seteuid_name: 11 # I, [2024-05-13T03:59:55.252733 #1530759] INFO -- : I, [2024-05-13T03:59:55.259977 #1530759] INFO -- : [325/885] 1571635=test_rdoc_markup_indented_paragraph I, [2024-05-13T03:59:55.274551 #1530759] INFO -- : [326/885] 1571635=test_iseq_loadCOMMAND PID USER FD TYPE DEVICE SIZE/OFF NODE NAME I, [2024-05-13T03:59:55.274619 #1530759] INFO -- : ruby 1571636 opc 11r REG 252,0 9253600 13705411 /var/lib/sss/mc/passwd I, [2024-05-13T03:59:55.310391 #1530759] INFO -- : I, [2024-05-13T03:59:56.431311 #1530759] INFO -- : [327/885] 1571635=test_rdoc_markup_parser I, [2024-05-13T03:59:56.492288 #1530759] INFO -- : [328/885] 1571635=test_stream I, [2024-05-13T03:59:56.726790 #1530759] INFO -- : [329/885] 1571635=test_have_library I, [2024-05-13T03:59:57.542754 #1530759] INFO -- : [330/885] 1571635=test_ns_spki I, [2024-05-13T03:59:57.552291 #1530759] INFO -- : [331/885] 1571635=test_rdoc_encoding I, [2024-05-13T03:59:57.591578 #1530759] INFO -- : [332/885] 1571635=test_win32ole_variant_outarg I, [2024-05-13T03:59:57.613256 #1530759] INFO -- : [333/885] 1571635=test_key_actor_vi I, [2024-05-13T03:59:57.750708 #1530759] INFO -- : [334/885] 1571635=test_postponed_job I, [2024-05-13T03:59:58.040850 #1530759] INFO -- : [335/885] 1571635=test_gem_request_set_lockfile I, [2024-05-13T03:59:58.522751 #1530759] INFO -- : [336/885] 1571635=test_rdoc_markdown I, [2024-05-13T03:59:58.789763 #1530759] INFO -- : [337/885] 1571635=test_httpresponses I, [2024-05-13T03:59:58.804567 #1530759] INFO -- : [338/885] 1571635=test_rdoc_constant I, [2024-05-13T03:59:58.900655 #1530759] INFO -- : [339/885] 1571635=test_deprecate I, [2024-05-13T03:59:58.940482 #1530759] INFO -- : [340/885] 1571635=test_generic I, [2024-05-13T03:59:58.969838 #1530759] INFO -- : [341/885] 1571635=test_rdoc_markup_to_html_snippet I, [2024-05-13T03:59:59.045800 #1530759] INFO -- : [342/885] 1571635=test_common I, [2024-05-13T03:59:59.224123 #1530759] INFO -- : [343/885] 1571635=test_ubf_async_safe I, [2024-05-13T03:59:59.243832 #1530759] INFO -- : [344/885] 1571635=test_pstore I, [2024-05-13T03:59:59.473633 #1530759] INFO -- : [345/885] 1571635=test_win32ole_record I, [2024-05-13T03:59:59.488985 #1530759] INFO -- : [346/885] 1571635=test_rdoc_include I, [2024-05-13T03:59:59.533372 #1530759] INFO -- : [347/885] 1571635=test_gem_version_option I, [2024-05-13T03:59:59.588090 #1530759] INFO -- : [348/885] 1571635=test_date_compat I, [2024-05-13T03:59:59.620912 #1530759] INFO -- : [349/885] 1571635=test_gem_ext_cargo_builder I, [2024-05-13T03:59:59.622740 #1530759] INFO -- : [350/885] 1571635=test_console_attr I, [2024-05-13T03:59:59.652699 #1530759] INFO -- : [351/885] 1571635=test_proc I, [2024-05-13T04:00:00.499581 #1530759] INFO -- : [352/885] 1571635=test_gem_commands_unpack_command I, [2024-05-13T04:00:00.856300 #1530759] INFO -- : [353/885] 1571635=test_zlib I, [2024-05-13T04:00:07.999931 #1530759] INFO -- : [354/885] 1571636=test_rdoc_options I, [2024-05-13T04:00:08.251156 #1530759] INFO -- : [355/885] 1571636=test_path_to_class I, [2024-05-13T04:00:08.263518 #1530759] INFO -- : [356/885] 1571636=test_enumerator I, [2024-05-13T04:00:08.287448 #1530759] INFO -- : [357/885] 1571636=test_reqarg I, [2024-05-13T04:00:08.680445 #1530759] INFO -- : [358/885] 1571635=test_frozen_error I, [2024-05-13T04:00:08.695822 #1530759] INFO -- : [359/885] 1571635=test_gem_version I, [2024-05-13T04:00:08.768027 #1530759] INFO -- : [360/885] 1571636=test_spell_checker I, [2024-05-13T04:00:08.776352 #1530759] INFO -- : [361/885] 1571636=test_gem_ext_ext_conf_builder I, [2024-05-13T04:00:08.853135 #1530759] INFO -- : [362/885] 1571635=test_resource I, [2024-05-13T04:00:08.873878 #1530759] INFO -- : [363/885] 1571635=test_gem_package_tar_reader_entry I, [2024-05-13T04:00:09.148723 #1530759] INFO -- : [364/885] 1571635=test_gem_uri I, [2024-05-13T04:00:09.180845 #1530759] INFO -- : [365/885] 1571635=test_bug-5832 I, [2024-05-13T04:00:09.191989 #1530759] INFO -- : [366/885] 1571635=test_yield_block I, [2024-05-13T04:00:09.242967 #1530759] INFO -- : [367/885] 1571635=test_c_struct_builder I, [2024-05-13T04:00:09.450155 #1530759] INFO -- : [368/885] 1571635=test_pipe I, [2024-05-13T04:00:09.590045 #1530759] INFO -- : [369/885] 1571635=test_string I, [2024-05-13T04:00:09.913400 #1530759] INFO -- : [370/885] 1571636=test_macro I, [2024-05-13T04:00:09.923300 #1530759] INFO -- : [371/885] 1571636=test_gem_resolver_activation_request I, [2024-05-13T04:00:09.950294 #1530759] INFO -- : [372/885] 1571636=test_function I, [2024-05-13T04:00:10.179888 #1530759] INFO -- : [373/885] 1571636=test_gem_commands_server_command I, [2024-05-13T04:00:10.185015 #1530759] INFO -- : [374/885] 1571636=test_win32ole_method_event I, [2024-05-13T04:00:10.189978 #1530759] INFO -- : [375/885] 1571636=test_tcp I, [2024-05-13T04:00:10.270912 #1530759] INFO -- : [376/885] 1571636=parse_comments_test I, [2024-05-13T04:00:10.280979 #1530759] INFO -- : [377/885] 1571636=test_gem_name_tuple I, [2024-05-13T04:00:10.301879 #1530759] INFO -- : [378/885] 1571636=test_rdoc_markup_to_table_of_contents I, [2024-05-13T04:00:10.391406 #1530759] INFO -- : [379/885] 1571636=test_integer I, [2024-05-13T04:00:10.403339 #1530759] INFO -- : [380/885] 1571636=test_gem_requirement I, [2024-05-13T04:00:10.563212 #1530759] INFO -- : [381/885] 1571636=test_rat I, [2024-05-13T04:00:10.579798 #1530759] INFO -- : [382/885] 1571636=test_gem_request_connection_pools I, [2024-05-13T04:00:11.644132 #1530759] INFO -- : [383/885] 1571636=test_init I, [2024-05-13T04:00:12.071112 #1530759] INFO -- : [384/885] 1571636=test_flags I, [2024-05-13T04:00:12.528888 #1530759] INFO -- : [385/885] 1571636=test_numeric I, [2024-05-13T04:00:12.596582 #1530759] INFO -- : [386/885] 1571636=test_bug-3571 I, [2024-05-13T04:00:12.609547 #1530759] INFO -- : [387/885] 1571636=test_yamlstore I, [2024-05-13T04:00:12.627383 #1530759] INFO -- : [388/885] 1571636=test_file I, [2024-05-13T04:00:12.644004 #1530759] INFO -- : [389/885] 1571636=test_time I, [2024-05-13T04:00:12.760475 #1530759] INFO -- : [390/885] 1571636=test_capacity I, [2024-05-13T04:00:12.776826 #1530759] INFO -- : [391/885] 1571636=test_gem_commands_owner_command I, [2024-05-13T04:00:13.460586 #1530759] INFO -- : [392/885] 1571636=test_nextafter I, [2024-05-13T04:00:13.612868 #1530759] INFO -- : [393/885] 1571636=test_encoding I, [2024-05-13T04:00:13.798853 #1530759] INFO -- : [394/885] 1571636=test_hmac I, [2024-05-13T04:00:13.810227 #1530759] INFO -- : [395/885] 1571636=test_rdoc_generator_markup I, [2024-05-13T04:00:14.254551 #1530759] INFO -- : [396/885] 1571636=test_constant I, [2024-05-13T04:00:15.983901 #1530759] INFO -- : [397/885] 1571636=test_find I, [2024-05-13T04:00:15.999712 #1530759] INFO -- : [398/885] 1571636=test_files_lib I, [2024-05-13T04:00:16.055382 #1530759] INFO -- : [399/885] 1571636=test_string_memory I, [2024-05-13T04:00:16.163673 #1530759] INFO -- : [400/885] 1571636=test_help I, [2024-05-13T04:00:16.168592 #1530759] INFO -- : [401/885] 1571636=test_enumerator_kw I, [2024-05-13T04:00:16.174197 #1530759] INFO -- : [402/885] 1571636=test_marshalable I, [2024-05-13T04:00:16.182364 #1530759] INFO -- : [403/885] 1571636=test_line_editor I, [2024-05-13T04:00:16.190336 #1530759] INFO -- : [404/885] 1571636=reflection_test I, [2024-05-13T04:00:16.200835 #1530759] INFO -- : [405/885] 1571636=test_string I, [2024-05-13T04:00:16.222082 #1530759] INFO -- : [406/885] 1571636=json_common_interface_test I, [2024-05-13T04:00:16.247638 #1530759] INFO -- : [407/885] 1571636=test_error_highlight I, [2024-05-13T04:00:16.764296 #1530759] INFO -- : [408/885] 1571636=test_rdoc_any_method I, [2024-05-13T04:00:17.117735 #1530759] INFO -- : [409/885] 1571636=test_function_entry I, [2024-05-13T04:00:17.120960 #1530759] INFO -- : [410/885] 1571636=test_raise I, [2024-05-13T04:00:17.130328 #1530759] INFO -- : [411/885] 1571636=test_complexrational I, [2024-05-13T04:00:17.135063 #1530759] INFO -- : [412/885] 1571636=version_test I, [2024-05-13T04:00:17.141759 #1530759] INFO -- : [413/885] 1571636=test_tree_builder I, [2024-05-13T04:00:17.149801 #1530759] INFO -- : [414/885] 1571636=test_date I, [2024-05-13T04:00:17.155446 #1530759] INFO -- : [415/885] 1571636=test_big5 I, [2024-05-13T04:00:17.184047 #1530759] INFO -- : [416/885] 1571636=test_gem_commands_update_command I, [2024-05-13T04:00:18.840423 #1530759] INFO -- : [417/885] 1571636=test_protect I, [2024-05-13T04:00:18.857307 #1530759] INFO -- : [418/885] 1571636=test_pathname I, [2024-05-13T04:00:19.101514 #1530759] INFO -- : [419/885] 1571636=test_fnmatch I, [2024-05-13T04:00:19.153682 #1530759] INFO -- : [420/885] 1571636=test_store I, [2024-05-13T04:00:19.508565 #1530759] INFO -- : [421/885] 1571636=test_rdoc_markup_pre_process I, [2024-05-13T04:00:19.638888 #1530759] INFO -- : [422/885] 1571636=test_coverage I, [2024-05-13T04:00:20.265106 #1530759] INFO -- : [423/885] 1571636=test_tempfile I, [2024-05-13T04:00:20.477622 #1530759] INFO -- : [424/885] 1571636=test_http_request I, [2024-05-13T04:00:20.485793 #1530759] INFO -- : [425/885] 1571636=test_erb_m17n I, [2024-05-13T04:00:20.495607 #1530759] INFO -- : [426/885] 1571636=test_rdoc_generator_pot_po_entry I, [2024-05-13T04:00:20.557001 #1530759] INFO -- : [427/885] 1571636=test_timeout I, [2024-05-13T04:00:20.564002 #1530759] INFO -- : [428/885] 1571636=test_rdoc_markup_verbatim I, [2024-05-13T04:00:20.575100 #1530759] INFO -- : [429/885] 1571636=test_webauthn_poller I, [2024-05-13T04:00:20.740987 #1530759] INFO -- : [430/885] 1571636=test_date_conv I, [2024-05-13T04:00:20.747017 #1530759] INFO -- : [431/885] 1571636=test_frozen I, [2024-05-13T04:00:20.752890 #1530759] INFO -- : [432/885] 1571636=test_serialize_subclasses I, [2024-05-13T04:00:20.769435 #1530759] INFO -- : [433/885] 1571636=test_gem_resolver_index_specification I, [2024-05-13T04:00:20.882585 #1530759] INFO -- : [434/885] 1571636=test_egrep_cpp I, [2024-05-13T04:00:20.933454 #1530759] INFO -- : [435/885] 1571636=json_string_matching_test I, [2024-05-13T04:00:20.946180 #1530759] INFO -- : [436/885] 1571636=test_gem_config_file I, [2024-05-13T04:00:21.183389 #1530759] INFO -- : [437/885] 1571636=test_comparable I, [2024-05-13T04:00:21.197723 #1530759] INFO -- : [438/885] 1571636=test_rdoc_rdoc I, [2024-05-13T04:00:21.266029 #1530759] INFO -- : [439/885] 1571636=test_yjit_exit_locations I, [2024-05-13T04:00:21.272093 #1530759] INFO -- : [440/885] 1571636=test_io_timeout I, [2024-05-13T04:00:21.277682 #1530759] INFO -- : [441/885] 1571636=test_type_completor I, [2024-05-13T04:00:21.290731 #1530759] INFO -- : [442/885] 1571636=test_rdoc_normal_module I, [2024-05-13T04:00:21.556680 #1530759] INFO -- : [443/885] 1571636=test_rdoc_markdown_test I, [2024-05-13T04:00:22.509815 #1530759] INFO -- : [444/885] 1571636=test_io_buffer I, [2024-05-13T04:00:22.622269 #1530759] INFO -- : [445/885] 1571636=test_kdf I, [2024-05-13T04:00:22.650733 #1530759] INFO -- : [446/885] 1571636=test_ldap I, [2024-05-13T04:00:22.665413 #1530759] INFO -- : [447/885] 1571636=test_thread_queue I, [2024-05-13T04:00:29.410038 #1530759] INFO -- : [448/885] 1571636=test_passing_block I, [2024-05-13T04:00:29.428087 #1530759] INFO -- : [449/885] 1571636=test_defined I, [2024-05-13T04:00:29.501730 #1530759] INFO -- : [450/885] 1571636=test_nowrite I, [2024-05-13T04:00:29.534258 #1530759] INFO -- : [451/885] 1571636=test_import I, [2024-05-13T04:00:30.131948 #1530759] INFO -- : [452/885] 1571634=test_human_typo I, [2024-05-13T04:00:30.142306 #1530759] INFO -- : [453/885] 1571634=test_wait I, [2024-05-13T04:00:30.205206 #1530759] INFO -- : [454/885] 1571634=test_nil I, [2024-05-13T04:00:30.217267 #1530759] INFO -- : [455/885] 1571634=test_psych I, [2024-05-13T04:00:30.251100 #1530759] INFO -- : [456/885] 1571634=test_yaml_tree I, [2024-05-13T04:00:30.278341 #1530759] INFO -- : [457/885] 1571634=test_gem_commands_yank_command I, [2024-05-13T04:00:30.858869 #1530759] INFO -- : [458/885] 1571634=test_cstr I, [2024-05-13T04:00:31.902211 #1530759] INFO -- : [459/885] 1571636=test_command I, [2024-05-13T04:00:32.151079 #1530759] INFO -- : [460/885] 1571636=test_euc_tw I, [2024-05-13T04:00:32.163920 #1530759] INFO -- : [461/885] 1571636=test_gem_resolver_dependency_request I, [2024-05-13T04:00:32.200189 #1530759] INFO -- : [462/885] 1571636=test_big2str I, [2024-05-13T04:00:32.215126 #1530759] INFO -- : [463/885] 1571636=test_gem_resolver_specification I, [2024-05-13T04:00:32.248787 #1530759] INFO -- : [464/885] 1571636=test_pkey_dsa I, [2024-05-13T04:00:32.491003 #1530759] INFO -- : [465/885] 1571634=test_logger I, [2024-05-13T04:00:32.510535 #1530759] INFO -- : [466/885] 1571634=test_gem_console_ui I, [2024-05-13T04:00:32.515234 #1530759] INFO -- : [467/885] 1571634=test_ifunless I, [2024-05-13T04:00:32.811320 #1530759] INFO -- : [468/885] 1571634=test_allocation I, [2024-05-13T04:00:34.007252 #1530759] INFO -- : [469/885] 1571636=test_insns_leaf I, [2024-05-13T04:00:34.051023 #1530759] INFO -- : [470/885] 1571636=test_readpartial I, [2024-05-13T04:00:34.428916 #1530759] INFO -- : [471/885] 1571636=test_httpresponse I, [2024-05-13T04:00:34.468153 #1530759] INFO -- : [472/885] 1571636=test_rdoc_parser_ruby I, [2024-05-13T04:00:34.959209 #1530759] INFO -- : [473/885] 1571634=test_x509req I, [2024-05-13T04:00:34.987475 #1530759] INFO -- : [474/885] 1571634=test_gem_resolver I, [2024-05-13T04:00:35.421465 #1530759] INFO -- : [475/885] 1571636=test_gem_source_vendor I, [2024-05-13T04:00:35.427845 #1530759] INFO -- : [476/885] 1571634=test_object I, [2024-05-13T04:00:35.430255 #1530759] INFO -- : [477/885] 1571636=test_dln I, [2024-05-13T04:00:35.445770 #1530759] INFO -- : [478/885] 1571636=unescape_test I, [2024-05-13T04:00:35.831449 #1530759] INFO -- : [479/885] 1571634=test_gem_commands_exec_command I, [2024-05-13T04:00:35.963321 #1530759] INFO -- : [480/885] 1571635=test_color_printer I, [2024-05-13T04:00:35.971274 #1530759] INFO -- : [481/885] 1571635=test_super I, [2024-05-13T04:00:36.875793 #1530759] INFO -- : [482/885] 1571636=test_modify_expand I, [2024-05-13T04:00:36.885760 #1530759] INFO -- : [483/885] 1571636=test_pkg_config I, [2024-05-13T04:00:36.901580 #1530759] INFO -- : [484/885] 1571636=test_gem_available_set I, [2024-05-13T04:00:37.020803 #1530759] INFO -- : [485/885] 1571636=errors_test I, [2024-05-13T04:00:37.132793 #1530759] INFO -- : [486/885] 1571636=test_convertible I, [2024-05-13T04:00:37.322758 #1530759] INFO -- : [487/885] 1571635=test_vm_dump I, [2024-05-13T04:00:37.331810 #1530759] INFO -- : [488/885] 1571635=json_encoding_test I, [2024-05-13T04:00:37.382378 #1530759] INFO -- : [489/885] 1571635=test_func I, [2024-05-13T04:00:37.422398 #1530759] INFO -- : [490/885] 1571634=test_config I, [2024-05-13T04:00:37.467606 #1530759] INFO -- : [491/885] 1571634=test_compile_prism I, [2024-05-13T04:00:37.815719 #1530759] INFO -- : [492/885] 1571634=test_helper I, [2024-05-13T04:00:37.822380 #1530759] INFO -- : [493/885] 1571634=test_win32ole_event I, [2024-05-13T04:00:37.865655 #1530759] INFO -- : [494/885] 1571634=test_gem_commands_uninstall_command I, [2024-05-13T04:00:38.766940 #1530759] INFO -- : [495/885] 1571634=test_rdoc_markup_formatter I, [2024-05-13T04:00:38.784730 #1530759] INFO -- : [496/885] 1571634=test_digest_extend I, [2024-05-13T04:00:38.831251 #1530759] INFO -- : [497/885] 1571634=test_gem_ext_cmake_builder I, [2024-05-13T04:00:38.844206 #1530759] INFO -- : [498/885] 1571634=test_thread_fd_close I, [2024-05-13T04:00:39.306586 #1530759] INFO -- : [499/885] 1571634=test_last_thread I, [2024-05-13T04:00:39.912359 #1530759] INFO -- : [500/885] 1571634=test_getopts I, [2024-05-13T04:00:39.919116 #1530759] INFO -- : [501/885] 1571634=test_emitter I, [2024-05-13T04:00:39.926022 #1530759] INFO -- : [502/885] 1571634=test_alias I, [2024-05-13T04:00:40.151925 #1530759] INFO -- : [503/885] 1571634=test_fips I, [2024-05-13T04:00:40.360833 #1530759] INFO -- : [504/885] 1571634=test_pattern_key_name_check I, [2024-05-13T04:00:40.368783 #1530759] INFO -- : [505/885] 1571634=test_profile_frames I, [2024-05-13T04:00:40.537263 #1530759] INFO -- : [506/885] 1571634=test_debug I, [2024-05-13T04:00:40.559138 #1530759] INFO -- : [507/885] 1571634=test_transcode I, [2024-05-13T04:00:40.813646 #1530759] INFO -- : [508/885] 1571634=test_refinement I, [2024-05-13T04:00:40.823837 #1530759] INFO -- : [509/885] 1571636=test_class2name I, [2024-05-13T04:00:40.846553 #1530759] INFO -- : [510/885] 1571636=test_gem_commands_cleanup_command I, [2024-05-13T04:00:41.418678 #1530759] INFO -- : [511/885] 1571635=test_dns I, [2024-05-13T04:00:41.531945 #1530759] INFO -- : [512/885] 1571636=test_cgi_session I, [2024-05-13T04:00:41.544445 #1530759] INFO -- : [513/885] 1571636=test_notimplement I, [2024-05-13T04:00:41.593285 #1530759] INFO -- : [514/885] 1571636=test_c_union_entity I, [2024-05-13T04:00:41.697667 #1530759] INFO -- : [515/885] 1571636=test_x509crl I, [2024-05-13T04:00:41.804275 #1530759] INFO -- : [516/885] 1571636=test_rdoc_markup_heading I, [2024-05-13T04:00:41.815815 #1530759] INFO -- : [517/885] 1571636=test_io_console I, [2024-05-13T04:00:41.873815 #1530759] INFO -- : [518/885] 1571635=test_flip I, [2024-05-13T04:00:41.898280 #1530759] INFO -- : [519/885] 1571635=test_x509ext I, [2024-05-13T04:00:41.907646 #1530759] INFO -- : [520/885] 1571635=test_emitter I, [2024-05-13T04:00:41.917279 #1530759] INFO -- : [521/885] 1571635=bom_test I, [2024-05-13T04:00:41.928460 #1530759] INFO -- : [522/885] 1571635=test_summary I, [2024-05-13T04:00:41.990542 #1530759] INFO -- : [523/885] 1571635=test_helper_method I, [2024-05-13T04:00:42.036414 #1530759] INFO -- : [524/885] 1571635=test_config I, [2024-05-13T04:00:42.420553 #1530759] INFO -- : [525/885] 1571635=test_file I, [2024-05-13T04:00:44.385347 #1530759] INFO -- : [526/885] 1571634=test_rdoc_markup_to_html I, [2024-05-13T04:00:44.465982 #1530759] INFO -- : [527/885] 1571636=test_foreach I, [2024-05-13T04:00:44.471925 #1530759] INFO -- : [528/885] 1571636=test_append I, [2024-05-13T04:00:44.477312 #1530759] INFO -- : [529/885] 1571636=test_gem_resolver_installer_set I, [2024-05-13T04:00:44.518423 #1530759] INFO -- : [530/885] 1571634=test_trace I, [2024-05-13T04:00:44.528974 #1530759] INFO -- : [531/885] 1571634=test_arity I, [2024-05-13T04:00:44.540208 #1530759] INFO -- : [532/885] 1571634=test_gem_path_support I, [2024-05-13T04:00:44.592397 #1530759] INFO -- : [533/885] 1571634=test_keyword I, [2024-05-13T04:00:44.773011 #1530759] INFO -- : [534/885] 1571636=test_win32ole_type_event I, [2024-05-13T04:00:44.780361 #1530759] INFO -- : [535/885] 1571636=test_scalar_scanner I, [2024-05-13T04:00:44.791293 #1530759] INFO -- : [536/885] 1571636=test_rb_str_dup I, [2024-05-13T04:00:44.800110 #1530759] INFO -- : [537/885] 1571636=test_lambda I, [2024-05-13T04:00:44.868924 #1530759] INFO -- : [538/885] 1571636=test_eval I, [2024-05-13T04:00:45.113052 #1530759] INFO -- : [539/885] 1571634=test_monitor I, [2024-05-13T04:00:45.119562 #1530759] INFO -- : [540/885] 1571636=test_beginendblock I, [2024-05-13T04:00:45.327485 #1530759] INFO -- : [541/885] 1571634=test_nofree I, [2024-05-13T04:00:45.350851 #1530759] INFO -- : [542/885] 1571634=test_regexp I, [2024-05-13T04:00:45.446125 #1530759] INFO -- : [543/885] 1571636=test_whileuntil I, [2024-05-13T04:00:45.513243 #1530759] INFO -- : [544/885] 1571636=test_pointer I, [2024-05-13T04:00:47.080785 #1530759] INFO -- : [545/885] 1571636=test_rdoc_normal_class I, [2024-05-13T04:00:47.125766 #1530759] INFO -- : [546/885] 1571636=test_within_pipe I, [2024-05-13T04:00:47.165707 #1530759] INFO -- : [547/885] 1571636=test_gem_installer I, [2024-05-13T04:00:48.616898 #1530759] INFO -- : [548/885] 1571635=test_bug_reporter I, [2024-05-13T04:00:48.805245 #1530759] INFO -- : [549/885] 1571635=test_buffered_io I, [2024-05-13T04:00:48.837822 #1530759] INFO -- : [550/885] 1571635=test_ossl I, [2024-05-13T04:00:52.364963 #1530759] INFO -- : [551/885] 1571636=test_ruby_lex I, [2024-05-13T04:00:52.492957 #1530759] INFO -- : [552/885] 1571636=compiler_test I, [2024-05-13T04:00:52.555012 #1530759] INFO -- : [553/885] 1571636=test_arith_seq_extract I, [2024-05-13T04:00:52.707436 #1530759] INFO -- : [554/885] 1571636=test_gem_source_subpath_problem I, [2024-05-13T04:00:52.807147 #1530759] INFO -- : [555/885] 1571636=test_object_references I, [2024-05-13T04:00:52.811095 #1530759] INFO -- : [556/885] 1571636=test_helper I, [2024-05-13T04:00:52.819463 #1530759] INFO -- : [557/885] 1571636=test_duplicate I, [2024-05-13T04:00:52.832284 #1530759] INFO -- : [558/885] 1571636=test_gem_resolver_api_set I, [2024-05-13T04:00:52.931752 #1530759] INFO -- : [559/885] 1571636=test_addr I, [2024-05-13T04:00:52.945804 #1530759] INFO -- : [560/885] 1571636=test_mailto I, [2024-05-13T04:00:52.958404 #1530759] INFO -- : [561/885] 1571636=test_kill_ring I, [2024-05-13T04:00:52.964930 #1530759] INFO -- : [562/885] 1571636=test_member I, [2024-05-13T04:00:52.971835 #1530759] INFO -- : [563/885] 1571636=test_object I, [2024-05-13T04:00:52.980303 #1530759] INFO -- : [564/885] 1571636=test_cgi_header I, [2024-05-13T04:00:52.985611 #1530759] INFO -- : [565/885] 1571636=format_errors_test I, [2024-05-13T04:00:52.992279 #1530759] INFO -- : [566/885] 1571636=test_case_options I, [2024-05-13T04:00:52.998551 #1530759] INFO -- : [567/885] 1571636=test_windows_1251 I, [2024-05-13T04:00:53.011175 #1530759] INFO -- : [568/885] 1571636=test_gem_ext_builder I, [2024-05-13T04:00:56.378482 #1530759] INFO -- : [569/885] 1571636=test_to_ary_concat I, [2024-05-13T04:00:56.432209 #1530759] INFO -- : [570/885] 1571635=test_history I, [2024-05-13T04:00:56.452921 #1530759] INFO -- : [571/885] 1571635=test_reline I, [2024-05-13T04:00:56.725420 #1530759] INFO -- : [572/885] 1571635=test_ellipsize I, [2024-05-13T04:00:56.751819 #1530759] INFO -- : [573/885] 1571635=test_call I, [2024-05-13T04:00:56.976692 #1530759] INFO -- : [574/885] 1571635=test_gem_commands_build_command I, [2024-05-13T04:00:57.360899 #1530759] INFO -- : [575/885] 1571635=test_data I, [2024-05-13T04:00:57.432463 #1530759] INFO -- : [576/885] 1571635=test_bug-14834 I, [2024-05-13T04:00:57.439821 #1530759] INFO -- : [577/885] 1571635=test_inlinecache I, [2024-05-13T04:00:57.504855 #1530759] INFO -- : [578/885] 1571635=test_socket I, [2024-05-13T04:00:57.925413 #1530759] INFO -- : [579/885] 1571636=test_terminfo I, [2024-05-13T04:00:57.937358 #1530759] INFO -- : [580/885] 1571636=test_thread I, [2024-05-13T04:00:58.468675 #1530759] INFO -- : [581/885] 1571635=test_time_tz I, [2024-05-13T04:00:58.572663 #1530759] INFO -- : [582/885] 1571635=test_addrinfo I, [2024-05-13T04:00:58.600349 #1530759] INFO -- : .Leaked file descriptor: TestSocketAddrinfo#test_addrinfo_timeout: 10 # I, [2024-05-13T04:00:58.629661 #1530759] INFO -- : COMMAND PID USER FD TYPE DEVICE SIZE/OFF NODE NAME I, [2024-05-13T04:00:58.629696 #1530759] INFO -- : ruby 1571635 opc 10u unix 0x0000000000000000 0t0 2958714704 type=STREAM I, [2024-05-13T04:00:58.698177 #1530759] INFO -- : [583/885] 1571635=test_to_ruby I, [2024-05-13T04:00:58.796568 #1530759] INFO -- : [584/885] 1571635=ruby_api_test I, [2024-05-13T04:00:58.861983 #1530759] INFO -- : [585/885] 1571635=test_gem_resolver_index_set I, [2024-05-13T04:00:58.910798 #1530759] INFO -- : [586/885] 1571635=test_webauthn_listener_response I, [2024-05-13T04:01:03.932345 #1530759] INFO -- : [587/885] 1571635=test_sleep I, [2024-05-13T04:01:03.999090 #1530759] INFO -- : [588/885] 1571635=test_set_len I, [2024-05-13T04:01:04.006416 #1530759] INFO -- : [589/885] 1571635=constant_path_node_test I, [2024-05-13T04:01:04.011659 #1530759] INFO -- : [590/885] 1571635=test_interned_str I, [2024-05-13T04:01:04.017036 #1530759] INFO -- : [591/885] 1571635=test_folderitem2_invokeverb I, [2024-05-13T04:01:04.040644 #1530759] INFO -- : [592/885] 1571635=test_pattern_matching I, [2024-05-13T04:01:04.062859 #1530759] INFO -- : [593/885] 1571635=test_gc I, [2024-05-13T04:01:06.784592 #1530759] INFO -- : [594/885] 1571636=test_gem_bundler_version_finder I, [2024-05-13T04:01:06.890939 #1530759] INFO -- : [595/885] 1571636=test_gem_request_set I, [2024-05-13T04:01:07.486344 #1530759] INFO -- : [596/885] 1571636=test_symbol I, [2024-05-13T04:01:07.512825 #1530759] INFO -- : [597/885] 1571636=test_project_sanity I, [2024-05-13T04:01:07.560719 #1530759] INFO -- : [598/885] 1571636=location_test I, [2024-05-13T04:01:07.604838 #1530759] INFO -- : [599/885] 1571636=test_delegate I, [2024-05-13T04:01:07.620266 #1530759] INFO -- : [600/885] 1571636=test_chilled I, [2024-05-13T04:01:07.680674 #1530759] INFO -- : [601/885] 1571636=test_ensured I, [2024-05-13T04:01:07.686929 #1530759] INFO -- : [602/885] 1571636=test_euc_jp I, [2024-05-13T04:01:07.699700 #1530759] INFO -- : [603/885] 1571636=test_key_stroke I, [2024-05-13T04:01:07.708397 #1530759] INFO -- : [604/885] 1571636=test_rdoc_markup I, [2024-05-13T04:01:07.715887 #1530759] INFO -- : [605/885] 1571636=test_alias_and_anchor I, [2024-05-13T04:01:07.728276 #1530759] INFO -- : [606/885] 1571636=test_time I, [2024-05-13T04:01:07.940257 #1530759] INFO -- : [607/885] 1571636=test_popen_deadlock I, [2024-05-13T04:01:08.490185 #1530759] INFO -- : [608/885] 1571636=test_rbconfig I, [2024-05-13T04:01:08.508102 #1530759] INFO -- : [609/885] 1571636=test_num2int I, [2024-05-13T04:01:08.518756 #1530759] INFO -- : [610/885] 1571636=test_iter_break I, [2024-05-13T04:01:08.547481 #1530759] INFO -- : [611/885] 1571636=test_extlibs I, [2024-05-13T04:01:10.340616 #1530759] INFO -- : [612/885] 1571636=test_gem_commands_signin_command I, [2024-05-13T04:01:10.547397 #1530759] INFO -- : [613/885] 1571636=test_range I, [2024-05-13T04:01:11.411509 #1530759] INFO -- : [614/885] 1571636=test_recursion I, [2024-05-13T04:01:11.430961 #1530759] INFO -- : [615/885] 1571636=test_require I, [2024-05-13T04:01:12.723963 #1530759] INFO -- : [616/885] 1571634=test_enum I, [2024-05-13T04:01:13.146863 #1530759] INFO -- : [617/885] 1571636=test_rdoc_markup_include I, [2024-05-13T04:01:13.155727 #1530759] INFO -- : [618/885] 1571636=test_address_resolve I, [2024-05-13T04:01:13.183168 #1530759] INFO -- : [619/885] 1571636=test_trick I, [2024-05-13T04:01:13.675184 #1530759] INFO -- : [620/885] 1571635=test_ractor I, [2024-05-13T04:01:13.684977 #1530759] INFO -- : [621/885] 1571635=test_stream I, [2024-05-13T04:01:13.697403 #1530759] INFO -- : [622/885] 1571635=test_rdoc_attr I, [2024-05-13T04:01:13.714826 #1530759] INFO -- : [623/885] 1571635=test_locale I, [2024-05-13T04:01:13.749158 #1530759] INFO -- : [624/885] 1571635=test_ts I, [2024-05-13T04:01:13.760723 #1530759] INFO -- : [625/885] 1571634=test_have_func I, [2024-05-13T04:01:14.033136 #1530759] INFO -- : [626/885] 1571635=test_date_marshal I, [2024-05-13T04:01:14.042799 #1530759] INFO -- : [627/885] 1571635=test_configuration I, [2024-05-13T04:01:14.161507 #1530759] INFO -- : [628/885] 1571635=test_gem_resolver_local_specification I, [2024-05-13T04:01:14.203959 #1530759] INFO -- : [629/885] 1571635=test_gem_commands_list_command I, [2024-05-13T04:01:14.215072 #1530759] INFO -- : [630/885] 1571635=test_date_new I, [2024-05-13T04:01:14.231095 #1530759] INFO -- : [631/885] 1571635=test_context I, [2024-05-13T04:01:14.358647 #1530759] INFO -- : [632/885] 1571635=test_udp I, [2024-05-13T04:01:14.382102 #1530759] INFO -- : [633/885] 1571635=test_gem_commands_contents_command I, [2024-05-13T04:01:14.525856 #1530759] INFO -- : [634/885] 1571635=test_rdoc_servlet I, [2024-05-13T04:01:14.653279 #1530759] INFO -- : [635/885] 1571635=test_coder I, [2024-05-13T04:01:14.692204 #1530759] INFO -- : [636/885] 1571635=test_symbol I, [2024-05-13T04:01:15.165798 #1530759] INFO -- : [637/885] 1571634=test_gem_commands_search_command I, [2024-05-13T04:01:15.172053 #1530759] INFO -- : [638/885] 1571634=test_formatter I, [2024-05-13T04:01:15.186603 #1530759] INFO -- : [639/885] 1571634=test_unix I, [2024-05-13T04:01:15.229520 #1530759] INFO -- : [640/885] 1571634=test_integer I, [2024-05-13T04:01:15.891858 #1530759] INFO -- : [641/885] 1571636=test_enc_str_buf_cat I, [2024-05-13T04:01:15.906383 #1530759] INFO -- : [642/885] 1571636=test_bignum I, [2024-05-13T04:01:17.941414 #1530759] INFO -- : [643/885] 1571634=newline_test I, [2024-05-13T04:01:18.087556 #1530759] INFO -- : [644/885] 1571634=test_rdoc_markup_hard_break I, [2024-05-13T04:01:18.104003 #1530759] INFO -- : [645/885] 1571634=test_marshal I, [2024-05-13T04:01:19.526729 #1530759] INFO -- : [646/885] 1571636=test_ancdata I, [2024-05-13T04:01:19.533231 #1530759] INFO -- : [647/885] 1571636=ractor_test I, [2024-05-13T04:01:19.587652 #1530759] INFO -- : [648/885] 1571634=test_nesting_parser I, [2024-05-13T04:01:19.610035 #1530759] INFO -- : [649/885] 1571634=test_gem_resolver_conflict I, [2024-05-13T04:01:19.621426 #1530759] INFO -- : [650/885] 1571636=test_ractor I, [2024-05-13T04:01:19.652762 #1530759] INFO -- : [651/885] 1571634=test_gem_commands_help_command I, [2024-05-13T04:01:19.757293 #1530759] INFO -- : [652/885] 1571634=test_scheduler I, [2024-05-13T04:01:19.905466 #1530759] INFO -- : [653/885] 1571634=test_ssl I, [2024-05-13T04:01:20.021632 #1530759] INFO -- : [654/885] 1571636=test_gem I, [2024-05-13T04:01:20.139167 #1530759] INFO -- : [655/885] 1571634=test_registry I, [2024-05-13T04:01:20.151841 #1530759] INFO -- : [656/885] 1571634=json_generator_test I, [2024-05-13T04:01:20.265465 #1530759] INFO -- : [657/885] 1571634=test_ansi_without_terminfo I, [2024-05-13T04:01:20.340664 #1530759] INFO -- : [658/885] 1571634=test_ractor I, [2024-05-13T04:01:20.356877 #1530759] INFO -- : [659/885] 1571634=test_parser I, [2024-05-13T04:01:20.369748 #1530759] INFO -- : [660/885] 1571634=test_rdoc_markup_to_label I, [2024-05-13T04:01:20.427822 #1530759] INFO -- : [661/885] 1571634=test_gem_resolver_best_set I, [2024-05-13T04:01:20.610854 #1530759] INFO -- : [662/885] 1571634=test_cgi_core I, [2024-05-13T04:01:20.619891 #1530759] INFO -- : [663/885] 1571634=test_gem_source_lock I, [2024-05-13T04:01:20.715062 #1530759] INFO -- : [664/885] 1571634=test_cipher I, [2024-05-13T04:01:20.746625 #1530759] INFO -- : [665/885] 1571634=test_update I, [2024-05-13T04:01:20.753612 #1530759] INFO -- : [666/885] 1571634=test_new I, [2024-05-13T04:01:20.760675 #1530759] INFO -- : [667/885] 1571634=test_rdoc_rd_inline_parser I, [2024-05-13T04:01:20.789045 #1530759] INFO -- : [668/885] 1571634=test_win32ole_type I, [2024-05-13T04:01:20.790926 #1530759] INFO -- : [669/885] 1571634=test_load I, [2024-05-13T04:01:20.802441 #1530759] INFO -- : [670/885] 1571634=test_rdoc_rd_block_parser I, [2024-05-13T04:01:20.868900 #1530759] INFO -- : [671/885] 1571634=test_x509store I, [2024-05-13T04:01:20.952901 #1530759] INFO -- : [672/885] 1571635=test_rdoc_rd I, [2024-05-13T04:01:20.965187 #1530759] INFO -- : [673/885] 1571635=test_rdoc_markup_to_markdown I, [2024-05-13T04:01:21.010362 #1530759] INFO -- : [674/885] 1571635=test_rdoc_markup_to_joined_paragraph I, [2024-05-13T04:01:21.021001 #1530759] INFO -- : [675/885] 1571635=test_rdoc_generator_pot I, [2024-05-13T04:01:21.044955 #1530759] INFO -- : [676/885] 1571635=test_require_lib I, [2024-05-13T04:01:21.350150 #1530759] INFO -- : [677/885] 1571634=test_gem_gem_runner I, [2024-05-13T04:01:21.416740 #1530759] INFO -- : [678/885] 1571634=test_metaclass I, [2024-05-13T04:01:21.425834 #1530759] INFO -- : [679/885] 1571634=test_objectspace I, [2024-05-13T04:01:22.391006 #1530759] INFO -- : [680/885] 1571634=test_require I, [2024-05-13T04:01:22.714572 #1530759] INFO -- : [681/885] 1571636=test_debugger_integration I, [2024-05-13T04:01:22.727095 #1530759] INFO -- : [682/885] 1571636=test_my_integer I, [2024-05-13T04:01:22.741737 #1530759] INFO -- : [683/885] 1571636=test_gem_resolver_composed_set I, [2024-05-13T04:01:22.766182 #1530759] INFO -- : [684/885] 1571636=test_tracer I, [2024-05-13T04:01:22.766886 #1530759] INFO -- : [685/885] 1571636=test_not I, [2024-05-13T04:01:22.784143 #1530759] INFO -- : [686/885] 1571636=test_cgi_cookie I, [2024-05-13T04:01:22.822703 #1530759] INFO -- : [687/885] 1571636=test_option I, [2024-05-13T04:01:22.923443 #1530759] INFO -- : [688/885] 1571636=test_rdoc_markup_attribute_manager I, [2024-05-13T04:01:22.971979 #1530759] INFO -- : [689/885] 1571636=test_wss I, [2024-05-13T04:01:22.989968 #1530759] INFO -- : [690/885] 1571636=test_gem_security_trust_dir I, [2024-05-13T04:01:23.132949 #1530759] INFO -- : [691/885] 1571636=test_module I, [2024-05-13T04:01:24.346233 #1530759] INFO -- : [692/885] 1571635=test_erb_command I, [2024-05-13T04:01:24.439524 #1530759] INFO -- : [693/885] 1571635=test_usrmarshal I, [2024-05-13T04:01:24.634772 #1530759] INFO -- : [694/885] 1571635=test_gem_validator I, [2024-05-13T04:01:24.668281 #1530759] INFO -- : [695/885] 1571635=test_gem_source_installed I, [2024-05-13T04:01:24.731069 #1530759] INFO -- : [696/885] 1571635=test_abi I, [2024-05-13T04:01:25.006697 #1530759] INFO -- : [697/885] 1571635=test_bundled_ca I, [2024-05-13T04:01:25.362935 #1530759] INFO -- : [698/885] 1571634=test_integer_comb I, [2024-05-13T04:01:26.961509 #1530759] INFO -- : [699/885] 1571635=test_load I, [2024-05-13T04:01:26.969401 #1530759] INFO -- : Leaked file descriptor: TestOptionParserLoad#test_load_nothing: 11 # I, [2024-05-13T04:01:26.996649 #1530759] INFO -- : COMMAND PID USER FD TYPE DEVICE SIZE/OFF NODE NAME I, [2024-05-13T04:01:26.996730 #1530759] INFO -- : ruby 1571635 opc 11r REG 252,0 9253600 13705411 /var/lib/sss/mc/passwd I, [2024-05-13T04:01:27.130579 #1530759] INFO -- : [700/885] 1571635=test_ssl I, [2024-05-13T04:01:27.652612 #1530759] INFO -- : [701/885] 1571636=test_gem_package_task I, [2024-05-13T04:01:27.723035 #1530759] INFO -- : [702/885] 1571636=test_lock_native_thread I, [2024-05-13T04:01:27.987623 #1530759] INFO -- : [703/885] 1571636=test_resize I, [2024-05-13T04:01:27.994189 #1530759] INFO -- : [704/885] 1571636=test_win32ole_param I, [2024-05-13T04:01:28.001234 #1530759] INFO -- : [705/885] 1571636=test_key_error I, [2024-05-13T04:01:28.023520 #1530759] INFO -- : [706/885] 1571636=test_engine I, [2024-05-13T04:01:28.225866 #1530759] INFO -- : [707/885] 1571634=test_fiber I, [2024-05-13T04:01:28.546268 #1530759] INFO -- : [708/885] 1571636=test_gem_commands_mirror I, [2024-05-13T04:01:28.555328 #1530759] INFO -- : [709/885] 1571636=test_rdoc_parser_markdown I, [2024-05-13T04:01:28.575430 #1530759] INFO -- : [710/885] 1571636=test_custom_command I, [2024-05-13T04:01:28.581366 #1530759] INFO -- : [711/885] 1571636=test_rubyvm I, [2024-05-13T04:01:28.586907 #1530759] INFO -- : [712/885] 1571636=fuzzer_test I, [2024-05-13T04:01:28.656705 #1530759] INFO -- : [713/885] 1571636=test_cparser I, [2024-05-13T04:01:30.741221 #1530759] INFO -- : [714/885] 1571636=static_inspect_test I, [2024-05-13T04:01:30.749686 #1530759] INFO -- : [715/885] 1571636=test_struct I, [2024-05-13T04:01:30.772532 #1530759] INFO -- : [716/885] 1571636=test_c_struct_entry I, [2024-05-13T04:01:31.588859 #1530759] INFO -- : [717/885] 1571636=test_config I, [2024-05-13T04:01:31.640700 #1530759] INFO -- : [718/885] 1571636=test_ostruct I, [2024-05-13T04:01:31.769055 #1530759] INFO -- : [719/885] 1571636=test_depth_first I, [2024-05-13T04:01:31.775235 #1530759] INFO -- : [720/885] 1571636=test_change_word I, [2024-05-13T04:01:31.791755 #1530759] INFO -- : [721/885] 1571636=test_ractor I, [2024-05-13T04:01:31.869758 #1530759] INFO -- : [722/885] 1571636=test_gem_resolver_installed_specification I, [2024-05-13T04:01:31.997577 #1530759] INFO -- : [723/885] 1571636=test_exception_at_throwing I, [2024-05-13T04:01:32.007526 #1530759] INFO -- : [724/885] 1571636=test_stringscanner I, [2024-05-13T04:01:32.091498 #1530759] INFO -- : [725/885] 1571636=test_fiddle I, [2024-05-13T04:01:32.253756 #1530759] INFO -- : [726/885] 1571636=json_generic_object_test I, [2024-05-13T04:01:32.265644 #1530759] INFO -- : [727/885] 1571636=test_gem_resolver_vendor_specification I, [2024-05-13T04:01:32.307801 #1530759] INFO -- : [728/885] 1571636=test_date_arith I, [2024-05-13T04:01:32.331774 #1530759] INFO -- : [729/885] 1571636=test_gem_safe_marshal I, [2024-05-13T04:01:33.475164 #1530759] INFO -- : [730/885] 1571636=test_rdoc_ri_driver I, [2024-05-13T04:01:34.005625 #1530759] INFO -- : [731/885] 1571636=test_ractor I, [2024-05-13T04:01:34.031944 #1530759] INFO -- : [732/885] 1571636=test_sexp I, [2024-05-13T04:01:34.048308 #1530759] INFO -- : [733/885] 1571636=test_httpheader I, [2024-05-13T04:01:34.063819 #1530759] INFO -- : [734/885] 1571636=test_signedness I, [2024-05-13T04:01:34.554205 #1530759] INFO -- : [735/885] 1571634=test_gem_resolver_git_set I, [2024-05-13T04:01:35.174467 #1530759] INFO -- : [736/885] 1571634=test_gem_commands_check_command I, [2024-05-13T04:01:35.209341 #1530759] INFO -- : [737/885] 1571634=test_digest I, [2024-05-13T04:01:35.828525 #1530759] INFO -- : [738/885] 1571636=test_dup I, [2024-05-13T04:01:35.976834 #1530759] INFO -- : [739/885] 1571634=test_rdoc_single_class I, [2024-05-13T04:01:35.983934 #1530759] INFO -- : [740/885] 1571636=test_acceptable I, [2024-05-13T04:01:35.984923 #1530759] INFO -- : [741/885] 1571634=test_gem_ext_cargo_builder_link_flag_converter I, [2024-05-13T04:01:36.060667 #1530759] INFO -- : [742/885] 1571636=test_gem_local_remote_options I, [2024-05-13T04:01:36.090399 #1530759] INFO -- : [743/885] 1571634=test_rdoc_token_stream I, [2024-05-13T04:01:36.097852 #1530759] INFO -- : [744/885] 1571634=test_mutex I, [2024-05-13T04:01:36.149386 #1530759] INFO -- : [745/885] 1571636=heredoc_dedent_test I, [2024-05-13T04:01:36.149739 #1530759] INFO -- : [746/885] 1571636=test_type I, [2024-05-13T04:01:36.166906 #1530759] INFO -- : [747/885] 1571636=test_tmpdir I, [2024-05-13T04:01:36.245341 #1530759] INFO -- : [748/885] 1571636=test_struct I, [2024-05-13T04:01:36.813731 #1530759] INFO -- : [749/885] 1571636=test_ssl_session I, [2024-05-13T04:01:37.244141 #1530759] INFO -- : [750/885] 1571634=test_gem_package_tar_header I, [2024-05-13T04:01:37.328640 #1530759] INFO -- : [751/885] 1571634=test_rational2 I, [2024-05-13T04:01:37.445447 #1530759] INFO -- : [752/885] 1571634=test_case_comprehensive I, [2024-05-13T04:01:37.568167 #1530759] INFO -- : [753/885] 1571635=test_logperiod I, [2024-05-13T04:01:37.576525 #1530759] INFO -- : [754/885] 1571635=test_placearg I, [2024-05-13T04:01:37.631830 #1530759] INFO -- : [755/885] 1571636=test_file_exhaustive I, [2024-05-13T04:01:37.684985 #1530759] INFO -- : [756/885] 1571635=test_completion I, [2024-05-13T04:01:38.871113 #1530759] INFO -- : [757/885] 1571635=parse_stream_test I, [2024-05-13T04:01:38.906974 #1530759] INFO -- : [758/885] 1571635=test_handle I, [2024-05-13T04:01:39.893806 #1530759] INFO -- : [759/885] 1571635=test_delete I, [2024-05-13T04:01:39.902919 #1530759] INFO -- : [760/885] 1571635=test_rdoc_markup_document I, [2024-05-13T04:01:39.926847 #1530759] INFO -- : [761/885] 1571635=test_gem_security_policy I, [2024-05-13T04:01:40.336806 #1530759] INFO -- : [762/885] 1571635=test_io_wait_uncommon I, [2024-05-13T04:01:40.348991 #1530759] INFO -- : [763/885] 1571635=test_gem_ci_detector I, [2024-05-13T04:01:40.360780 #1530759] INFO -- : [764/885] 1571635=test_continuation I, [2024-05-13T04:01:40.375181 #1530759] INFO -- : [765/885] 1571635=test_gem_silent_ui I, [2024-05-13T04:01:40.435070 #1530759] INFO -- : [766/885] 1571635=test_signal I, [2024-05-13T04:01:42.466565 #1530759] INFO -- : [767/885] 1571635=test_fixnum I, [2024-05-13T04:01:42.490841 #1530759] INFO -- : [768/885] 1571635=test_rdoc_markup_to_ansi I, [2024-05-13T04:01:42.543219 #1530759] INFO -- : [769/885] 1571635=test_protocol I, [2024-05-13T04:01:42.856685 #1530759] INFO -- : [770/885] 1571635=test_evaluation I, [2024-05-13T04:01:42.864135 #1530759] INFO -- : [771/885] 1571635=test_weakkeymap I, [2024-05-13T04:01:43.406551 #1530759] INFO -- : [772/885] 1571635=test_files_test I, [2024-05-13T04:01:43.424896 #1530759] INFO -- : [773/885] 1571635=test_https I, [2024-05-13T04:01:43.649010 #1530759] INFO -- : [774/885] 1571635=test_gem_commands_info_command I, [2024-05-13T04:01:43.660445 #1530759] INFO -- : [775/885] 1571635=test_object_create_start I, [2024-05-13T04:01:43.676988 #1530759] INFO -- : [776/885] 1571635=test_gem_request_set_gem_dependency_api I, [2024-05-13T04:01:43.971107 #1530759] INFO -- : [777/885] 1571635=test_name_error_extension I, [2024-05-13T04:01:44.022416 #1530759] INFO -- : [778/885] 1571635=test_irb I, [2024-05-13T04:01:44.327755 #1530759] INFO -- : [779/885] 1571635=test_rdoc_markup_paragraph I, [2024-05-13T04:01:44.338293 #1530759] INFO -- : [780/885] 1571635=test_x509cert I, [2024-05-13T04:01:44.427412 #1530759] INFO -- : [781/885] 1571635=test_require_path_check I, [2024-05-13T04:01:44.595302 #1530759] INFO -- : [782/885] 1571635=test_bn I, [2024-05-13T04:01:44.624385 #1530759] INFO -- : [783/885] 1571635=test_variable_name_check I, [2024-05-13T04:01:44.747250 #1530759] INFO -- : [784/885] 1571635=test_logdevice I, [2024-05-13T04:01:45.485772 #1530759] INFO -- : [785/885] 1571635=test_ast I, [2024-05-13T04:01:48.582199 #1530759] INFO -- : [786/885] 1571636=test_cgi_multipart I, [2024-05-13T04:01:48.664746 #1530759] INFO -- : [787/885] 1571636=test_lazy_enumerator I, [2024-05-13T04:01:49.138153 #1530759] INFO -- : [788/885] 1571636=test_gem_request_set_lockfile_tokenizer I, [2024-05-13T04:01:49.233709 #1530759] INFO -- : [789/885] 1571636=test_ractor_compatibility I, [2024-05-13T04:01:49.603019 #1530759] INFO -- : [790/885] 1571636=test_arithmetic_sequence I, [2024-05-13T04:01:49.616932 #1530759] INFO -- : [791/885] 1571636=integer_parse_test I, [2024-05-13T04:01:49.624324 #1530759] INFO -- : [792/885] 1571636=test_autoconf I, [2024-05-13T04:01:49.632048 #1530759] INFO -- : [793/885] 1571636=test_find_executable I, [2024-05-13T04:01:49.636085 #1530759] INFO -- : [794/885] 1571636=test_sockopt I, [2024-05-13T04:01:49.641287 #1530759] INFO -- : [795/885] 1571636=test_ftp I, [2024-05-13T04:01:49.658341 #1530759] INFO -- : [796/885] 1571636=test_gem_source_fetch_problem I, [2024-05-13T04:01:49.744154 #1530759] INFO -- : [797/885] 1571636=test_encoding I, [2024-05-13T04:01:49.870455 #1530759] INFO -- : [798/885] 1571636=test_install I, [2024-05-13T04:01:49.950451 #1530759] INFO -- : [799/885] 1571636=test_rdoc_comment I, [2024-05-13T04:01:49.989366 #1530759] INFO -- : [800/885] 1571636=command_line_test I, [2024-05-13T04:01:50.084194 #1530759] INFO -- : [801/885] 1571636=test_pair I, [2024-05-13T04:01:55.240691 #1530759] INFO -- : [802/885] 1571636=test_win32ole_variant_m I, [2024-05-13T04:01:55.249601 #1530759] INFO -- : [803/885] 1571636=test_gem_commands_signout_command I, [2024-05-13T04:01:55.341651 #1530759] INFO -- : [804/885] 1571636=test_gem_package_tar_reader I, [2024-05-13T04:01:55.405337 #1530759] INFO -- : [805/885] 1571636=test_env I, [2024-05-13T04:01:57.962762 #1530759] INFO -- : [806/885] 1571636=test_eval I, [2024-05-13T04:01:57.972700 #1530759] INFO -- : [807/885] 1571636=test_document I, [2024-05-13T04:01:58.047567 #1530759] INFO -- : [808/885] 1571636=test_gem_safe_yaml I, [2024-05-13T04:01:58.055302 #1530759] INFO -- : [809/885] 1571636=test_gem_commands_setup_command I, [2024-05-13T04:01:59.039368 #1530759] INFO -- : [810/885] 1571636=test_history I, [2024-05-13T04:01:59.065209 #1530759] INFO -- : [811/885] 1571636=test_singleton_function I, [2024-05-13T04:01:59.117573 #1530759] INFO -- : [812/885] 1571636=test_iseq I, [2024-05-13T04:01:59.648779 #1530759] INFO -- : [813/885] 1571634=test_primitive I, [2024-05-13T04:01:59.685805 #1530759] INFO -- : [814/885] 1571634=test_parser I, [2024-05-13T04:01:59.716801 #1530759] INFO -- : [815/885] 1571634=test_rdoc_ri_paths I, [2024-05-13T04:01:59.751280 #1530759] INFO -- : [816/885] 1571636=test_gem_source_git I, [2024-05-13T04:01:59.759528 #1530759] INFO -- : [817/885] 1571634=test_win32ole_method I, [2024-05-13T04:01:59.770241 #1530759] INFO -- : [818/885] 1571634=test_lexer I, [2024-05-13T04:01:59.788278 #1530759] INFO -- : [819/885] 1571634=test_regex_casefold I, [2024-05-13T04:02:00.291333 #1530759] INFO -- : [820/885] 1571634=test_ripper I, [2024-05-13T04:02:00.616677 #1530759] INFO -- : [821/885] 1571634=test_files_ext I, [2024-05-13T04:02:00.619556 #1530759] INFO -- : [822/885] 1571634=test_assembler I, [2024-05-13T04:02:00.632166 #1530759] INFO -- : [823/885] 1571634=test_stringio I, [2024-05-13T04:02:00.716359 #1530759] INFO -- : [824/885] 1571634=test_thread_cv I, [2024-05-13T04:02:00.832013 #1530759] INFO -- : [825/885] 1571636=test_random I, [2024-05-13T04:02:00.841359 #1530759] INFO -- : [826/885] 1571636=test_eval_history I, [2024-05-13T04:02:00.869916 #1530759] INFO -- : [827/885] 1571636=dispatcher_test I, [2024-05-13T04:02:00.876423 #1530759] INFO -- : [828/885] 1571636=test_unicode I, [2024-05-13T04:02:00.888667 #1530759] INFO -- : [829/885] 1571636=test_autoload I, [2024-05-13T04:02:01.372637 #1530759] INFO -- : [830/885] 1571634=test_gem_package I, [2024-05-13T04:02:02.303307 #1530759] INFO -- : [831/885] 1571634=test_array I, [2024-05-13T04:02:05.266427 #1530759] INFO -- : [832/885] 1571636=test_benchmark I, [2024-05-13T04:02:07.025127 #1530759] INFO -- : [833/885] 1571636=test_at_exit I, [2024-05-13T04:02:07.033194 #1530759] INFO -- : [834/885] 1571636=test_have_macro I, [2024-05-13T04:02:07.312422 #1530759] INFO -- : [835/885] 1571636=test_mkmf I, [2024-05-13T04:02:07.338984 #1530759] INFO -- : [836/885] 1571636=test_gem_source I, [2024-05-13T04:02:07.825755 #1530759] INFO -- : [837/885] 1571636=test_class I, [2024-05-13T04:02:07.841639 #1530759] INFO -- : [838/885] 1571636=test_scanner_events I, [2024-05-13T04:02:07.885270 #1530759] INFO -- : [839/885] 1571636=test_ocsp I, [2024-05-13T04:02:07.980712 #1530759] INFO -- : [840/885] 1571636=test_ipaddr I, [2024-05-13T04:02:08.014582 #1530759] INFO -- : [841/885] 1571636=test_omap I, [2024-05-13T04:02:08.120691 #1530759] INFO -- : [842/885] 1571636=test_date_strptime I, [2024-05-13T04:02:08.153527 #1530759] INFO -- : [843/885] 1571636=test_rdoc_generator_pot_po I, [2024-05-13T04:02:08.163022 #1530759] INFO -- : [844/885] 1571636=test_shellwords I, [2024-05-13T04:02:08.173474 #1530759] INFO -- : [845/885] 1571636=test_mul I, [2024-05-13T04:02:08.182215 #1530759] INFO -- : [846/885] 1571636=json_ext_parser_test I, [2024-05-13T04:02:08.206436 #1530759] INFO -- : [847/885] 1571636=test_gem_ext_configure_builder I, [2024-05-13T04:02:08.313559 #1530759] INFO -- : [848/885] 1571636=test_nonblock I, [2024-05-13T04:02:08.333366 #1530759] INFO -- : [849/885] 1571636=test_rdoc_parser_simple I, [2024-05-13T04:02:08.371474 #1530759] INFO -- : [850/885] 1571636=test_io_m17n I, [2024-05-13T04:02:09.687329 #1530759] INFO -- : [851/885] 1571636=test_rdoc_top_level I, [2024-05-13T04:02:09.929352 #1530759] INFO -- : [852/885] 1571636=test_cmethod I, [2024-05-13T04:02:09.932381 #1530759] INFO -- : [853/885] 1571636=test_float I, [2024-05-13T04:02:12.049413 #1530759] INFO -- : [854/885] 1571636=test_gem_stub_specification I, [2024-05-13T04:02:12.251890 #1530759] INFO -- : [855/885] 1571636=test_color I, [2024-05-13T04:02:12.315616 #1530759] INFO -- : [856/885] 1571636=test_propertyputref I, [2024-05-13T04:02:12.323335 #1530759] INFO -- : [857/885] 1571636=test_gb18030 I, [2024-05-13T04:02:12.339482 #1530759] INFO -- : [858/885] 1571636=test_gem_commands_lock_command I, [2024-05-13T04:02:12.377509 #1530759] INFO -- : [859/885] 1571636=test_reline_key I, [2024-05-13T04:02:12.535829 #1530759] INFO -- : [860/885] 1571636=test_unicode_normalize I, [2024-05-13T04:02:16.500709 #1530759] INFO -- : [861/885] 1571636=test_gem_stream_ui I, [2024-05-13T04:02:16.698177 #1530759] INFO -- : [862/885] 1571636=test_rdoc_generator_ri I, [2024-05-13T04:02:16.701447 #1530759] INFO -- : [863/885] 1571636=test_files_test_1 I, [2024-05-13T04:02:16.721247 #1530759] INFO -- : [864/885] 1571636=test_dir I, [2024-05-13T04:02:16.961595 #1530759] INFO -- : [865/885] 1571634=test_closure I, [2024-05-13T04:02:17.137816 #1530759] INFO -- : [866/885] 1571636=test_rubygems I, [2024-05-13T04:02:17.290685 #1530759] INFO -- : [867/885] 1571636=test_resolve_symbol I, [2024-05-13T04:02:17.367569 #1530759] INFO -- : [868/885] 1571636=test_path I, [2024-05-13T04:02:17.379663 #1530759] INFO -- : [869/885] 1571636=test_digest I, [2024-05-13T04:02:17.393412 #1530759] INFO -- : [870/885] 1571636=test_rdoc_rd_inline I, [2024-05-13T04:02:17.406200 #1530759] INFO -- : [871/885] 1571636=test_uncorrectable_name_check I, [2024-05-13T04:02:17.419785 #1530759] INFO -- : [872/885] 1571636=test_io I, [2024-05-13T04:02:19.877908 #1530759] INFO -- : [873/885] 1571634=test_x509attr I, [2024-05-13T04:02:19.893246 #1530759] INFO -- : [874/885] 1571634=test_printf I, [2024-05-13T04:02:19.917177 #1530759] INFO -- : [875/885] 1571634=test_workspace I, [2024-05-13T04:02:20.030362 #1530759] INFO -- : [876/885] 1571634=magic_comment_test I, [2024-05-13T04:02:20.038097 #1530759] INFO -- : [877/885] 1571634=test_win32ole_variant I, [2024-05-13T04:02:20.045230 #1530759] INFO -- : [878/885] 1571634=test_cgi_modruby I, [2024-05-13T04:02:20.047876 #1530759] INFO -- : [879/885] 1571634=test_win32ole_param_event I, [2024-05-13T04:02:20.059670 #1530759] INFO -- : [880/885] 1571634=test_https_proxy I, [2024-05-13T04:02:20.068960 #1530759] INFO -- : [881/885] 1571634=test_rdoc_parser I, [2024-05-13T04:02:20.105862 #1530759] INFO -- : [882/885] 1571634=test_gem_commands_rebuild_command I, [2024-05-13T04:02:20.192539 #1530759] INFO -- : [883/885] 1571634=test_nomethod_error I, [2024-05-13T04:02:20.197031 #1530759] INFO -- : [884/885] 1571634=test_etc I, [2024-05-13T04:02:20.302603 #1530759] INFO -- : [885/885] 1571634=test_stat I, [2024-05-13T04:02:33.015803 #1530759] INFO -- : Finished tests in 210.602720s, 124.9129 tests/s, 44409.5309 assertions/s. E, [2024-05-13T04:02:33.015975 #1530759] ERROR -- : Children under /tmp/rubytest.g4t9lk: E, [2024-05-13T04:02:33.016100 #1530759] ERROR -- : * drwx------ 4 28 2024-05-13 04:02:20 +0000 gem_rebuild20240513-1571634-t2kezg/ E, [2024-05-13T04:02:33.016130 #1530759] ERROR -- : * drwxrwxr-x 2 40 2024-05-13 04:02:20 +0000 old/ E, [2024-05-13T04:02:33.016163 #1530759] ERROR -- : * -rw-rw-r-- 1 4096 2024-05-13 04:02:20 +0000 rebuild_test_gem-1.0.0.gem E, [2024-05-13T04:02:33.016391 #1530759] ERROR -- : * drwxrwxr-x 2 40 2024-05-13 04:02:20 +0000 new/ E, [2024-05-13T04:02:33.016410 #1530759] ERROR -- : * -rw-rw-r-- 1 4096 2024-05-13 04:02:20 +0000 rebuild_test_gem-1.0.0.gem I, [2024-05-13T04:02:33.022456 #1530759] INFO -- : 26307 tests, 9352768 assertions, 0 failures, 0 errors, 320 skips I, [2024-05-13T04:02:33.022504 #1530759] INFO -- : I, [2024-05-13T04:02:33.022515 #1530759] INFO -- : ruby -v: ruby 3.4.0dev (2024-05-12T23:26:54Z master 3c16d93cd3) [aarch64-linux] I, [2024-05-13T04:02:33.023313 #1530759] INFO -- : $$$[end] "make yes-test-all TESTOPTS='--stderr-on-failure' TESTS='-j3'" exit with 0. I, [2024-05-13T04:02:33.023455 #1530759] INFO -- : $$$[beg] make yes-test-rubyspec MSPECOPT='--error-output stderr --debug -j' TESTS='-j3' I, [2024-05-13T04:02:33.148152 #1530759] INFO -- : BASERUBY = /usr/local/bin/ruby --disable=gems I, [2024-05-13T04:02:33.148229 #1530759] INFO -- : CC = gcc I, [2024-05-13T04:02:33.148241 #1530759] INFO -- : LD = ld I, [2024-05-13T04:02:33.148252 #1530759] INFO -- : LDSHARED = gcc -shared I, [2024-05-13T04:02:33.148262 #1530759] INFO -- : CFLAGS = -O3 -fno-fast-math -ggdb3 -Wall -Wextra -Wdeprecated-declarations -Wdiv-by-zero -Wduplicated-cond -Wimplicit-function-declaration -Wimplicit-int -Wpointer-arith -Wwrite-strings -Wold-style-definition -Wimplicit-fallthrough=0 -Wmissing-noreturn -Wno-cast-function-type -Wno-constant-logical-operand -Wno-long-long -Wno-missing-field-initializers -Wno-overlength-strings -Wno-packed-bitfield-compat -Wno-parentheses-equality -Wno-self-assign -Wno-tautological-compare -Wno-unused-parameter -Wno-unused-value -Wsuggest-attribute=format -Wsuggest-attribute=noreturn -Wunused-variable -Wmisleading-indentation -Wundef I, [2024-05-13T04:02:33.148271 #1530759] INFO -- : XCFLAGS = -U_FORTIFY_SOURCE -D_FORTIFY_SOURCE=2 -fstack-protector-strong -msign-return-address=all -fno-strict-overflow -fvisibility=hidden -fexcess-precision=standard -DRUBY_EXPORT -fPIE -I. -I.ext/include/aarch64-linux -I/home/opc/ruby/src/master/include -I/home/opc/ruby/src/master -I/home/opc/ruby/src/master/prism -I/home/opc/ruby/src/master/enc/unicode/15.0.0 I, [2024-05-13T04:02:33.148280 #1530759] INFO -- : CPPFLAGS = I, [2024-05-13T04:02:33.148289 #1530759] INFO -- : DLDFLAGS = -Wl,--compress-debug-sections=zlib -fstack-protector-strong -pie I, [2024-05-13T04:02:33.148298 #1530759] INFO -- : SOLIBS = -lz -lrt -lrt -ldl -lcrypt -lm -lpthread I, [2024-05-13T04:02:33.148306 #1530759] INFO -- : LANG = en_US.UTF-8 I, [2024-05-13T04:02:33.148314 #1530759] INFO -- : LC_ALL = I, [2024-05-13T04:02:33.148322 #1530759] INFO -- : LC_CTYPE = I, [2024-05-13T04:02:33.148330 #1530759] INFO -- : MFLAGS = I, [2024-05-13T04:02:33.148339 #1530759] INFO -- : RUSTC = rustc I, [2024-05-13T04:02:33.148348 #1530759] INFO -- : YJIT_RUSTC_ARGS = --crate-name=yjit --crate-type=staticlib --edition=2021 -g -C lto=thin -C opt-level=3 -C overflow-checks=on '--out-dir=/home/opc/ruby/build/master/yjit/target/release/' /home/opc/ruby/src/master/yjit/src/lib.rs I, [2024-05-13T04:02:33.149014 #1530759] INFO -- : gcc (GCC) 8.5.0 20210514 (Red Hat 8.5.0-10.1.0.1) I, [2024-05-13T04:02:33.149037 #1530759] INFO -- : Copyright (C) 2018 Free Software Foundation, Inc. I, [2024-05-13T04:02:33.149047 #1530759] INFO -- : This is free software; see the source for copying conditions. There is NO I, [2024-05-13T04:02:33.149056 #1530759] INFO -- : warranty; not even for MERCHANTABILITY or FITNESS FOR A PARTICULAR PURPOSE. I, [2024-05-13T04:02:33.149065 #1530759] INFO -- : I, [2024-05-13T04:02:33.151156 #1530759] INFO -- : generating enc.mk I, [2024-05-13T04:02:33.383635 #1530759] INFO -- : generating encdb.h I, [2024-05-13T04:02:33.422117 #1530759] INFO -- : encdb.h unchanged I, [2024-05-13T04:02:33.423306 #1530759] INFO -- : making enc I, [2024-05-13T04:02:33.450439 #1530759] INFO -- : make[1]: Entering directory '/home/opc/ruby/build/master' I, [2024-05-13T04:02:33.450489 #1530759] INFO -- : make[1]: Nothing to be done for 'enc'. I, [2024-05-13T04:02:33.450500 #1530759] INFO -- : make[1]: Leaving directory '/home/opc/ruby/build/master' I, [2024-05-13T04:02:33.451254 #1530759] INFO -- : making srcs under enc I, [2024-05-13T04:02:33.493312 #1530759] INFO -- : make[1]: Entering directory '/home/opc/ruby/build/master' I, [2024-05-13T04:02:33.493389 #1530759] INFO -- : make[1]: Nothing to be done for 'srcs'. I, [2024-05-13T04:02:33.493400 #1530759] INFO -- : make[1]: Leaving directory '/home/opc/ruby/build/master' I, [2024-05-13T04:02:33.494494 #1530759] INFO -- : generating transdb.h I, [2024-05-13T04:02:33.638340 #1530759] INFO -- : transdb.h unchanged I, [2024-05-13T04:02:33.639660 #1530759] INFO -- : making trans I, [2024-05-13T04:02:33.688923 #1530759] INFO -- : make[1]: Entering directory '/home/opc/ruby/build/master' I, [2024-05-13T04:02:33.688991 #1530759] INFO -- : make[1]: Nothing to be done for 'trans'. I, [2024-05-13T04:02:33.689003 #1530759] INFO -- : make[1]: Leaving directory '/home/opc/ruby/build/master' I, [2024-05-13T04:02:33.690029 #1530759] INFO -- : making encs I, [2024-05-13T04:02:33.742224 #1530759] INFO -- : make[1]: Entering directory '/home/opc/ruby/build/master' I, [2024-05-13T04:02:33.742287 #1530759] INFO -- : make[1]: Nothing to be done for 'encs'. I, [2024-05-13T04:02:33.742299 #1530759] INFO -- : make[1]: Leaving directory '/home/opc/ruby/build/master' I, [2024-05-13T04:02:33.744291 #1530759] INFO -- : generating makefiles ext/configure-ext.mk I, [2024-05-13T04:02:33.783269 #1530759] INFO -- : ext/configure-ext.mk updated I, [2024-05-13T04:02:33.786977 #1530759] INFO -- : make[1]: Entering directory '/home/opc/ruby/build/master' I, [2024-05-13T04:02:35.829469 #1530759] INFO -- : make[1]: Leaving directory '/home/opc/ruby/build/master' I, [2024-05-13T04:02:35.830209 #1530759] INFO -- : generating makefile exts.mk I, [2024-05-13T04:02:35.888454 #1530759] INFO -- : exts.mk unchanged I, [2024-05-13T04:02:35.893298 #1530759] INFO -- : make[1]: Entering directory '/home/opc/ruby/build/master' I, [2024-05-13T04:02:36.188880 #1530759] INFO -- : make[2]: Entering directory '/home/opc/ruby/build/master/ext/coverage' I, [2024-05-13T04:02:36.193455 #1530759] INFO -- : make[2]: Leaving directory '/home/opc/ruby/build/master/ext/coverage' I, [2024-05-13T04:02:36.199031 #1530759] INFO -- : make[2]: Entering directory '/home/opc/ruby/build/master/ext/date' I, [2024-05-13T04:02:36.204073 #1530759] INFO -- : make[2]: Leaving directory '/home/opc/ruby/build/master/ext/date' I, [2024-05-13T04:02:36.207326 #1530759] INFO -- : make[2]: Entering directory '/home/opc/ruby/build/master/ext/digest' I, [2024-05-13T04:02:36.215940 #1530759] INFO -- : make[2]: Leaving directory '/home/opc/ruby/build/master/ext/digest' I, [2024-05-13T04:02:36.237735 #1530759] INFO -- : make[2]: Entering directory '/home/opc/ruby/build/master/ext/digest/sha2' I, [2024-05-13T04:02:36.242537 #1530759] INFO -- : make[2]: Leaving directory '/home/opc/ruby/build/master/ext/digest/sha2' I, [2024-05-13T04:02:36.260724 #1530759] INFO -- : make[2]: Entering directory '/home/opc/ruby/build/master/ext/fiddle' I, [2024-05-13T04:02:36.270718 #1530759] INFO -- : make[2]: Leaving directory '/home/opc/ruby/build/master/ext/fiddle' I, [2024-05-13T04:02:36.274906 #1530759] INFO -- : make[2]: Entering directory '/home/opc/ruby/build/master/ext/io/console' I, [2024-05-13T04:02:36.279142 #1530759] INFO -- : make[2]: Leaving directory '/home/opc/ruby/build/master/ext/io/console' I, [2024-05-13T04:02:36.289834 #1530759] INFO -- : make[2]: Entering directory '/home/opc/ruby/build/master/ext/json' I, [2024-05-13T04:02:36.299139 #1530759] INFO -- : make[2]: Leaving directory '/home/opc/ruby/build/master/ext/json' I, [2024-05-13T04:02:36.311846 #1530759] INFO -- : make[2]: Entering directory '/home/opc/ruby/build/master/ext/monitor' I, [2024-05-13T04:02:36.315966 #1530759] INFO -- : make[2]: Leaving directory '/home/opc/ruby/build/master/ext/monitor' I, [2024-05-13T04:02:36.321962 #1530759] INFO -- : make[2]: Entering directory '/home/opc/ruby/build/master/ext/objspace' I, [2024-05-13T04:02:36.327763 #1530759] INFO -- : make[2]: Leaving directory '/home/opc/ruby/build/master/ext/objspace' I, [2024-05-13T04:02:36.346738 #1530759] INFO -- : make[2]: Entering directory '/home/opc/ruby/build/master/ext/openssl' I, [2024-05-13T04:02:36.368413 #1530759] INFO -- : make[2]: Leaving directory '/home/opc/ruby/build/master/ext/openssl' I, [2024-05-13T04:02:36.372529 #1530759] INFO -- : make[2]: Entering directory '/home/opc/ruby/build/master/ext/pathname' I, [2024-05-13T04:02:36.376730 #1530759] INFO -- : make[2]: Leaving directory '/home/opc/ruby/build/master/ext/pathname' I, [2024-05-13T04:02:36.382950 #1530759] INFO -- : make[2]: Entering directory '/home/opc/ruby/build/master/ext/psych' I, [2024-05-13T04:02:36.404156 #1530759] INFO -- : make[2]: Leaving directory '/home/opc/ruby/build/master/ext/psych' I, [2024-05-13T04:02:36.408483 #1530759] INFO -- : make[2]: Entering directory '/home/opc/ruby/build/master/ext/pty' I, [2024-05-13T04:02:36.412708 #1530759] INFO -- : make[2]: Leaving directory '/home/opc/ruby/build/master/ext/pty' I, [2024-05-13T04:02:36.426236 #1530759] INFO -- : make[2]: Entering directory '/home/opc/ruby/build/master/ext/ripper' I, [2024-05-13T04:02:36.434133 #1530759] INFO -- : make[2]: Leaving directory '/home/opc/ruby/build/master/ext/ripper' I, [2024-05-13T04:02:36.436132 #1530759] INFO -- : make[2]: Entering directory '/home/opc/ruby/build/master/ext/rubyvm' I, [2024-05-13T04:02:36.439642 #1530759] INFO -- : make[2]: Leaving directory '/home/opc/ruby/build/master/ext/rubyvm' I, [2024-05-13T04:02:36.451714 #1530759] INFO -- : make[2]: Entering directory '/home/opc/ruby/build/master/ext/socket' I, [2024-05-13T04:02:36.462453 #1530759] INFO -- : make[2]: Leaving directory '/home/opc/ruby/build/master/ext/socket' I, [2024-05-13T04:02:36.477850 #1530759] INFO -- : make[2]: Entering directory '/home/opc/ruby/build/master/.bundle/gems/bigdecimal-3.1.7/ext/bigdecimal' I, [2024-05-13T04:02:36.507990 #1530759] INFO -- : make[2]: Leaving directory '/home/opc/ruby/build/master/.bundle/gems/bigdecimal-3.1.7/ext/bigdecimal' I, [2024-05-13T04:02:36.510895 #1530759] INFO -- : make[2]: Entering directory '/home/opc/ruby/build/master/.bundle/gems/bigdecimal-3.1.8/ext/bigdecimal' I, [2024-05-13T04:02:36.541184 #1530759] INFO -- : make[2]: Leaving directory '/home/opc/ruby/build/master/.bundle/gems/bigdecimal-3.1.8/ext/bigdecimal' I, [2024-05-13T04:02:36.543813 #1530759] INFO -- : make[2]: Entering directory '/home/opc/ruby/build/master/.bundle/gems/debug-1.9.2/ext/debug' I, [2024-05-13T04:02:36.573946 #1530759] INFO -- : make[2]: Leaving directory '/home/opc/ruby/build/master/.bundle/gems/debug-1.9.2/ext/debug' I, [2024-05-13T04:02:36.576399 #1530759] INFO -- : make[2]: Entering directory '/home/opc/ruby/build/master/.bundle/gems/nkf-0.2.0/ext/nkf' I, [2024-05-13T04:02:36.606470 #1530759] INFO -- : make[2]: Leaving directory '/home/opc/ruby/build/master/.bundle/gems/nkf-0.2.0/ext/nkf' I, [2024-05-13T04:02:36.608989 #1530759] INFO -- : make[2]: Entering directory '/home/opc/ruby/build/master/.bundle/gems/racc-1.7.3/ext/racc/cparse' I, [2024-05-13T04:02:36.639314 #1530759] INFO -- : make[2]: Leaving directory '/home/opc/ruby/build/master/.bundle/gems/racc-1.7.3/ext/racc/cparse' I, [2024-05-13T04:02:36.642348 #1530759] INFO -- : make[2]: Entering directory '/home/opc/ruby/build/master/.bundle/gems/rbs-3.4.4/ext/rbs_extension' I, [2024-05-13T04:02:36.672393 #1530759] INFO -- : make[2]: Leaving directory '/home/opc/ruby/build/master/.bundle/gems/rbs-3.4.4/ext/rbs_extension' I, [2024-05-13T04:02:36.674934 #1530759] INFO -- : make[2]: Entering directory '/home/opc/ruby/build/master/.bundle/gems/syslog-0.1.2/ext/syslog' I, [2024-05-13T04:02:36.705374 #1530759] INFO -- : make[2]: Leaving directory '/home/opc/ruby/build/master/.bundle/gems/syslog-0.1.2/ext/syslog' I, [2024-05-13T04:02:36.743340 #1530759] INFO -- : make[2]: Entering directory '/home/opc/ruby/build/master' I, [2024-05-13T04:02:36.826762 #1530759] INFO -- : make[2]: 'ruby' is up to date. I, [2024-05-13T04:02:36.826839 #1530759] INFO -- : make[2]: Leaving directory '/home/opc/ruby/build/master' I, [2024-05-13T04:02:36.826964 #1530759] INFO -- : make[1]: Leaving directory '/home/opc/ruby/build/master' I, [2024-05-13T04:02:36.831317 #1530759] INFO -- : make[1]: Entering directory '/home/opc/ruby/build/master' I, [2024-05-13T04:02:36.831391 #1530759] INFO -- : make[1]: Nothing to be done for 'note'. I, [2024-05-13T04:02:36.831404 #1530759] INFO -- : make[1]: Leaving directory '/home/opc/ruby/build/master' E, [2024-05-13T04:02:36.906957 #1530759] ERROR -- : $ /home/opc/ruby/build/master/miniruby -I/home/opc/ruby/src/master/lib /home/opc/ruby/src/master/tool/runruby.rb --archdir=/home/opc/ruby/build/master --extout=.ext -- /home/opc/ruby/src/master/spec/mspec/bin/mspec-run -B /home/opc/ruby/src/master/spec/default.mspec --error-output stderr --debug -fy -o /tmp/rubytest.an40o8/1-mspec-multi-0 E, [2024-05-13T04:02:36.907341 #1530759] ERROR -- : $ /home/opc/ruby/build/master/miniruby -I/home/opc/ruby/src/master/lib /home/opc/ruby/src/master/tool/runruby.rb --archdir=/home/opc/ruby/build/master --extout=.ext -- /home/opc/ruby/src/master/spec/mspec/bin/mspec-run -B /home/opc/ruby/src/master/spec/default.mspec --error-output stderr --debug -fy -o /tmp/rubytest.an40o8/2-mspec-multi-1 E, [2024-05-13T04:02:36.907613 #1530759] ERROR -- : $ /home/opc/ruby/build/master/miniruby -I/home/opc/ruby/src/master/lib /home/opc/ruby/src/master/tool/runruby.rb --archdir=/home/opc/ruby/build/master --extout=.ext -- /home/opc/ruby/src/master/spec/mspec/bin/mspec-run -B /home/opc/ruby/src/master/spec/default.mspec --error-output stderr --debug -fy -o /tmp/rubytest.an40o8/3-mspec-multi-2 I, [2024-05-13T04:02:37.039698 #1530759] INFO -- : ruby 3.4.0dev (2024-05-12T23:26:54Z master 3c16d93cd3) [aarch64-linux] I, [2024-05-13T04:02:42.371302 #1530759] INFO -- : 0 ......................................................................... I, [2024-05-13T04:02:44.814874 #1530759] INFO -- : 73 ......................................................................... I, [2024-05-13T04:02:44.985935 #1530759] INFO -- : 146 ......................................................................... I, [2024-05-13T04:02:45.281163 #1530759] INFO -- : 219 ......................................................................... I, [2024-05-13T04:02:45.443109 #1530759] INFO -- : 292 ......................................................................... I, [2024-05-13T04:02:45.684162 #1530759] INFO -- : 365 ......................................................................... I, [2024-05-13T04:02:45.821417 #1530759] INFO -- : 438 ......................................................................... I, [2024-05-13T04:02:45.925368 #1530759] INFO -- : 511 ......................................................................... I, [2024-05-13T04:02:45.991600 #1530759] INFO -- : 584 ......................................................................... I, [2024-05-13T04:02:46.596535 #1530759] INFO -- : 657 ......................................................................... I, [2024-05-13T04:02:46.694764 #1530759] INFO -- : 730 ......................................................................... I, [2024-05-13T04:02:46.741985 #1530759] INFO -- : 803 ......................................................................... I, [2024-05-13T04:02:46.953807 #1530759] INFO -- : 876 ......................................................................... I, [2024-05-13T04:02:47.065744 #1530759] INFO -- : 949 ......................................................................... I, [2024-05-13T04:02:47.680245 #1530759] INFO -- : 1022 ......................................................................... I, [2024-05-13T04:02:50.034361 #1530759] INFO -- : 1095 ......................................................................... I, [2024-05-13T04:02:50.842220 #1530759] INFO -- : 1168 ......................................................................... I, [2024-05-13T04:02:51.007590 #1530759] INFO -- : 1241 ......................................................................... I, [2024-05-13T04:02:51.178316 #1530759] INFO -- : 1314 ......................................................................... I, [2024-05-13T04:02:51.275846 #1530759] INFO -- : 1387 ......................................................................... I, [2024-05-13T04:02:53.347916 #1530759] INFO -- : 1460 ......................................................................... I, [2024-05-13T04:02:56.719904 #1530759] INFO -- : 1533 ......................................................................... I, [2024-05-13T04:02:56.899521 #1530759] INFO -- : 1606 ......................................................................... I, [2024-05-13T04:02:57.734532 #1530759] INFO -- : 1679 ......................................................................... I, [2024-05-13T04:02:57.995561 #1530759] INFO -- : 1752 ......................................................................... I, [2024-05-13T04:02:58.244766 #1530759] INFO -- : 1825 ......................................................................... I, [2024-05-13T04:02:58.562127 #1530759] INFO -- : 1898 ......................................................................... I, [2024-05-13T04:02:58.975295 #1530759] INFO -- : 1971 ......................................................................... I, [2024-05-13T04:02:59.488912 #1530759] INFO -- : 2044 ......................................................................... I, [2024-05-13T04:02:59.568921 #1530759] INFO -- : 2117 ......................................................................... I, [2024-05-13T04:02:59.635091 #1530759] INFO -- : 2190 ......................................................................... I, [2024-05-13T04:02:59.686622 #1530759] INFO -- : 2263 ......................................................................... I, [2024-05-13T04:02:59.741040 #1530759] INFO -- : 2336 ......................................................................... I, [2024-05-13T04:02:59.845019 #1530759] INFO -- : 2409 ......................................................................... I, [2024-05-13T04:03:00.133850 #1530759] INFO -- : 2482 ......................................................................... I, [2024-05-13T04:03:00.270373 #1530759] INFO -- : 2555 ......................................................................... I, [2024-05-13T04:03:01.579793 #1530759] INFO -- : 2628 ......................................................................... I, [2024-05-13T04:03:01.773523 #1530759] INFO -- : 2701 ......................................................................... I, [2024-05-13T04:03:01.914071 #1530759] INFO -- : 2774 ......................................................................... I, [2024-05-13T04:03:02.243635 #1530759] INFO -- : 2847 ......................................................................... I, [2024-05-13T04:03:02.520230 #1530759] INFO -- : 2920 ......................................................................... I, [2024-05-13T04:03:02.646384 #1530759] INFO -- : 2993 ......................................................................... I, [2024-05-13T04:03:02.717191 #1530759] INFO -- : 3066 ......................................................................... I, [2024-05-13T04:03:02.770538 #1530759] INFO -- : 3139 ......................................................................... I, [2024-05-13T04:03:02.837021 #1530759] INFO -- : 3212 ......................................................................... I, [2024-05-13T04:03:02.911980 #1530759] INFO -- : 3285 ......................................................................... I, [2024-05-13T04:03:06.741449 #1530759] INFO -- : 3358 ........................................................................ I, [2024-05-13T04:03:06.741523 #1530759] INFO -- : I, [2024-05-13T04:03:06.741536 #1530759] INFO -- : Finished in 29.834338 seconds I, [2024-05-13T04:03:06.741545 #1530759] INFO -- : I, [2024-05-13T04:03:06.741554 #1530759] INFO -- : 3429 files, 32607 examples, 183831 expectations, 0 failures, 0 errors, 0 tagged I, [2024-05-13T04:03:06.742861 #1530759] INFO -- : $$$[end] "make yes-test-rubyspec MSPECOPT='--error-output stderr --debug -j' TESTS='-j3'" exit with 0.