# Logfile created on 2024-05-12 14:23:59 +0000 by logger.rb/v1.5.3 I, [2024-05-12T14:23:59.646692 #3956611] INFO -- : #, @formatter=nil, @logdev=#, @binmode=false, @mon_data=#, @mon_data_owner_object_id=860>>> I, [2024-05-12T14:23:59.648001 #3956611] INFO -- : $$$[beg] make update-unicode -j3 I, [2024-05-12T14:23:59.737478 #3956611] INFO -- : Downloading Unicode emoji 15.0 files... I, [2024-05-12T14:23:59.737792 #3956611] INFO -- : Downloading Unicode emoji 15.0 files... I, [2024-05-12T14:23:59.737938 #3956611] INFO -- : Downloading Unicode emoji 15.0 files... I, [2024-05-12T14:23:59.813706 #3956611] INFO -- : made symlink emoji/15.0/emoji-sequences.txt to /home/opc/ruby/src/master/.downloaded-cache/emoji/15.0/emoji-sequences.txt I, [2024-05-12T14:23:59.815981 #3956611] INFO -- : downloading emoji/15.0/emoji-test.txt ... /home/opc/ruby/src/master/enc/unicode/data/emoji/15.0/emoji-sequences.txt already exists I, [2024-05-12T14:23:59.817731 #3956611] INFO -- : downloading emoji/15.0/emoji-test.txt ... /home/opc/ruby/src/master/enc/unicode/data/emoji/15.0/emoji-sequences.txt already exists E, [2024-05-12T14:24:00.303338 #3956611] ERROR -- : /home/opc/ruby/src/master/tool/downloader.rb:302:in `rescue in download': failed to download emoji/15.0/emoji-test.txt (RuntimeError) E, [2024-05-12T14:24:00.303402 #3956611] ERROR -- : OpenURI::HTTPError: 403 Forbidden: https://www.unicode.org/Public/emoji/15.0/emoji-test.txt E, [2024-05-12T14:24:00.303413 #3956611] ERROR -- : from /home/opc/ruby/src/master/tool/downloader.rb:201:in `download' E, [2024-05-12T14:24:00.303423 #3956611] ERROR -- : from /home/opc/ruby/src/master/tool/downloader.rb:136:in `download' E, [2024-05-12T14:24:00.303431 #3956611] ERROR -- : from /home/opc/ruby/src/master/tool/downloader.rb:482:in `block in
' E, [2024-05-12T14:24:00.303439 #3956611] ERROR -- : from /home/opc/ruby/src/master/tool/downloader.rb:465:in `each' E, [2024-05-12T14:24:00.303448 #3956611] ERROR -- : from /home/opc/ruby/src/master/tool/downloader.rb:465:in `
' E, [2024-05-12T14:24:00.303456 #3956611] ERROR -- : /usr/local/lib/ruby/3.2.0/open-uri.rb:369:in `open_http': 403 Forbidden (OpenURI::HTTPError) E, [2024-05-12T14:24:00.303464 #3956611] ERROR -- : from /usr/local/lib/ruby/3.2.0/open-uri.rb:760:in `buffer_open' E, [2024-05-12T14:24:00.303472 #3956611] ERROR -- : from /usr/local/lib/ruby/3.2.0/open-uri.rb:214:in `block in open_loop' E, [2024-05-12T14:24:00.303480 #3956611] ERROR -- : from /usr/local/lib/ruby/3.2.0/open-uri.rb:212:in `catch' E, [2024-05-12T14:24:00.303488 #3956611] ERROR -- : from /usr/local/lib/ruby/3.2.0/open-uri.rb:212:in `open_loop' E, [2024-05-12T14:24:00.303496 #3956611] ERROR -- : from /usr/local/lib/ruby/3.2.0/open-uri.rb:153:in `open_uri' E, [2024-05-12T14:24:00.303504 #3956611] ERROR -- : from /usr/local/lib/ruby/3.2.0/open-uri.rb:740:in `open' E, [2024-05-12T14:24:00.303515 #3956611] ERROR -- : from /usr/local/lib/ruby/3.2.0/open-uri.rb:748:in `read' E, [2024-05-12T14:24:00.303523 #3956611] ERROR -- : from /home/opc/ruby/src/master/tool/downloader.rb:247:in `block in download' E, [2024-05-12T14:24:00.303532 #3956611] ERROR -- : from /home/opc/ruby/src/master/tool/downloader.rb:378:in `with_retry' E, [2024-05-12T14:24:00.303540 #3956611] ERROR -- : from /home/opc/ruby/src/master/tool/downloader.rb:246:in `download' E, [2024-05-12T14:24:00.303548 #3956611] ERROR -- : from /home/opc/ruby/src/master/tool/downloader.rb:136:in `download' E, [2024-05-12T14:24:00.303556 #3956611] ERROR -- : from /home/opc/ruby/src/master/tool/downloader.rb:482:in `block in
' E, [2024-05-12T14:24:00.303564 #3956611] ERROR -- : from /home/opc/ruby/src/master/tool/downloader.rb:465:in `each' E, [2024-05-12T14:24:00.303572 #3956611] ERROR -- : from /home/opc/ruby/src/master/tool/downloader.rb:465:in `
' E, [2024-05-12T14:24:00.306388 #3956611] ERROR -- : make: *** [uncommon.mk:1765: /home/opc/ruby/src/master/enc/unicode/data/emoji/15.0/emoji-zwj-sequences.txt] Error 1 E, [2024-05-12T14:24:00.306422 #3956611] ERROR -- : make: *** Waiting for unfinished jobs.... E, [2024-05-12T14:24:00.321949 #3956611] ERROR -- : /home/opc/ruby/src/master/tool/downloader.rb:302:in `rescue in download': failed to download emoji/15.0/emoji-test.txt (RuntimeError) E, [2024-05-12T14:24:00.321978 #3956611] ERROR -- : OpenURI::HTTPError: 403 Forbidden: https://www.unicode.org/Public/emoji/15.0/emoji-test.txt E, [2024-05-12T14:24:00.321990 #3956611] ERROR -- : from /home/opc/ruby/src/master/tool/downloader.rb:201:in `download' E, [2024-05-12T14:24:00.321999 #3956611] ERROR -- : from /home/opc/ruby/src/master/tool/downloader.rb:136:in `download' E, [2024-05-12T14:24:00.322007 #3956611] ERROR -- : from /home/opc/ruby/src/master/tool/downloader.rb:482:in `block in
' E, [2024-05-12T14:24:00.322015 #3956611] ERROR -- : from /home/opc/ruby/src/master/tool/downloader.rb:465:in `each' E, [2024-05-12T14:24:00.322023 #3956611] ERROR -- : from /home/opc/ruby/src/master/tool/downloader.rb:465:in `
' E, [2024-05-12T14:24:00.322031 #3956611] ERROR -- : /usr/local/lib/ruby/3.2.0/open-uri.rb:369:in `open_http': 403 Forbidden (OpenURI::HTTPError) E, [2024-05-12T14:24:00.322039 #3956611] ERROR -- : from /usr/local/lib/ruby/3.2.0/open-uri.rb:760:in `buffer_open' E, [2024-05-12T14:24:00.322046 #3956611] ERROR -- : from /usr/local/lib/ruby/3.2.0/open-uri.rb:214:in `block in open_loop' E, [2024-05-12T14:24:00.322055 #3956611] ERROR -- : from /usr/local/lib/ruby/3.2.0/open-uri.rb:212:in `catch' E, [2024-05-12T14:24:00.322063 #3956611] ERROR -- : from /usr/local/lib/ruby/3.2.0/open-uri.rb:212:in `open_loop' E, [2024-05-12T14:24:00.322071 #3956611] ERROR -- : from /usr/local/lib/ruby/3.2.0/open-uri.rb:153:in `open_uri' E, [2024-05-12T14:24:00.322079 #3956611] ERROR -- : from /usr/local/lib/ruby/3.2.0/open-uri.rb:740:in `open' E, [2024-05-12T14:24:00.322087 #3956611] ERROR -- : from /usr/local/lib/ruby/3.2.0/open-uri.rb:748:in `read' E, [2024-05-12T14:24:00.322095 #3956611] ERROR -- : from /home/opc/ruby/src/master/tool/downloader.rb:247:in `block in download' E, [2024-05-12T14:24:00.322103 #3956611] ERROR -- : from /home/opc/ruby/src/master/tool/downloader.rb:378:in `with_retry' E, [2024-05-12T14:24:00.322111 #3956611] ERROR -- : from /home/opc/ruby/src/master/tool/downloader.rb:246:in `download' E, [2024-05-12T14:24:00.322119 #3956611] ERROR -- : from /home/opc/ruby/src/master/tool/downloader.rb:136:in `download' E, [2024-05-12T14:24:00.322127 #3956611] ERROR -- : from /home/opc/ruby/src/master/tool/downloader.rb:482:in `block in
' E, [2024-05-12T14:24:00.322135 #3956611] ERROR -- : from /home/opc/ruby/src/master/tool/downloader.rb:465:in `each' E, [2024-05-12T14:24:00.322143 #3956611] ERROR -- : from /home/opc/ruby/src/master/tool/downloader.rb:465:in `
' E, [2024-05-12T14:24:00.324944 #3956611] ERROR -- : make: *** [uncommon.mk:1765: /home/opc/ruby/src/master/enc/unicode/data/emoji/15.0/emoji-sequences.txt] Error 1 E, [2024-05-12T14:24:00.324982 #3956611] ERROR -- : make: *** Deleting file '/home/opc/ruby/src/master/enc/unicode/data/emoji/15.0/emoji-sequences.txt' E, [2024-05-12T14:24:00.419144 #3956611] ERROR -- : /home/opc/ruby/src/master/tool/downloader.rb:302:in `rescue in download': failed to download emoji/15.0/emoji-test.txt (RuntimeError) E, [2024-05-12T14:24:00.419207 #3956611] ERROR -- : OpenURI::HTTPError: 403 Forbidden: https://www.unicode.org/Public/emoji/15.0/emoji-test.txt E, [2024-05-12T14:24:00.419217 #3956611] ERROR -- : from /home/opc/ruby/src/master/tool/downloader.rb:201:in `download' E, [2024-05-12T14:24:00.419227 #3956611] ERROR -- : from /home/opc/ruby/src/master/tool/downloader.rb:136:in `download' E, [2024-05-12T14:24:00.419236 #3956611] ERROR -- : from /home/opc/ruby/src/master/tool/downloader.rb:482:in `block in
' E, [2024-05-12T14:24:00.419245 #3956611] ERROR -- : from /home/opc/ruby/src/master/tool/downloader.rb:465:in `each' E, [2024-05-12T14:24:00.419253 #3956611] ERROR -- : from /home/opc/ruby/src/master/tool/downloader.rb:465:in `
' E, [2024-05-12T14:24:00.419261 #3956611] ERROR -- : /usr/local/lib/ruby/3.2.0/open-uri.rb:369:in `open_http': 403 Forbidden (OpenURI::HTTPError) E, [2024-05-12T14:24:00.419269 #3956611] ERROR -- : from /usr/local/lib/ruby/3.2.0/open-uri.rb:760:in `buffer_open' E, [2024-05-12T14:24:00.419277 #3956611] ERROR -- : from /usr/local/lib/ruby/3.2.0/open-uri.rb:214:in `block in open_loop' E, [2024-05-12T14:24:00.419285 #3956611] ERROR -- : from /usr/local/lib/ruby/3.2.0/open-uri.rb:212:in `catch' E, [2024-05-12T14:24:00.419293 #3956611] ERROR -- : from /usr/local/lib/ruby/3.2.0/open-uri.rb:212:in `open_loop' E, [2024-05-12T14:24:00.419301 #3956611] ERROR -- : from /usr/local/lib/ruby/3.2.0/open-uri.rb:153:in `open_uri' E, [2024-05-12T14:24:00.419309 #3956611] ERROR -- : from /usr/local/lib/ruby/3.2.0/open-uri.rb:740:in `open' E, [2024-05-12T14:24:00.419317 #3956611] ERROR -- : from /usr/local/lib/ruby/3.2.0/open-uri.rb:748:in `read' E, [2024-05-12T14:24:00.419325 #3956611] ERROR -- : from /home/opc/ruby/src/master/tool/downloader.rb:247:in `block in download' E, [2024-05-12T14:24:00.419333 #3956611] ERROR -- : from /home/opc/ruby/src/master/tool/downloader.rb:378:in `with_retry' E, [2024-05-12T14:24:00.419341 #3956611] ERROR -- : from /home/opc/ruby/src/master/tool/downloader.rb:246:in `download' E, [2024-05-12T14:24:00.419349 #3956611] ERROR -- : from /home/opc/ruby/src/master/tool/downloader.rb:136:in `download' E, [2024-05-12T14:24:00.419358 #3956611] ERROR -- : from /home/opc/ruby/src/master/tool/downloader.rb:482:in `block in
' E, [2024-05-12T14:24:00.419366 #3956611] ERROR -- : from /home/opc/ruby/src/master/tool/downloader.rb:465:in `each' E, [2024-05-12T14:24:00.419374 #3956611] ERROR -- : from /home/opc/ruby/src/master/tool/downloader.rb:465:in `
' E, [2024-05-12T14:24:00.422138 #3956611] ERROR -- : make: *** [uncommon.mk:1765: /home/opc/ruby/src/master/enc/unicode/data/emoji/15.0/emoji-test.txt] Error 1 I, [2024-05-12T14:24:00.422208 #3956611] INFO -- : downloading emoji/15.0/emoji-test.txt ... I, [2024-05-12T14:24:00.422356 #3956611] INFO -- : $$$[end] "make update-unicode -j3" exit with 512. I, [2024-05-12T14:24:00.422403 #3956611] INFO -- : $$$[beg] make update-download -j3 I, [2024-05-12T14:24:00.588097 #3956611] INFO -- : tool/config.guess already exists I, [2024-05-12T14:24:00.588169 #3956611] INFO -- : tool/config.sub already exists I, [2024-05-12T14:24:00.591049 #3956611] INFO -- : Update minitest to ea9caafc0754b1d6236a490d59e624b53209734a I, [2024-05-12T14:24:00.591189 #3956611] INFO -- : Update power_assert to 84e85124c5014a139af39161d484156cfe87a9ed I, [2024-05-12T14:24:00.591301 #3956611] INFO -- : Update rbs to ba7872795d5de04adb8ff500c0e6afdc81a041dd I, [2024-05-12T14:24:00.594340 #3956611] INFO -- : echo ea9caafc0754b1d6236a490d59e624b53209734a | /bin/sh /home/opc/ruby/src/master/tool/ifchange /home/opc/ruby/src/master/.bundle/.timestamp/minitest.revision - I, [2024-05-12T14:24:00.594537 #3956611] INFO -- : echo 84e85124c5014a139af39161d484156cfe87a9ed | /bin/sh /home/opc/ruby/src/master/tool/ifchange /home/opc/ruby/src/master/.bundle/.timestamp/power_assert.revision - I, [2024-05-12T14:24:00.594698 #3956611] INFO -- : echo ba7872795d5de04adb8ff500c0e6afdc81a041dd | /bin/sh /home/opc/ruby/src/master/tool/ifchange /home/opc/ruby/src/master/.bundle/.timestamp/rbs.revision - I, [2024-05-12T14:24:00.600287 #3956611] INFO -- : /home/opc/ruby/src/master/.bundle/.timestamp/rbs.revision unchanged I, [2024-05-12T14:24:00.600574 #3956611] INFO -- : /home/opc/ruby/src/master/.bundle/.timestamp/power_assert.revision unchanged I, [2024-05-12T14:24:00.600800 #3956611] INFO -- : /home/opc/ruby/src/master/.bundle/.timestamp/minitest.revision unchanged I, [2024-05-12T14:24:00.602803 #3956611] INFO -- : Update typeprof to b19a6416da3a05d57fadd6ffdadb382b6d236ca5 I, [2024-05-12T14:24:00.606315 #3956611] INFO -- : echo b19a6416da3a05d57fadd6ffdadb382b6d236ca5 | /bin/sh /home/opc/ruby/src/master/tool/ifchange /home/opc/ruby/src/master/.bundle/.timestamp/typeprof.revision - I, [2024-05-12T14:24:00.611705 #3956611] INFO -- : /home/opc/ruby/src/master/.bundle/.timestamp/typeprof.revision unchanged I, [2024-05-12T14:24:00.689605 #3956611] INFO -- : Building power_assert@84e85124c5014a139af39161d484156cfe87a9ed to /home/opc/ruby/src/master/gems/power_assert-2.0.3.gem I, [2024-05-12T14:24:00.802050 #3956611] INFO -- : Successfully built RubyGem I, [2024-05-12T14:24:00.802111 #3956611] INFO -- : Name: power_assert I, [2024-05-12T14:24:00.802122 #3956611] INFO -- : Version: 2.0.4dev I, [2024-05-12T14:24:00.802131 #3956611] INFO -- : File: power_assert-2.0.4dev.gem I, [2024-05-12T14:24:00.882187 #3956611] INFO -- : $$$[end] "make update-download -j3" exit with 0. I, [2024-05-12T14:24:00.882257 #3956611] INFO -- : $$$[beg] make update-rubyspec -j3 I, [2024-05-12T14:24:00.970853 #3956611] INFO -- : make: Nothing to be done for 'update-rubyspec'. I, [2024-05-12T14:24:00.970974 #3956611] INFO -- : $$$[end] "make update-rubyspec -j3" exit with 0. I, [2024-05-12T14:24:00.971009 #3956611] INFO -- : $$$[beg] make update-src -j3 I, [2024-05-12T14:24:01.928380 #3956611] INFO -- : Already up to date. I, [2024-05-12T14:24:01.944194 #3956611] INFO -- : Latest commit hash = b911d2222f I, [2024-05-12T14:24:01.944799 #3956611] INFO -- : $$$[end] "make update-src -j3" exit with 0. I, [2024-05-12T14:24:01.944850 #3956611] INFO -- : $$$[beg] make after-update -j3 I, [2024-05-12T14:24:02.047640 #3956611] INFO -- : generating /home/opc/ruby/src/master/ext/ripper/eventids2table.c I, [2024-05-12T14:24:02.054146 #3956611] INFO -- : make[1]: Entering directory '/home/opc/ruby/src/master/ext/ripper' I, [2024-05-12T14:24:02.054204 #3956611] INFO -- : make[1]: Nothing to be done for 'src'. I, [2024-05-12T14:24:02.054215 #3956611] INFO -- : make[1]: Leaving directory '/home/opc/ruby/src/master/ext/ripper' I, [2024-05-12T14:24:02.081103 #3956611] INFO -- : /home/opc/ruby/src/master/revision.h updated I, [2024-05-12T14:24:02.082266 #3956611] INFO -- : generating aarch64-linux-fake.rb I, [2024-05-12T14:24:02.139248 #3956611] INFO -- : aarch64-linux-fake.rb updated I, [2024-05-12T14:24:02.140690 #3956611] INFO -- : generating enc.mk I, [2024-05-12T14:24:02.380763 #3956611] INFO -- : making srcs under enc I, [2024-05-12T14:24:02.423637 #3956611] INFO -- : make[1]: Entering directory '/home/opc/ruby/build/master' I, [2024-05-12T14:24:02.423714 #3956611] INFO -- : make[1]: Nothing to be done for 'srcs'. I, [2024-05-12T14:24:02.423725 #3956611] INFO -- : make[1]: Leaving directory '/home/opc/ruby/build/master' I, [2024-05-12T14:24:02.503530 #3956611] INFO -- : Update minitest to ea9caafc0754b1d6236a490d59e624b53209734a I, [2024-05-12T14:24:02.503770 #3956611] INFO -- : Update power_assert to 84e85124c5014a139af39161d484156cfe87a9ed I, [2024-05-12T14:24:02.503957 #3956611] INFO -- : Update rbs to ba7872795d5de04adb8ff500c0e6afdc81a041dd I, [2024-05-12T14:24:02.506853 #3956611] INFO -- : echo ea9caafc0754b1d6236a490d59e624b53209734a | /bin/sh /home/opc/ruby/src/master/tool/ifchange /home/opc/ruby/src/master/.bundle/.timestamp/minitest.revision - I, [2024-05-12T14:24:02.506935 #3956611] INFO -- : echo ba7872795d5de04adb8ff500c0e6afdc81a041dd | /bin/sh /home/opc/ruby/src/master/tool/ifchange /home/opc/ruby/src/master/.bundle/.timestamp/rbs.revision - I, [2024-05-12T14:24:02.507124 #3956611] INFO -- : echo 84e85124c5014a139af39161d484156cfe87a9ed | /bin/sh /home/opc/ruby/src/master/tool/ifchange /home/opc/ruby/src/master/.bundle/.timestamp/power_assert.revision - I, [2024-05-12T14:24:02.512482 #3956611] INFO -- : /home/opc/ruby/src/master/.bundle/.timestamp/rbs.revision unchanged I, [2024-05-12T14:24:02.512553 #3956611] INFO -- : /home/opc/ruby/src/master/.bundle/.timestamp/minitest.revision unchanged I, [2024-05-12T14:24:02.514034 #3956611] INFO -- : /home/opc/ruby/src/master/.bundle/.timestamp/power_assert.revision unchanged I, [2024-05-12T14:24:02.515194 #3956611] INFO -- : Update typeprof to b19a6416da3a05d57fadd6ffdadb382b6d236ca5 I, [2024-05-12T14:24:02.519066 #3956611] INFO -- : echo b19a6416da3a05d57fadd6ffdadb382b6d236ca5 | /bin/sh /home/opc/ruby/src/master/tool/ifchange /home/opc/ruby/src/master/.bundle/.timestamp/typeprof.revision - I, [2024-05-12T14:24:02.525716 #3956611] INFO -- : /home/opc/ruby/src/master/.bundle/.timestamp/typeprof.revision unchanged I, [2024-05-12T14:24:02.602699 #3956611] INFO -- : Building power_assert@84e85124c5014a139af39161d484156cfe87a9ed to /home/opc/ruby/src/master/gems/power_assert-2.0.3.gem I, [2024-05-12T14:24:02.711842 #3956611] INFO -- : Successfully built RubyGem I, [2024-05-12T14:24:02.711903 #3956611] INFO -- : Name: power_assert I, [2024-05-12T14:24:02.711914 #3956611] INFO -- : Version: 2.0.4dev I, [2024-05-12T14:24:02.711923 #3956611] INFO -- : File: power_assert-2.0.4dev.gem I, [2024-05-12T14:24:02.714088 #3956611] INFO -- : Extracting bundle gem power_assert-2.0.3... I, [2024-05-12T14:24:02.810901 #3956611] INFO -- : Try with hash version of bundled gems instead of gems/power_assert-2.0.3.gem. We don't use this gem with release version of Ruby. I, [2024-05-12T14:24:02.823048 #3956611] INFO -- : Unpacked gems/power_assert-2.0.4dev.gem I, [2024-05-12T14:24:02.824833 #3956611] INFO -- : $$$[end] "make after-update -j3" exit with 0. I, [2024-05-12T14:24:02.824993 #3956611] INFO -- : $$$[beg] make miniruby -j3 I, [2024-05-12T14:24:02.912749 #3956611] INFO -- : BASERUBY = /usr/local/bin/ruby --disable=gems I, [2024-05-12T14:24:02.912814 #3956611] INFO -- : CC = gcc I, [2024-05-12T14:24:02.912827 #3956611] INFO -- : LD = ld I, [2024-05-12T14:24:02.912839 #3956611] INFO -- : LDSHARED = gcc -shared I, [2024-05-12T14:24:02.912848 #3956611] INFO -- : CFLAGS = -O3 -fno-fast-math -ggdb3 -Wall -Wextra -Wdeprecated-declarations -Wdiv-by-zero -Wduplicated-cond -Wimplicit-function-declaration -Wimplicit-int -Wpointer-arith -Wwrite-strings -Wold-style-definition -Wimplicit-fallthrough=0 -Wmissing-noreturn -Wno-cast-function-type -Wno-constant-logical-operand -Wno-long-long -Wno-missing-field-initializers -Wno-overlength-strings -Wno-packed-bitfield-compat -Wno-parentheses-equality -Wno-self-assign -Wno-tautological-compare -Wno-unused-parameter -Wno-unused-value -Wsuggest-attribute=format -Wsuggest-attribute=noreturn -Wunused-variable -Wmisleading-indentation -Wundef I, [2024-05-12T14:24:02.912857 #3956611] INFO -- : XCFLAGS = -U_FORTIFY_SOURCE -D_FORTIFY_SOURCE=2 -fstack-protector-strong -msign-return-address=all -fno-strict-overflow -fvisibility=hidden -fexcess-precision=standard -DRUBY_EXPORT -fPIE -I. -I.ext/include/aarch64-linux -I/home/opc/ruby/src/master/include -I/home/opc/ruby/src/master -I/home/opc/ruby/src/master/prism -I/home/opc/ruby/src/master/enc/unicode/15.0.0 I, [2024-05-12T14:24:02.912865 #3956611] INFO -- : CPPFLAGS = I, [2024-05-12T14:24:02.912873 #3956611] INFO -- : DLDFLAGS = -Wl,--compress-debug-sections=zlib -fstack-protector-strong -pie I, [2024-05-12T14:24:02.912905 #3956611] INFO -- : SOLIBS = -lz -lrt -lrt -ldl -lcrypt -lm -lpthread I, [2024-05-12T14:24:02.912913 #3956611] INFO -- : LANG = en_US.UTF-8 I, [2024-05-12T14:24:02.912921 #3956611] INFO -- : LC_ALL = I, [2024-05-12T14:24:02.912928 #3956611] INFO -- : LC_CTYPE = I, [2024-05-12T14:24:02.912936 #3956611] INFO -- : MFLAGS = -j3 --jobserver-auth=4,5 I, [2024-05-12T14:24:02.912943 #3956611] INFO -- : RUSTC = rustc I, [2024-05-12T14:24:02.912951 #3956611] INFO -- : YJIT_RUSTC_ARGS = --crate-name=yjit --crate-type=staticlib --edition=2021 -g -C lto=thin -C opt-level=3 -C overflow-checks=on '--out-dir=/home/opc/ruby/build/master/yjit/target/release/' /home/opc/ruby/src/master/yjit/src/lib.rs I, [2024-05-12T14:24:02.913680 #3956611] INFO -- : gcc (GCC) 8.5.0 20210514 (Red Hat 8.5.0-10.1.0.1) I, [2024-05-12T14:24:02.913715 #3956611] INFO -- : Copyright (C) 2018 Free Software Foundation, Inc. I, [2024-05-12T14:24:02.913726 #3956611] INFO -- : This is free software; see the source for copying conditions. There is NO I, [2024-05-12T14:24:02.913735 #3956611] INFO -- : warranty; not even for MERCHANTABILITY or FITNESS FOR A PARTICULAR PURPOSE. I, [2024-05-12T14:24:02.913743 #3956611] INFO -- : I, [2024-05-12T14:24:02.938691 #3956611] INFO -- : compiling /home/opc/ruby/src/master/version.c I, [2024-05-12T14:24:03.081909 #3956611] INFO -- : linking miniruby I, [2024-05-12T14:24:03.965314 #3956611] INFO -- : $$$[end] "make miniruby -j3" exit with 0. I, [2024-05-12T14:24:03.965563 #3956611] INFO -- : $$$[beg] make ruby -j3 I, [2024-05-12T14:24:04.054964 #3956611] INFO -- : BASERUBY = /usr/local/bin/ruby --disable=gems I, [2024-05-12T14:24:04.055029 #3956611] INFO -- : CC = gcc I, [2024-05-12T14:24:04.055040 #3956611] INFO -- : LD = ld I, [2024-05-12T14:24:04.055049 #3956611] INFO -- : LDSHARED = gcc -shared I, [2024-05-12T14:24:04.055060 #3956611] INFO -- : CFLAGS = -O3 -fno-fast-math -ggdb3 -Wall -Wextra -Wdeprecated-declarations -Wdiv-by-zero -Wduplicated-cond -Wimplicit-function-declaration -Wimplicit-int -Wpointer-arith -Wwrite-strings -Wold-style-definition -Wimplicit-fallthrough=0 -Wmissing-noreturn -Wno-cast-function-type -Wno-constant-logical-operand -Wno-long-long -Wno-missing-field-initializers -Wno-overlength-strings -Wno-packed-bitfield-compat -Wno-parentheses-equality -Wno-self-assign -Wno-tautological-compare -Wno-unused-parameter -Wno-unused-value -Wsuggest-attribute=format -Wsuggest-attribute=noreturn -Wunused-variable -Wmisleading-indentation -Wundef I, [2024-05-12T14:24:04.055070 #3956611] INFO -- : XCFLAGS = -U_FORTIFY_SOURCE -D_FORTIFY_SOURCE=2 -fstack-protector-strong -msign-return-address=all -fno-strict-overflow -fvisibility=hidden -fexcess-precision=standard -DRUBY_EXPORT -fPIE -I. -I.ext/include/aarch64-linux -I/home/opc/ruby/src/master/include -I/home/opc/ruby/src/master -I/home/opc/ruby/src/master/prism -I/home/opc/ruby/src/master/enc/unicode/15.0.0 I, [2024-05-12T14:24:04.055078 #3956611] INFO -- : CPPFLAGS = I, [2024-05-12T14:24:04.055086 #3956611] INFO -- : DLDFLAGS = -Wl,--compress-debug-sections=zlib -fstack-protector-strong -pie I, [2024-05-12T14:24:04.055095 #3956611] INFO -- : SOLIBS = -lz -lrt -lrt -ldl -lcrypt -lm -lpthread I, [2024-05-12T14:24:04.055103 #3956611] INFO -- : LANG = en_US.UTF-8 I, [2024-05-12T14:24:04.055111 #3956611] INFO -- : LC_ALL = I, [2024-05-12T14:24:04.055119 #3956611] INFO -- : LC_CTYPE = I, [2024-05-12T14:24:04.055126 #3956611] INFO -- : MFLAGS = -j3 --jobserver-auth=4,5 I, [2024-05-12T14:24:04.055134 #3956611] INFO -- : RUSTC = rustc I, [2024-05-12T14:24:04.055143 #3956611] INFO -- : YJIT_RUSTC_ARGS = --crate-name=yjit --crate-type=staticlib --edition=2021 -g -C lto=thin -C opt-level=3 -C overflow-checks=on '--out-dir=/home/opc/ruby/build/master/yjit/target/release/' /home/opc/ruby/src/master/yjit/src/lib.rs I, [2024-05-12T14:24:04.055859 #3956611] INFO -- : gcc (GCC) 8.5.0 20210514 (Red Hat 8.5.0-10.1.0.1) I, [2024-05-12T14:24:04.055895 #3956611] INFO -- : Copyright (C) 2018 Free Software Foundation, Inc. I, [2024-05-12T14:24:04.055908 #3956611] INFO -- : This is free software; see the source for copying conditions. There is NO I, [2024-05-12T14:24:04.055918 #3956611] INFO -- : warranty; not even for MERCHANTABILITY or FITNESS FOR A PARTICULAR PURPOSE. I, [2024-05-12T14:24:04.055927 #3956611] INFO -- : I, [2024-05-12T14:24:04.238507 #3956611] INFO -- : builtin_binary.inc updated I, [2024-05-12T14:24:04.241926 #3956611] INFO -- : c5234a9416e4f20f175185e840b25b0f08674d14078ed7083f37e655458e3ca9 builtin_binary.inc I, [2024-05-12T14:24:04.242876 #3956611] INFO -- : compiling /home/opc/ruby/src/master/builtin.c I, [2024-05-12T14:24:04.565010 #3956611] INFO -- : linking static-library libruby-static.a I, [2024-05-12T14:24:08.322783 #3956611] INFO -- : linking ruby I, [2024-05-12T14:24:09.245918 #3956611] INFO -- : $$$[end] "make ruby -j3" exit with 0. I, [2024-05-12T14:24:09.246104 #3956611] INFO -- : $$$[beg] make all -j3 I, [2024-05-12T14:24:09.334935 #3956611] INFO -- : BASERUBY = /usr/local/bin/ruby --disable=gems I, [2024-05-12T14:24:09.335003 #3956611] INFO -- : CC = gcc I, [2024-05-12T14:24:09.335014 #3956611] INFO -- : LD = ld I, [2024-05-12T14:24:09.335023 #3956611] INFO -- : LDSHARED = gcc -shared I, [2024-05-12T14:24:09.335032 #3956611] INFO -- : CFLAGS = -O3 -fno-fast-math -ggdb3 -Wall -Wextra -Wdeprecated-declarations -Wdiv-by-zero -Wduplicated-cond -Wimplicit-function-declaration -Wimplicit-int -Wpointer-arith -Wwrite-strings -Wold-style-definition -Wimplicit-fallthrough=0 -Wmissing-noreturn -Wno-cast-function-type -Wno-constant-logical-operand -Wno-long-long -Wno-missing-field-initializers -Wno-overlength-strings -Wno-packed-bitfield-compat -Wno-parentheses-equality -Wno-self-assign -Wno-tautological-compare -Wno-unused-parameter -Wno-unused-value -Wsuggest-attribute=format -Wsuggest-attribute=noreturn -Wunused-variable -Wmisleading-indentation -Wundef I, [2024-05-12T14:24:09.335043 #3956611] INFO -- : XCFLAGS = -U_FORTIFY_SOURCE -D_FORTIFY_SOURCE=2 -fstack-protector-strong -msign-return-address=all -fno-strict-overflow -fvisibility=hidden -fexcess-precision=standard -DRUBY_EXPORT -fPIE -I. -I.ext/include/aarch64-linux -I/home/opc/ruby/src/master/include -I/home/opc/ruby/src/master -I/home/opc/ruby/src/master/prism -I/home/opc/ruby/src/master/enc/unicode/15.0.0 I, [2024-05-12T14:24:09.335052 #3956611] INFO -- : CPPFLAGS = I, [2024-05-12T14:24:09.335060 #3956611] INFO -- : DLDFLAGS = -Wl,--compress-debug-sections=zlib -fstack-protector-strong -pie I, [2024-05-12T14:24:09.335070 #3956611] INFO -- : SOLIBS = -lz -lrt -lrt -ldl -lcrypt -lm -lpthread I, [2024-05-12T14:24:09.335078 #3956611] INFO -- : LANG = en_US.UTF-8 I, [2024-05-12T14:24:09.335086 #3956611] INFO -- : LC_ALL = I, [2024-05-12T14:24:09.335094 #3956611] INFO -- : LC_CTYPE = I, [2024-05-12T14:24:09.335101 #3956611] INFO -- : MFLAGS = -j3 --jobserver-auth=4,5 I, [2024-05-12T14:24:09.335109 #3956611] INFO -- : RUSTC = rustc I, [2024-05-12T14:24:09.335117 #3956611] INFO -- : YJIT_RUSTC_ARGS = --crate-name=yjit --crate-type=staticlib --edition=2021 -g -C lto=thin -C opt-level=3 -C overflow-checks=on '--out-dir=/home/opc/ruby/build/master/yjit/target/release/' /home/opc/ruby/src/master/yjit/src/lib.rs I, [2024-05-12T14:24:09.335780 #3956611] INFO -- : gcc (GCC) 8.5.0 20210514 (Red Hat 8.5.0-10.1.0.1) I, [2024-05-12T14:24:09.335800 #3956611] INFO -- : Copyright (C) 2018 Free Software Foundation, Inc. I, [2024-05-12T14:24:09.335809 #3956611] INFO -- : This is free software; see the source for copying conditions. There is NO I, [2024-05-12T14:24:09.335818 #3956611] INFO -- : warranty; not even for MERCHANTABILITY or FITNESS FOR A PARTICULAR PURPOSE. I, [2024-05-12T14:24:09.335826 #3956611] INFO -- : I, [2024-05-12T14:24:09.369612 #3956611] INFO -- : generating encdb.h I, [2024-05-12T14:24:09.371008 #3956611] INFO -- : generating enc.mk I, [2024-05-12T14:24:09.407785 #3956611] INFO -- : encdb.h unchanged I, [2024-05-12T14:24:09.604863 #3956611] INFO -- : making srcs under enc I, [2024-05-12T14:24:09.604935 #3956611] INFO -- : making enc I, [2024-05-12T14:24:09.632460 #3956611] INFO -- : make[1]: Entering directory '/home/opc/ruby/build/master' I, [2024-05-12T14:24:09.632539 #3956611] INFO -- : make[1]: Nothing to be done for 'enc'. I, [2024-05-12T14:24:09.632553 #3956611] INFO -- : make[1]: Leaving directory '/home/opc/ruby/build/master' I, [2024-05-12T14:24:09.646897 #3956611] INFO -- : make[1]: Entering directory '/home/opc/ruby/build/master' I, [2024-05-12T14:24:09.646947 #3956611] INFO -- : make[1]: Nothing to be done for 'srcs'. I, [2024-05-12T14:24:09.646958 #3956611] INFO -- : make[1]: Leaving directory '/home/opc/ruby/build/master' I, [2024-05-12T14:24:09.647799 #3956611] INFO -- : generating transdb.h I, [2024-05-12T14:24:09.790634 #3956611] INFO -- : transdb.h unchanged I, [2024-05-12T14:24:09.792045 #3956611] INFO -- : generating makefiles ext/configure-ext.mk I, [2024-05-12T14:24:09.792165 #3956611] INFO -- : making trans I, [2024-05-12T14:24:09.831983 #3956611] INFO -- : ext/configure-ext.mk updated I, [2024-05-12T14:24:09.835141 #3956611] INFO -- : make[1]: Entering directory '/home/opc/ruby/build/master' I, [2024-05-12T14:24:09.840685 #3956611] INFO -- : make[1]: Entering directory '/home/opc/ruby/build/master' I, [2024-05-12T14:24:09.840736 #3956611] INFO -- : make[1]: Nothing to be done for 'trans'. I, [2024-05-12T14:24:09.840748 #3956611] INFO -- : make[1]: Leaving directory '/home/opc/ruby/build/master' I, [2024-05-12T14:24:10.017315 #3956611] INFO -- : making encs I, [2024-05-12T14:24:10.077494 #3956611] INFO -- : make[1]: Entering directory '/home/opc/ruby/build/master' I, [2024-05-12T14:24:10.077561 #3956611] INFO -- : make[1]: Nothing to be done for 'encs'. I, [2024-05-12T14:24:10.077571 #3956611] INFO -- : make[1]: Leaving directory '/home/opc/ruby/build/master' I, [2024-05-12T14:24:10.573838 #3956611] INFO -- : make[1]: Leaving directory '/home/opc/ruby/build/master' I, [2024-05-12T14:24:10.574506 #3956611] INFO -- : generating makefile exts.mk I, [2024-05-12T14:24:10.633111 #3956611] INFO -- : exts.mk unchanged I, [2024-05-12T14:24:10.637978 #3956611] INFO -- : make[1]: Entering directory '/home/opc/ruby/build/master' I, [2024-05-12T14:24:10.740839 #3956611] INFO -- : make[2]: Entering directory '/home/opc/ruby/build/master/ext/coverage' I, [2024-05-12T14:24:10.742261 #3956611] INFO -- : make[2]: Entering directory '/home/opc/ruby/build/master/ext/digest' I, [2024-05-12T14:24:10.743399 #3956611] INFO -- : make[2]: Entering directory '/home/opc/ruby/build/master/ext/date' I, [2024-05-12T14:24:10.747549 #3956611] INFO -- : make[2]: Leaving directory '/home/opc/ruby/build/master/ext/coverage' I, [2024-05-12T14:24:10.748795 #3956611] INFO -- : make[2]: Leaving directory '/home/opc/ruby/build/master/ext/date' I, [2024-05-12T14:24:10.754493 #3956611] INFO -- : make[2]: Leaving directory '/home/opc/ruby/build/master/ext/digest' I, [2024-05-12T14:24:10.758792 #3956611] INFO -- : make[2]: Entering directory '/home/opc/ruby/build/master/ext/io/console' I, [2024-05-12T14:24:10.761059 #3956611] INFO -- : make[2]: Entering directory '/home/opc/ruby/build/master/ext/fiddle' I, [2024-05-12T14:24:10.764658 #3956611] INFO -- : make[2]: Leaving directory '/home/opc/ruby/build/master/ext/io/console' I, [2024-05-12T14:24:10.766613 #3956611] INFO -- : make[2]: Entering directory '/home/opc/ruby/build/master/ext/json' I, [2024-05-12T14:24:10.770160 #3956611] INFO -- : make[2]: Entering directory '/home/opc/ruby/build/master/ext/monitor' I, [2024-05-12T14:24:10.771616 #3956611] INFO -- : make[2]: Leaving directory '/home/opc/ruby/build/master/ext/fiddle' I, [2024-05-12T14:24:10.774420 #3956611] INFO -- : make[2]: Leaving directory '/home/opc/ruby/build/master/ext/monitor' I, [2024-05-12T14:24:10.778147 #3956611] INFO -- : make[2]: Leaving directory '/home/opc/ruby/build/master/ext/json' I, [2024-05-12T14:24:10.778396 #3956611] INFO -- : make[2]: Entering directory '/home/opc/ruby/build/master/ext/objspace' I, [2024-05-12T14:24:10.782388 #3956611] INFO -- : make[2]: Entering directory '/home/opc/ruby/build/master/ext/pathname' I, [2024-05-12T14:24:10.784411 #3956611] INFO -- : make[2]: Leaving directory '/home/opc/ruby/build/master/ext/objspace' I, [2024-05-12T14:24:10.788037 #3956611] INFO -- : make[2]: Leaving directory '/home/opc/ruby/build/master/ext/pathname' I, [2024-05-12T14:24:10.790447 #3956611] INFO -- : make[2]: Entering directory '/home/opc/ruby/build/master/ext/psych' I, [2024-05-12T14:24:10.792410 #3956611] INFO -- : make[2]: Entering directory '/home/opc/ruby/build/master/ext/pty' I, [2024-05-12T14:24:10.796774 #3956611] INFO -- : make[2]: Entering directory '/home/opc/ruby/build/master/ext/openssl' I, [2024-05-12T14:24:10.799306 #3956611] INFO -- : make[2]: Leaving directory '/home/opc/ruby/build/master/ext/pty' I, [2024-05-12T14:24:10.808402 #3956611] INFO -- : make[2]: Leaving directory '/home/opc/ruby/build/master/ext/psych' I, [2024-05-12T14:24:10.810329 #3956611] INFO -- : make[2]: Entering directory '/home/opc/ruby/build/master/ext/rubyvm' I, [2024-05-12T14:24:10.812687 #3956611] INFO -- : make[2]: Entering directory '/home/opc/ruby/build/master/ext/ripper' I, [2024-05-12T14:24:10.817372 #3956611] INFO -- : make[2]: Leaving directory '/home/opc/ruby/build/master/ext/rubyvm' I, [2024-05-12T14:24:10.819401 #3956611] INFO -- : make[2]: Leaving directory '/home/opc/ruby/build/master/ext/ripper' I, [2024-05-12T14:24:10.820737 #3956611] INFO -- : make[2]: Leaving directory '/home/opc/ruby/build/master/ext/openssl' I, [2024-05-12T14:24:10.827288 #3956611] INFO -- : make[2]: Entering directory '/home/opc/ruby/build/master/.bundle/gems/bigdecimal-3.1.7/ext/bigdecimal' I, [2024-05-12T14:24:10.829636 #3956611] INFO -- : make[2]: Entering directory '/home/opc/ruby/build/master/ext/socket' I, [2024-05-12T14:24:10.831855 #3956611] INFO -- : make[2]: Entering directory '/home/opc/ruby/build/master/.bundle/gems/bigdecimal-3.1.8/ext/bigdecimal' I, [2024-05-12T14:24:10.847006 #3956611] INFO -- : make[2]: Leaving directory '/home/opc/ruby/build/master/ext/socket' I, [2024-05-12T14:24:10.849502 #3956611] INFO -- : make[2]: Entering directory '/home/opc/ruby/build/master/.bundle/gems/debug-1.9.2/ext/debug' I, [2024-05-12T14:24:10.859646 #3956611] INFO -- : make[2]: Leaving directory '/home/opc/ruby/build/master/.bundle/gems/bigdecimal-3.1.7/ext/bigdecimal' I, [2024-05-12T14:24:10.861872 #3956611] INFO -- : make[2]: Leaving directory '/home/opc/ruby/build/master/.bundle/gems/bigdecimal-3.1.8/ext/bigdecimal' I, [2024-05-12T14:24:10.862567 #3956611] INFO -- : make[2]: Entering directory '/home/opc/ruby/build/master/.bundle/gems/nkf-0.2.0/ext/nkf' I, [2024-05-12T14:24:10.864124 #3956611] INFO -- : make[2]: Entering directory '/home/opc/ruby/build/master/.bundle/gems/racc-1.7.3/ext/racc/cparse' I, [2024-05-12T14:24:10.882027 #3956611] INFO -- : make[2]: Leaving directory '/home/opc/ruby/build/master/.bundle/gems/debug-1.9.2/ext/debug' I, [2024-05-12T14:24:10.884941 #3956611] INFO -- : make[2]: Entering directory '/home/opc/ruby/build/master/.bundle/gems/rbs-3.4.4/ext/rbs_extension' I, [2024-05-12T14:24:10.893413 #3956611] INFO -- : make[2]: Leaving directory '/home/opc/ruby/build/master/.bundle/gems/nkf-0.2.0/ext/nkf' I, [2024-05-12T14:24:10.894697 #3956611] INFO -- : make[2]: Leaving directory '/home/opc/ruby/build/master/.bundle/gems/racc-1.7.3/ext/racc/cparse' I, [2024-05-12T14:24:10.895779 #3956611] INFO -- : make[2]: Entering directory '/home/opc/ruby/build/master/.bundle/gems/syslog-0.1.2/ext/syslog' I, [2024-05-12T14:24:10.918348 #3956611] INFO -- : make[2]: Leaving directory '/home/opc/ruby/build/master/.bundle/gems/rbs-3.4.4/ext/rbs_extension' I, [2024-05-12T14:24:10.919860 #3956611] INFO -- : make[2]: Entering directory '/home/opc/ruby/build/master/ext/digest/sha2' I, [2024-05-12T14:24:10.925151 #3956611] INFO -- : make[2]: Leaving directory '/home/opc/ruby/build/master/ext/digest/sha2' I, [2024-05-12T14:24:10.928862 #3956611] INFO -- : make[2]: Leaving directory '/home/opc/ruby/build/master/.bundle/gems/syslog-0.1.2/ext/syslog' I, [2024-05-12T14:24:10.966613 #3956611] INFO -- : make[2]: Entering directory '/home/opc/ruby/build/master' I, [2024-05-12T14:24:11.051746 #3956611] INFO -- : make[2]: 'ruby' is up to date. I, [2024-05-12T14:24:11.051819 #3956611] INFO -- : make[2]: Leaving directory '/home/opc/ruby/build/master' I, [2024-05-12T14:24:11.051954 #3956611] INFO -- : make[1]: Leaving directory '/home/opc/ruby/build/master' I, [2024-05-12T14:24:11.056367 #3956611] INFO -- : make[1]: Entering directory '/home/opc/ruby/build/master' I, [2024-05-12T14:24:11.056395 #3956611] INFO -- : make[1]: Nothing to be done for 'note'. I, [2024-05-12T14:24:11.056406 #3956611] INFO -- : make[1]: Leaving directory '/home/opc/ruby/build/master' I, [2024-05-12T14:24:11.056729 #3956611] INFO -- : $$$[end] "make all -j3" exit with 0. I, [2024-05-12T14:24:11.056861 #3956611] INFO -- : $$$[beg] make install -j3 I, [2024-05-12T14:24:11.150635 #3956611] INFO -- : Update minitest to ea9caafc0754b1d6236a490d59e624b53209734a I, [2024-05-12T14:24:11.150796 #3956611] INFO -- : Update power_assert to 84e85124c5014a139af39161d484156cfe87a9ed I, [2024-05-12T14:24:11.151087 #3956611] INFO -- : Update rbs to ba7872795d5de04adb8ff500c0e6afdc81a041dd I, [2024-05-12T14:24:11.154155 #3956611] INFO -- : echo ea9caafc0754b1d6236a490d59e624b53209734a | /bin/sh /home/opc/ruby/src/master/tool/ifchange /home/opc/ruby/src/master/.bundle/.timestamp/minitest.revision - I, [2024-05-12T14:24:11.154408 #3956611] INFO -- : echo ba7872795d5de04adb8ff500c0e6afdc81a041dd | /bin/sh /home/opc/ruby/src/master/tool/ifchange /home/opc/ruby/src/master/.bundle/.timestamp/rbs.revision - I, [2024-05-12T14:24:11.155312 #3956611] INFO -- : echo 84e85124c5014a139af39161d484156cfe87a9ed | /bin/sh /home/opc/ruby/src/master/tool/ifchange /home/opc/ruby/src/master/.bundle/.timestamp/power_assert.revision - I, [2024-05-12T14:24:11.160021 #3956611] INFO -- : /home/opc/ruby/src/master/.bundle/.timestamp/minitest.revision unchanged I, [2024-05-12T14:24:11.160252 #3956611] INFO -- : /home/opc/ruby/src/master/.bundle/.timestamp/rbs.revision unchanged I, [2024-05-12T14:24:11.161872 #3956611] INFO -- : /home/opc/ruby/src/master/.bundle/.timestamp/power_assert.revision unchanged I, [2024-05-12T14:24:11.163284 #3956611] INFO -- : Update typeprof to b19a6416da3a05d57fadd6ffdadb382b6d236ca5 I, [2024-05-12T14:24:11.165677 #3956611] INFO -- : BASERUBY = /usr/local/bin/ruby --disable=gems I, [2024-05-12T14:24:11.165725 #3956611] INFO -- : CC = gcc I, [2024-05-12T14:24:11.165736 #3956611] INFO -- : LD = ld I, [2024-05-12T14:24:11.165744 #3956611] INFO -- : LDSHARED = gcc -shared I, [2024-05-12T14:24:11.165753 #3956611] INFO -- : CFLAGS = -O3 -fno-fast-math -ggdb3 -Wall -Wextra -Wdeprecated-declarations -Wdiv-by-zero -Wduplicated-cond -Wimplicit-function-declaration -Wimplicit-int -Wpointer-arith -Wwrite-strings -Wold-style-definition -Wimplicit-fallthrough=0 -Wmissing-noreturn -Wno-cast-function-type -Wno-constant-logical-operand -Wno-long-long -Wno-missing-field-initializers -Wno-overlength-strings -Wno-packed-bitfield-compat -Wno-parentheses-equality -Wno-self-assign -Wno-tautological-compare -Wno-unused-parameter -Wno-unused-value -Wsuggest-attribute=format -Wsuggest-attribute=noreturn -Wunused-variable -Wmisleading-indentation -Wundef I, [2024-05-12T14:24:11.165762 #3956611] INFO -- : XCFLAGS = -U_FORTIFY_SOURCE -D_FORTIFY_SOURCE=2 -fstack-protector-strong -msign-return-address=all -fno-strict-overflow -fvisibility=hidden -fexcess-precision=standard -DRUBY_EXPORT -fPIE -I. -I.ext/include/aarch64-linux -I/home/opc/ruby/src/master/include -I/home/opc/ruby/src/master -I/home/opc/ruby/src/master/prism -I/home/opc/ruby/src/master/enc/unicode/15.0.0 I, [2024-05-12T14:24:11.165771 #3956611] INFO -- : CPPFLAGS = I, [2024-05-12T14:24:11.165779 #3956611] INFO -- : DLDFLAGS = -Wl,--compress-debug-sections=zlib -fstack-protector-strong -pie I, [2024-05-12T14:24:11.165788 #3956611] INFO -- : SOLIBS = -lz -lrt -lrt -ldl -lcrypt -lm -lpthread I, [2024-05-12T14:24:11.165795 #3956611] INFO -- : LANG = en_US.UTF-8 I, [2024-05-12T14:24:11.165806 #3956611] INFO -- : LC_ALL = I, [2024-05-12T14:24:11.165814 #3956611] INFO -- : LC_CTYPE = I, [2024-05-12T14:24:11.165822 #3956611] INFO -- : MFLAGS = -j3 --jobserver-auth=4,5 I, [2024-05-12T14:24:11.165831 #3956611] INFO -- : RUSTC = rustc I, [2024-05-12T14:24:11.165839 #3956611] INFO -- : YJIT_RUSTC_ARGS = --crate-name=yjit --crate-type=staticlib --edition=2021 -g -C lto=thin -C opt-level=3 -C overflow-checks=on '--out-dir=/home/opc/ruby/build/master/yjit/target/release/' /home/opc/ruby/src/master/yjit/src/lib.rs I, [2024-05-12T14:24:11.196375 #3956611] INFO -- : echo b19a6416da3a05d57fadd6ffdadb382b6d236ca5 | /bin/sh /home/opc/ruby/src/master/tool/ifchange /home/opc/ruby/src/master/.bundle/.timestamp/typeprof.revision - I, [2024-05-12T14:24:11.197321 #3956611] INFO -- : gcc (GCC) 8.5.0 20210514 (Red Hat 8.5.0-10.1.0.1) I, [2024-05-12T14:24:11.197362 #3956611] INFO -- : Copyright (C) 2018 Free Software Foundation, Inc. I, [2024-05-12T14:24:11.197372 #3956611] INFO -- : This is free software; see the source for copying conditions. There is NO I, [2024-05-12T14:24:11.197382 #3956611] INFO -- : warranty; not even for MERCHANTABILITY or FITNESS FOR A PARTICULAR PURPOSE. I, [2024-05-12T14:24:11.197390 #3956611] INFO -- : I, [2024-05-12T14:24:11.197909 #3956611] INFO -- : generating encdb.h I, [2024-05-12T14:24:11.199759 #3956611] INFO -- : generating enc.mk I, [2024-05-12T14:24:11.202630 #3956611] INFO -- : /home/opc/ruby/src/master/.bundle/.timestamp/typeprof.revision unchanged I, [2024-05-12T14:24:11.235183 #3956611] INFO -- : encdb.h unchanged I, [2024-05-12T14:24:11.326568 #3956611] INFO -- : Building power_assert@84e85124c5014a139af39161d484156cfe87a9ed to /home/opc/ruby/src/master/gems/power_assert-2.0.3.gem I, [2024-05-12T14:24:11.437737 #3956611] INFO -- : making srcs under enc I, [2024-05-12T14:24:11.437920 #3956611] INFO -- : making enc I, [2024-05-12T14:24:11.442910 #3956611] INFO -- : Successfully built RubyGem I, [2024-05-12T14:24:11.442957 #3956611] INFO -- : Name: power_assert I, [2024-05-12T14:24:11.442967 #3956611] INFO -- : Version: 2.0.4dev I, [2024-05-12T14:24:11.442976 #3956611] INFO -- : File: power_assert-2.0.4dev.gem I, [2024-05-12T14:24:11.445102 #3956611] INFO -- : Extracting bundle gem power_assert-2.0.3... I, [2024-05-12T14:24:11.466275 #3956611] INFO -- : make[1]: Entering directory '/home/opc/ruby/build/master' I, [2024-05-12T14:24:11.466349 #3956611] INFO -- : make[1]: Nothing to be done for 'enc'. I, [2024-05-12T14:24:11.466382 #3956611] INFO -- : make[1]: Leaving directory '/home/opc/ruby/build/master' I, [2024-05-12T14:24:11.479747 #3956611] INFO -- : make[1]: Entering directory '/home/opc/ruby/build/master' I, [2024-05-12T14:24:11.479799 #3956611] INFO -- : make[1]: Nothing to be done for 'srcs'. I, [2024-05-12T14:24:11.479812 #3956611] INFO -- : make[1]: Leaving directory '/home/opc/ruby/build/master' I, [2024-05-12T14:24:11.480662 #3956611] INFO -- : generating transdb.h I, [2024-05-12T14:24:11.542424 #3956611] INFO -- : Try with hash version of bundled gems instead of gems/power_assert-2.0.3.gem. We don't use this gem with release version of Ruby. I, [2024-05-12T14:24:11.552661 #3956611] INFO -- : Unpacked gems/power_assert-2.0.4dev.gem I, [2024-05-12T14:24:11.623472 #3956611] INFO -- : transdb.h unchanged I, [2024-05-12T14:24:11.624827 #3956611] INFO -- : generating makefiles ext/configure-ext.mk I, [2024-05-12T14:24:11.624935 #3956611] INFO -- : making trans I, [2024-05-12T14:24:11.663450 #3956611] INFO -- : ext/configure-ext.mk unchanged I, [2024-05-12T14:24:11.666427 #3956611] INFO -- : make[1]: Entering directory '/home/opc/ruby/build/master' I, [2024-05-12T14:24:11.673233 #3956611] INFO -- : make[1]: Entering directory '/home/opc/ruby/build/master' I, [2024-05-12T14:24:11.673286 #3956611] INFO -- : make[1]: Nothing to be done for 'trans'. I, [2024-05-12T14:24:11.673298 #3956611] INFO -- : make[1]: Leaving directory '/home/opc/ruby/build/master' I, [2024-05-12T14:24:11.793148 #3956611] INFO -- : making encs I, [2024-05-12T14:24:11.847525 #3956611] INFO -- : make[1]: Entering directory '/home/opc/ruby/build/master' I, [2024-05-12T14:24:11.847623 #3956611] INFO -- : make[1]: Nothing to be done for 'encs'. I, [2024-05-12T14:24:11.847659 #3956611] INFO -- : make[1]: Leaving directory '/home/opc/ruby/build/master' I, [2024-05-12T14:24:12.417560 #3956611] INFO -- : make[1]: Leaving directory '/home/opc/ruby/build/master' I, [2024-05-12T14:24:12.418424 #3956611] INFO -- : generating makefile exts.mk I, [2024-05-12T14:24:12.476689 #3956611] INFO -- : exts.mk unchanged I, [2024-05-12T14:24:12.481475 #3956611] INFO -- : make[1]: Entering directory '/home/opc/ruby/build/master' I, [2024-05-12T14:24:12.585305 #3956611] INFO -- : make[2]: Entering directory '/home/opc/ruby/build/master/ext/coverage' I, [2024-05-12T14:24:12.587649 #3956611] INFO -- : make[2]: Entering directory '/home/opc/ruby/build/master/ext/date' I, [2024-05-12T14:24:12.587714 #3956611] INFO -- : make[2]: Entering directory '/home/opc/ruby/build/master/ext/digest' I, [2024-05-12T14:24:12.592197 #3956611] INFO -- : make[2]: Leaving directory '/home/opc/ruby/build/master/ext/coverage' I, [2024-05-12T14:24:12.593306 #3956611] INFO -- : make[2]: Leaving directory '/home/opc/ruby/build/master/ext/date' I, [2024-05-12T14:24:12.597847 #3956611] INFO -- : make[2]: Leaving directory '/home/opc/ruby/build/master/ext/digest' I, [2024-05-12T14:24:12.602365 #3956611] INFO -- : make[2]: Entering directory '/home/opc/ruby/build/master/ext/io/console' I, [2024-05-12T14:24:12.604837 #3956611] INFO -- : make[2]: Entering directory '/home/opc/ruby/build/master/ext/fiddle' I, [2024-05-12T14:24:12.607320 #3956611] INFO -- : make[2]: Leaving directory '/home/opc/ruby/build/master/ext/io/console' I, [2024-05-12T14:24:12.609442 #3956611] INFO -- : make[2]: Entering directory '/home/opc/ruby/build/master/ext/json' I, [2024-05-12T14:24:12.612575 #3956611] INFO -- : make[2]: Entering directory '/home/opc/ruby/build/master/ext/monitor' I, [2024-05-12T14:24:12.616277 #3956611] INFO -- : make[2]: Leaving directory '/home/opc/ruby/build/master/ext/monitor' I, [2024-05-12T14:24:12.619090 #3956611] INFO -- : make[2]: Leaving directory '/home/opc/ruby/build/master/ext/json' I, [2024-05-12T14:24:12.619450 #3956611] INFO -- : make[2]: Leaving directory '/home/opc/ruby/build/master/ext/fiddle' I, [2024-05-12T14:24:12.622562 #3956611] INFO -- : make[2]: Entering directory '/home/opc/ruby/build/master/ext/objspace' I, [2024-05-12T14:24:12.624822 #3956611] INFO -- : make[2]: Entering directory '/home/opc/ruby/build/master/ext/pathname' I, [2024-05-12T14:24:12.628699 #3956611] INFO -- : make[2]: Leaving directory '/home/opc/ruby/build/master/ext/objspace' I, [2024-05-12T14:24:12.632892 #3956611] INFO -- : make[2]: Leaving directory '/home/opc/ruby/build/master/ext/pathname' I, [2024-05-12T14:24:12.635131 #3956611] INFO -- : make[2]: Entering directory '/home/opc/ruby/build/master/ext/psych' I, [2024-05-12T14:24:12.637029 #3956611] INFO -- : make[2]: Entering directory '/home/opc/ruby/build/master/ext/pty' I, [2024-05-12T14:24:12.637945 #3956611] INFO -- : make[2]: Entering directory '/home/opc/ruby/build/master/ext/openssl' I, [2024-05-12T14:24:12.647032 #3956611] INFO -- : make[2]: Leaving directory '/home/opc/ruby/build/master/ext/pty' I, [2024-05-12T14:24:12.650350 #3956611] INFO -- : make[2]: Leaving directory '/home/opc/ruby/build/master/ext/psych' I, [2024-05-12T14:24:12.655185 #3956611] INFO -- : make[2]: Entering directory '/home/opc/ruby/build/master/ext/rubyvm' I, [2024-05-12T14:24:12.658548 #3956611] INFO -- : make[2]: Entering directory '/home/opc/ruby/build/master/ext/ripper' I, [2024-05-12T14:24:12.662029 #3956611] INFO -- : make[2]: Leaving directory '/home/opc/ruby/build/master/ext/rubyvm' I, [2024-05-12T14:24:12.664605 #3956611] INFO -- : make[2]: Leaving directory '/home/opc/ruby/build/master/ext/openssl' I, [2024-05-12T14:24:12.666921 #3956611] INFO -- : make[2]: Leaving directory '/home/opc/ruby/build/master/ext/ripper' I, [2024-05-12T14:24:12.674320 #3956611] INFO -- : make[2]: Entering directory '/home/opc/ruby/build/master/ext/socket' I, [2024-05-12T14:24:12.675496 #3956611] INFO -- : make[2]: Entering directory '/home/opc/ruby/build/master/.bundle/gems/bigdecimal-3.1.7/ext/bigdecimal' I, [2024-05-12T14:24:12.675752 #3956611] INFO -- : make[2]: Entering directory '/home/opc/ruby/build/master/.bundle/gems/bigdecimal-3.1.8/ext/bigdecimal' I, [2024-05-12T14:24:12.688729 #3956611] INFO -- : make[2]: Leaving directory '/home/opc/ruby/build/master/ext/socket' I, [2024-05-12T14:24:12.692991 #3956611] INFO -- : make[2]: Entering directory '/home/opc/ruby/build/master/.bundle/gems/debug-1.9.2/ext/debug' I, [2024-05-12T14:24:12.706804 #3956611] INFO -- : make[2]: Leaving directory '/home/opc/ruby/build/master/.bundle/gems/bigdecimal-3.1.7/ext/bigdecimal' I, [2024-05-12T14:24:12.710627 #3956611] INFO -- : make[2]: Leaving directory '/home/opc/ruby/build/master/.bundle/gems/bigdecimal-3.1.8/ext/bigdecimal' I, [2024-05-12T14:24:12.711214 #3956611] INFO -- : make[2]: Entering directory '/home/opc/ruby/build/master/.bundle/gems/nkf-0.2.0/ext/nkf' I, [2024-05-12T14:24:12.713001 #3956611] INFO -- : make[2]: Entering directory '/home/opc/ruby/build/master/.bundle/gems/racc-1.7.3/ext/racc/cparse' I, [2024-05-12T14:24:12.724826 #3956611] INFO -- : make[2]: Leaving directory '/home/opc/ruby/build/master/.bundle/gems/debug-1.9.2/ext/debug' I, [2024-05-12T14:24:12.732760 #3956611] INFO -- : make[2]: Entering directory '/home/opc/ruby/build/master/.bundle/gems/rbs-3.4.4/ext/rbs_extension' I, [2024-05-12T14:24:12.741891 #3956611] INFO -- : make[2]: Leaving directory '/home/opc/ruby/build/master/.bundle/gems/nkf-0.2.0/ext/nkf' I, [2024-05-12T14:24:12.744548 #3956611] INFO -- : make[2]: Entering directory '/home/opc/ruby/build/master/.bundle/gems/syslog-0.1.2/ext/syslog' I, [2024-05-12T14:24:12.748326 #3956611] INFO -- : make[2]: Leaving directory '/home/opc/ruby/build/master/.bundle/gems/racc-1.7.3/ext/racc/cparse' I, [2024-05-12T14:24:12.764298 #3956611] INFO -- : make[2]: Leaving directory '/home/opc/ruby/build/master/.bundle/gems/rbs-3.4.4/ext/rbs_extension' I, [2024-05-12T14:24:12.768808 #3956611] INFO -- : make[2]: Entering directory '/home/opc/ruby/build/master/ext/digest/sha2' I, [2024-05-12T14:24:12.774153 #3956611] INFO -- : make[2]: Leaving directory '/home/opc/ruby/build/master/ext/digest/sha2' I, [2024-05-12T14:24:12.777390 #3956611] INFO -- : make[2]: Leaving directory '/home/opc/ruby/build/master/.bundle/gems/syslog-0.1.2/ext/syslog' I, [2024-05-12T14:24:12.815502 #3956611] INFO -- : make[2]: Entering directory '/home/opc/ruby/build/master' I, [2024-05-12T14:24:12.898850 #3956611] INFO -- : make[2]: 'ruby' is up to date. I, [2024-05-12T14:24:12.898939 #3956611] INFO -- : make[2]: Leaving directory '/home/opc/ruby/build/master' I, [2024-05-12T14:24:12.899043 #3956611] INFO -- : make[1]: Leaving directory '/home/opc/ruby/build/master' I, [2024-05-12T14:24:12.903375 #3956611] INFO -- : make[1]: Entering directory '/home/opc/ruby/build/master' I, [2024-05-12T14:24:12.903395 #3956611] INFO -- : make[1]: Nothing to be done for 'note'. I, [2024-05-12T14:24:12.903407 #3956611] INFO -- : make[1]: Leaving directory '/home/opc/ruby/build/master' I, [2024-05-12T14:24:12.903560 #3956611] INFO -- : ./miniruby -I/home/opc/ruby/src/master/lib -I. -I.ext/common /home/opc/ruby/src/master/tool/runruby.rb --extout=.ext -- --disable-gems -r./aarch64-linux-fake /home/opc/ruby/src/master/tool/rbinstall.rb --make="make" --dest-dir="" --extout=".ext" --ext-build-dir="./ext" --mflags="-j3 --jobserver-auth=4,5" --make-flags=" -j3 --jobserver-auth=4,5" --data-mode=0644 --prog-mode=0755 --installed-list .installed.list --mantype="doc" --gnumake --install=all --exclude=doc I, [2024-05-12T14:24:13.052530 #3956611] INFO -- : Installing to I, [2024-05-12T14:24:13.052622 #3956611] INFO -- : installing binary commands: /home/opc/ruby/install/master/bin I, [2024-05-12T14:24:13.064271 #3956611] INFO -- : installing base libraries: /home/opc/ruby/install/master/lib I, [2024-05-12T14:24:13.066027 #3956611] INFO -- : installing arch files: /home/opc/ruby/install/master/lib/ruby/3.4.0+0/aarch64-linux I, [2024-05-12T14:24:13.066179 #3956611] INFO -- : installing pkgconfig data: /home/opc/ruby/install/master/lib/pkgconfig I, [2024-05-12T14:24:13.066315 #3956611] INFO -- : installing extension objects: /home/opc/ruby/install/master/lib/ruby/3.4.0+0/aarch64-linux I, [2024-05-12T14:24:13.078875 #3956611] INFO -- : installing extension objects: /home/opc/ruby/install/master/lib/ruby/site_ruby/3.4.0+0/aarch64-linux I, [2024-05-12T14:24:13.078913 #3956611] INFO -- : installing extension objects: /home/opc/ruby/install/master/lib/ruby/vendor_ruby/3.4.0+0/aarch64-linux I, [2024-05-12T14:24:13.079019 #3956611] INFO -- : installing extension headers: /home/opc/ruby/install/master/include/ruby-3.4.0+0/aarch64-linux I, [2024-05-12T14:24:13.079293 #3956611] INFO -- : installing extension scripts: /home/opc/ruby/install/master/lib/ruby/3.4.0+0 I, [2024-05-12T14:24:13.088330 #3956611] INFO -- : installing extension scripts: /home/opc/ruby/install/master/lib/ruby/site_ruby/3.4.0+0 I, [2024-05-12T14:24:13.088352 #3956611] INFO -- : installing extension scripts: /home/opc/ruby/install/master/lib/ruby/vendor_ruby/3.4.0+0 I, [2024-05-12T14:24:13.088364 #3956611] INFO -- : installing extension headers: /home/opc/ruby/install/master/include/ruby-3.4.0+0/ruby I, [2024-05-12T14:24:13.088496 #3956611] INFO -- : installing command scripts: /home/opc/ruby/install/master/bin I, [2024-05-12T14:24:13.088666 #3956611] INFO -- : installing library scripts: /home/opc/ruby/install/master/lib/ruby/3.4.0+0 I, [2024-05-12T14:24:13.173185 #3956611] INFO -- : installing common headers: /home/opc/ruby/install/master/include/ruby-3.4.0+0 I, [2024-05-12T14:24:13.188444 #3956611] INFO -- : installing manpages: /home/opc/ruby/install/master/share/man/man1 I, [2024-05-12T14:24:13.188895 #3956611] INFO -- : installing default gems from lib: /home/opc/ruby/install/master/lib/ruby/gems/3.4.0+0 I, [2024-05-12T14:24:13.228106 #3956611] INFO -- : benchmark 0.3.0 I, [2024-05-12T14:24:13.243142 #3956611] INFO -- : bundler 2.6.0.dev I, [2024-05-12T14:24:13.248757 #3956611] INFO -- : cgi 0.4.1 I, [2024-05-12T14:24:13.250697 #3956611] INFO -- : delegate 0.3.1 I, [2024-05-12T14:24:13.252460 #3956611] INFO -- : did_you_mean 1.6.3 I, [2024-05-12T14:24:13.254601 #3956611] INFO -- : english 0.8.0 I, [2024-05-12T14:24:13.255741 #3956611] INFO -- : erb 4.0.4 I, [2024-05-12T14:24:13.258727 #3956611] INFO -- : error_highlight 0.6.0 I, [2024-05-12T14:24:13.260609 #3956611] INFO -- : fileutils 1.7.2 I, [2024-05-12T14:24:13.261735 #3956611] INFO -- : find 0.2.0 I, [2024-05-12T14:24:13.263519 #3956611] INFO -- : forwardable 1.3.3 I, [2024-05-12T14:24:13.264632 #3956611] INFO -- : ipaddr 1.2.6 I, [2024-05-12T14:24:13.266677 #3956611] INFO -- : irb 1.13.1 I, [2024-05-12T14:24:13.269823 #3956611] INFO -- : logger 1.6.0 I, [2024-05-12T14:24:13.272332 #3956611] INFO -- : net-http 0.4.1 I, [2024-05-12T14:24:13.274668 #3956611] INFO -- : net-protocol 0.2.2 I, [2024-05-12T14:24:13.275801 #3956611] INFO -- : open-uri 0.4.1 I, [2024-05-12T14:24:13.277692 #3956611] INFO -- : open3 0.2.1 I, [2024-05-12T14:24:13.278785 #3956611] INFO -- : optparse 0.5.0 I, [2024-05-12T14:24:13.280824 #3956611] INFO -- : ostruct 0.6.0 I, [2024-05-12T14:24:13.281945 #3956611] INFO -- : pp 0.5.0 I, [2024-05-12T14:24:13.283883 #3956611] INFO -- : prettyprint 0.2.0 I, [2024-05-12T14:24:13.285028 #3956611] INFO -- : prism 0.29.0 I, [2024-05-12T14:24:13.286953 #3956611] INFO -- : pstore 0.1.3 I, [2024-05-12T14:24:13.288834 #3956611] INFO -- : rdoc 6.6.3.1 I, [2024-05-12T14:24:13.293587 #3956611] INFO -- : readline 0.0.4 I, [2024-05-12T14:24:13.294671 #3956611] INFO -- : reline 0.5.6 I, [2024-05-12T14:24:13.295817 #3956611] INFO -- : resolv 0.4.0 I, [2024-05-12T14:24:13.297695 #3956611] INFO -- : ruby2_keywords 0.0.5 I, [2024-05-12T14:24:13.298768 #3956611] INFO -- : securerandom 0.3.1 I, [2024-05-12T14:24:13.300510 #3956611] INFO -- : set 1.1.0 I, [2024-05-12T14:24:13.301714 #3956611] INFO -- : shellwords 0.2.0 I, [2024-05-12T14:24:13.303548 #3956611] INFO -- : singleton 0.2.0 I, [2024-05-12T14:24:13.306672 #3956611] INFO -- : syntax_suggest 2.0.0 I, [2024-05-12T14:24:13.309295 #3956611] INFO -- : tempfile 0.2.1 I, [2024-05-12T14:24:13.311107 #3956611] INFO -- : time 0.3.0 I, [2024-05-12T14:24:13.312252 #3956611] INFO -- : timeout 0.4.1 I, [2024-05-12T14:24:13.314181 #3956611] INFO -- : tmpdir 0.2.0 I, [2024-05-12T14:24:13.315313 #3956611] INFO -- : tsort 0.2.0 I, [2024-05-12T14:24:13.317141 #3956611] INFO -- : un 0.3.0 I, [2024-05-12T14:24:13.318297 #3956611] INFO -- : uri 0.13.0 I, [2024-05-12T14:24:13.320173 #3956611] INFO -- : weakref 0.1.3 I, [2024-05-12T14:24:13.321545 #3956611] INFO -- : yaml 0.3.0 I, [2024-05-12T14:24:13.323739 #3956611] INFO -- : installing default gems from ext: /home/opc/ruby/install/master/lib/ruby/gems/3.4.0+0 I, [2024-05-12T14:24:13.334984 #3956611] INFO -- : date 3.3.4 I, [2024-05-12T14:24:13.336134 #3956611] INFO -- : digest 3.1.1 I, [2024-05-12T14:24:13.338217 #3956611] INFO -- : etc 1.4.3 I, [2024-05-12T14:24:13.339347 #3956611] INFO -- : fcntl 1.1.0 I, [2024-05-12T14:24:13.341310 #3956611] INFO -- : fiddle 1.1.3 I, [2024-05-12T14:24:13.342423 #3956611] INFO -- : io-console 0.7.2 I, [2024-05-12T14:24:13.344227 #3956611] INFO -- : io-nonblock 0.3.0 I, [2024-05-12T14:24:13.345519 #3956611] INFO -- : io-wait 0.3.1 I, [2024-05-12T14:24:13.347220 #3956611] INFO -- : json 2.7.2 I, [2024-05-12T14:24:13.349481 #3956611] INFO -- : openssl 3.2.0 I, [2024-05-12T14:24:13.351782 #3956611] INFO -- : pathname 0.3.0 I, [2024-05-12T14:24:13.352924 #3956611] INFO -- : psych 5.1.2 I, [2024-05-12T14:24:13.355090 #3956611] INFO -- : stringio 3.1.1 I, [2024-05-12T14:24:13.356241 #3956611] INFO -- : strscan 3.1.1 I, [2024-05-12T14:24:13.358186 #3956611] INFO -- : zlib 3.1.0 I, [2024-05-12T14:24:13.359120 #3956611] INFO -- : installing bundled gems: /home/opc/ruby/install/master/lib/ruby/gems/3.4.0+0 I, [2024-05-12T14:24:13.359747 #3956611] INFO -- : minitest 5.22.3 I, [2024-05-12T14:24:13.379545 #3956611] INFO -- : rake 13.2.1 I, [2024-05-12T14:24:13.397307 #3956611] INFO -- : test-unit 3.6.2 I, [2024-05-12T14:24:13.420423 #3956611] INFO -- : rexml 3.2.6 I, [2024-05-12T14:24:13.438079 #3956611] INFO -- : rss 0.3.0 I, [2024-05-12T14:24:13.459116 #3956611] INFO -- : net-ftp 0.3.4 I, [2024-05-12T14:24:13.463601 #3956611] INFO -- : net-imap 0.4.11 I, [2024-05-12T14:24:13.481244 #3956611] INFO -- : net-pop 0.1.2 I, [2024-05-12T14:24:13.486866 #3956611] INFO -- : net-smtp 0.5.0 I, [2024-05-12T14:24:13.491433 #3956611] INFO -- : matrix 0.4.2 I, [2024-05-12T14:24:13.497874 #3956611] INFO -- : prime 0.1.2 I, [2024-05-12T14:24:13.508901 #3956611] INFO -- : rbs 3.4.4 I, [2024-05-12T14:24:13.634450 #3956611] INFO -- : typeprof 0.21.11 I, [2024-05-12T14:24:13.645964 #3956611] INFO -- : debug 1.9.2 I, [2024-05-12T14:24:13.661058 #3956611] INFO -- : racc 1.7.3 I, [2024-05-12T14:24:13.674445 #3956611] INFO -- : mutex_m 0.2.0 I, [2024-05-12T14:24:13.679080 #3956611] INFO -- : getoptlong 0.2.1 I, [2024-05-12T14:24:13.684828 #3956611] INFO -- : base64 0.2.0 I, [2024-05-12T14:24:13.688968 #3956611] INFO -- : bigdecimal 3.1.8 I, [2024-05-12T14:24:13.697718 #3956611] INFO -- : observer 0.1.2 I, [2024-05-12T14:24:13.703544 #3956611] INFO -- : abbrev 0.1.2 I, [2024-05-12T14:24:13.708978 #3956611] INFO -- : resolv-replace 0.1.1 I, [2024-05-12T14:24:13.712780 #3956611] INFO -- : rinda 0.2.0 I, [2024-05-12T14:24:13.719312 #3956611] INFO -- : drb 2.2.1 I, [2024-05-12T14:24:13.723698 #3956611] INFO -- : nkf 0.2.0 I, [2024-05-12T14:24:13.734278 #3956611] INFO -- : syslog 0.1.2 I, [2024-05-12T14:24:13.739527 #3956611] INFO -- : csv 3.3.0 I, [2024-05-12T14:24:13.750244 #3956611] INFO -- : installing bundled gem cache: /home/opc/ruby/install/master/lib/ruby/gems/3.4.0+0/cache I, [2024-05-12T14:24:13.752174 #3956611] INFO -- : skipped bundled gems: I, [2024-05-12T14:24:13.752201 #3956611] INFO -- : power_assert-2.0.4dev.gem not found in bundled_gems I, [2024-05-12T14:24:13.755029 #3956611] INFO -- : $$$[end] "make install -j3" exit with 0. I, [2024-05-12T14:24:13.755180 #3956611] INFO -- : $$$[beg] make yes-btest TESTOPTS='-q -j3' I, [2024-05-12T14:24:35.750476 #3956611] INFO -- : PASS all 1936 tests E, [2024-05-12T14:24:35.752281 #3956611] ERROR -- : I, [2024-05-12T14:24:35.752410 #3956611] INFO -- : $$$[end] "make yes-btest TESTOPTS='-q -j3'" exit with 0. I, [2024-05-12T14:24:35.752556 #3956611] INFO -- : $$$[beg] make yes-test-basic TESTS='-j3' I, [2024-05-12T14:24:35.843104 #3956611] INFO -- : BASERUBY = /usr/local/bin/ruby --disable=gems I, [2024-05-12T14:24:35.843173 #3956611] INFO -- : CC = gcc I, [2024-05-12T14:24:35.844626 #3956611] INFO -- : LD = ld I, [2024-05-12T14:24:35.844641 #3956611] INFO -- : LDSHARED = gcc -shared I, [2024-05-12T14:24:35.844662 #3956611] INFO -- : CFLAGS = -O3 -fno-fast-math -ggdb3 -Wall -Wextra -Wdeprecated-declarations -Wdiv-by-zero -Wduplicated-cond -Wimplicit-function-declaration -Wimplicit-int -Wpointer-arith -Wwrite-strings -Wold-style-definition -Wimplicit-fallthrough=0 -Wmissing-noreturn -Wno-cast-function-type -Wno-constant-logical-operand -Wno-long-long -Wno-missing-field-initializers -Wno-overlength-strings -Wno-packed-bitfield-compat -Wno-parentheses-equality -Wno-self-assign -Wno-tautological-compare -Wno-unused-parameter -Wno-unused-value -Wsuggest-attribute=format -Wsuggest-attribute=noreturn -Wunused-variable -Wmisleading-indentation -Wundef I, [2024-05-12T14:24:35.844676 #3956611] INFO -- : XCFLAGS = -U_FORTIFY_SOURCE -D_FORTIFY_SOURCE=2 -fstack-protector-strong -msign-return-address=all -fno-strict-overflow -fvisibility=hidden -fexcess-precision=standard -DRUBY_EXPORT -fPIE -I. -I.ext/include/aarch64-linux -I/home/opc/ruby/src/master/include -I/home/opc/ruby/src/master -I/home/opc/ruby/src/master/prism -I/home/opc/ruby/src/master/enc/unicode/15.0.0 I, [2024-05-12T14:24:35.844685 #3956611] INFO -- : CPPFLAGS = I, [2024-05-12T14:24:35.844693 #3956611] INFO -- : DLDFLAGS = -Wl,--compress-debug-sections=zlib -fstack-protector-strong -pie I, [2024-05-12T14:24:35.844701 #3956611] INFO -- : SOLIBS = -lz -lrt -lrt -ldl -lcrypt -lm -lpthread I, [2024-05-12T14:24:35.844709 #3956611] INFO -- : LANG = en_US.UTF-8 I, [2024-05-12T14:24:35.844716 #3956611] INFO -- : LC_ALL = I, [2024-05-12T14:24:35.844724 #3956611] INFO -- : LC_CTYPE = I, [2024-05-12T14:24:35.844731 #3956611] INFO -- : MFLAGS = I, [2024-05-12T14:24:35.844739 #3956611] INFO -- : RUSTC = rustc I, [2024-05-12T14:24:35.844746 #3956611] INFO -- : YJIT_RUSTC_ARGS = --crate-name=yjit --crate-type=staticlib --edition=2021 -g -C lto=thin -C opt-level=3 -C overflow-checks=on '--out-dir=/home/opc/ruby/build/master/yjit/target/release/' /home/opc/ruby/src/master/yjit/src/lib.rs I, [2024-05-12T14:24:35.845506 #3956611] INFO -- : gcc (GCC) 8.5.0 20210514 (Red Hat 8.5.0-10.1.0.1) I, [2024-05-12T14:24:35.845541 #3956611] INFO -- : Copyright (C) 2018 Free Software Foundation, Inc. I, [2024-05-12T14:24:35.845553 #3956611] INFO -- : This is free software; see the source for copying conditions. There is NO I, [2024-05-12T14:24:35.845563 #3956611] INFO -- : warranty; not even for MERCHANTABILITY or FITNESS FOR A PARTICULAR PURPOSE. I, [2024-05-12T14:24:35.845571 #3956611] INFO -- : I, [2024-05-12T14:24:36.000086 #3956611] INFO -- : Checking leaked global symbols...none I, [2024-05-12T14:24:36.051521 #3956611] INFO -- : /home/opc/ruby/src/master/basictest/test.rb:assignment ....................................................................................................................................................................................................................................................................................................................................................................................OK 372 I, [2024-05-12T14:24:36.051592 #3956611] INFO -- : /home/opc/ruby/src/master/basictest/test.rb:condition ..OK 2 I, [2024-05-12T14:24:36.051618 #3956611] INFO -- : /home/opc/ruby/src/master/basictest/test.rb:if/unless ...OK 3 I, [2024-05-12T14:24:36.051667 #3956611] INFO -- : /home/opc/ruby/src/master/basictest/test.rb:case .....OK 5 I, [2024-05-12T14:24:36.052220 #3956611] INFO -- : /home/opc/ruby/src/master/basictest/test.rb:while/until ........OK 8 I, [2024-05-12T14:24:36.052338 #3956611] INFO -- : /home/opc/ruby/src/master/basictest/test.rb:exception ..........OK 10 I, [2024-05-12T14:24:36.052973 #3956611] INFO -- : /home/opc/ruby/src/master/basictest/test.rb:array .......................................OK 39 I, [2024-05-12T14:24:36.053257 #3956611] INFO -- : /home/opc/ruby/src/master/basictest/test.rb:hash ...........................OK 27 I, [2024-05-12T14:24:36.054869 #3956611] INFO -- : /home/opc/ruby/src/master/basictest/test.rb:iterator ...........................................................................................................OK 107 I, [2024-05-12T14:24:36.055589 #3956611] INFO -- : /home/opc/ruby/src/master/basictest/test.rb:float ................................................................................OK 80 I, [2024-05-12T14:24:36.059058 #3956611] INFO -- : /home/opc/ruby/src/master/basictest/test.rb:bignum ...............................OK 31 I, [2024-05-12T14:24:36.060632 #3956611] INFO -- : /home/opc/ruby/src/master/basictest/test.rb:string & char ..............................................................OK 62 I, [2024-05-12T14:24:36.060706 #3956611] INFO -- : /home/opc/ruby/src/master/basictest/test.rb:assignment ..........OK 10 I, [2024-05-12T14:24:36.060774 #3956611] INFO -- : /home/opc/ruby/src/master/basictest/test.rb:call ......OK 6 I, [2024-05-12T14:24:36.060984 #3956611] INFO -- : /home/opc/ruby/src/master/basictest/test.rb:proc .........OK 9 I, [2024-05-12T14:24:36.161212 #3956611] INFO -- : /home/opc/ruby/src/master/basictest/test.rb:signal ..OK 2 I, [2024-05-12T14:24:36.162786 #3956611] INFO -- : /home/opc/ruby/src/master/basictest/test.rb:eval ...........................OK 27 I, [2024-05-12T14:24:36.291620 #3956611] INFO -- : /home/opc/ruby/src/master/basictest/test.rb:system ........OK 8 I, [2024-05-12T14:24:36.291684 #3956611] INFO -- : /home/opc/ruby/src/master/basictest/test.rb:const .....OK 5 I, [2024-05-12T14:24:36.291786 #3956611] INFO -- : /home/opc/ruby/src/master/basictest/test.rb:clone .....OK 5 I, [2024-05-12T14:24:36.291970 #3956611] INFO -- : /home/opc/ruby/src/master/basictest/test.rb:marshal ....OK 4 I, [2024-05-12T14:24:36.292045 #3956611] INFO -- : /home/opc/ruby/src/master/basictest/test.rb:pack ....OK 4 I, [2024-05-12T14:24:36.292078 #3956611] INFO -- : /home/opc/ruby/src/master/basictest/test.rb:math ..OK 2 I, [2024-05-12T14:24:36.292166 #3956611] INFO -- : /home/opc/ruby/src/master/basictest/test.rb:struct ......OK 6 I, [2024-05-12T14:24:36.292331 #3956611] INFO -- : /home/opc/ruby/src/master/basictest/test.rb:variable ............OK 12 I, [2024-05-12T14:24:36.292372 #3956611] INFO -- : /home/opc/ruby/src/master/basictest/test.rb:trace ...OK 3 I, [2024-05-12T14:24:36.292543 #3956611] INFO -- : /home/opc/ruby/src/master/basictest/test.rb:defined? ............OK 12 I, [2024-05-12T14:24:36.292631 #3956611] INFO -- : /home/opc/ruby/src/master/basictest/test.rb:alias ......OK 6 I, [2024-05-12T14:24:36.293197 #3956611] INFO -- : /home/opc/ruby/src/master/basictest/test.rb:path .......................OK 23 I, [2024-05-12T14:24:36.359701 #3956611] INFO -- : /home/opc/ruby/src/master/basictest/test.rb:gc ....OK 4 I, [2024-05-12T14:24:36.361602 #3956611] INFO -- : I, [2024-05-12T14:24:36.361636 #3956611] INFO -- : test succeeded I, [2024-05-12T14:24:36.362214 #3956611] INFO -- : $$$[end] "make yes-test-basic TESTS='-j3'" exit with 0. I, [2024-05-12T14:24:36.362425 #3956611] INFO -- : $$$[beg] make yes-test-all TESTOPTS='--stderr-on-failure' TESTS='-j3' I, [2024-05-12T14:24:36.486849 #3956611] INFO -- : BASERUBY = /usr/local/bin/ruby --disable=gems I, [2024-05-12T14:24:36.486923 #3956611] INFO -- : CC = gcc I, [2024-05-12T14:24:36.486936 #3956611] INFO -- : LD = ld I, [2024-05-12T14:24:36.486945 #3956611] INFO -- : LDSHARED = gcc -shared I, [2024-05-12T14:24:36.486957 #3956611] INFO -- : CFLAGS = -O3 -fno-fast-math -ggdb3 -Wall -Wextra -Wdeprecated-declarations -Wdiv-by-zero -Wduplicated-cond -Wimplicit-function-declaration -Wimplicit-int -Wpointer-arith -Wwrite-strings -Wold-style-definition -Wimplicit-fallthrough=0 -Wmissing-noreturn -Wno-cast-function-type -Wno-constant-logical-operand -Wno-long-long -Wno-missing-field-initializers -Wno-overlength-strings -Wno-packed-bitfield-compat -Wno-parentheses-equality -Wno-self-assign -Wno-tautological-compare -Wno-unused-parameter -Wno-unused-value -Wsuggest-attribute=format -Wsuggest-attribute=noreturn -Wunused-variable -Wmisleading-indentation -Wundef I, [2024-05-12T14:24:36.486967 #3956611] INFO -- : XCFLAGS = -U_FORTIFY_SOURCE -D_FORTIFY_SOURCE=2 -fstack-protector-strong -msign-return-address=all -fno-strict-overflow -fvisibility=hidden -fexcess-precision=standard -DRUBY_EXPORT -fPIE -I. -I.ext/include/aarch64-linux -I/home/opc/ruby/src/master/include -I/home/opc/ruby/src/master -I/home/opc/ruby/src/master/prism -I/home/opc/ruby/src/master/enc/unicode/15.0.0 I, [2024-05-12T14:24:36.486976 #3956611] INFO -- : CPPFLAGS = I, [2024-05-12T14:24:36.486985 #3956611] INFO -- : DLDFLAGS = -Wl,--compress-debug-sections=zlib -fstack-protector-strong -pie I, [2024-05-12T14:24:36.486995 #3956611] INFO -- : SOLIBS = -lz -lrt -lrt -ldl -lcrypt -lm -lpthread I, [2024-05-12T14:24:36.487003 #3956611] INFO -- : LANG = en_US.UTF-8 I, [2024-05-12T14:24:36.487011 #3956611] INFO -- : LC_ALL = I, [2024-05-12T14:24:36.487019 #3956611] INFO -- : LC_CTYPE = I, [2024-05-12T14:24:36.487026 #3956611] INFO -- : MFLAGS = I, [2024-05-12T14:24:36.487034 #3956611] INFO -- : RUSTC = rustc I, [2024-05-12T14:24:36.487042 #3956611] INFO -- : YJIT_RUSTC_ARGS = --crate-name=yjit --crate-type=staticlib --edition=2021 -g -C lto=thin -C opt-level=3 -C overflow-checks=on '--out-dir=/home/opc/ruby/build/master/yjit/target/release/' /home/opc/ruby/src/master/yjit/src/lib.rs I, [2024-05-12T14:24:36.487724 #3956611] INFO -- : gcc (GCC) 8.5.0 20210514 (Red Hat 8.5.0-10.1.0.1) I, [2024-05-12T14:24:36.487744 #3956611] INFO -- : Copyright (C) 2018 Free Software Foundation, Inc. I, [2024-05-12T14:24:36.487754 #3956611] INFO -- : This is free software; see the source for copying conditions. There is NO I, [2024-05-12T14:24:36.487762 #3956611] INFO -- : warranty; not even for MERCHANTABILITY or FITNESS FOR A PARTICULAR PURPOSE. I, [2024-05-12T14:24:36.487771 #3956611] INFO -- : I, [2024-05-12T14:24:36.490011 #3956611] INFO -- : generating enc.mk I, [2024-05-12T14:24:36.722708 #3956611] INFO -- : generating encdb.h I, [2024-05-12T14:24:36.759231 #3956611] INFO -- : encdb.h unchanged I, [2024-05-12T14:24:36.760471 #3956611] INFO -- : making enc I, [2024-05-12T14:24:36.788523 #3956611] INFO -- : make[1]: Entering directory '/home/opc/ruby/build/master' I, [2024-05-12T14:24:36.788566 #3956611] INFO -- : make[1]: Nothing to be done for 'enc'. I, [2024-05-12T14:24:36.788576 #3956611] INFO -- : make[1]: Leaving directory '/home/opc/ruby/build/master' I, [2024-05-12T14:24:36.789318 #3956611] INFO -- : making srcs under enc I, [2024-05-12T14:24:36.830886 #3956611] INFO -- : make[1]: Entering directory '/home/opc/ruby/build/master' I, [2024-05-12T14:24:36.830952 #3956611] INFO -- : make[1]: Nothing to be done for 'srcs'. I, [2024-05-12T14:24:36.830974 #3956611] INFO -- : make[1]: Leaving directory '/home/opc/ruby/build/master' I, [2024-05-12T14:24:36.832046 #3956611] INFO -- : generating transdb.h I, [2024-05-12T14:24:36.973567 #3956611] INFO -- : transdb.h unchanged I, [2024-05-12T14:24:36.974977 #3956611] INFO -- : making trans I, [2024-05-12T14:24:37.024017 #3956611] INFO -- : make[1]: Entering directory '/home/opc/ruby/build/master' I, [2024-05-12T14:24:37.024073 #3956611] INFO -- : make[1]: Nothing to be done for 'trans'. I, [2024-05-12T14:24:37.024086 #3956611] INFO -- : make[1]: Leaving directory '/home/opc/ruby/build/master' I, [2024-05-12T14:24:37.024854 #3956611] INFO -- : making encs I, [2024-05-12T14:24:37.077003 #3956611] INFO -- : make[1]: Entering directory '/home/opc/ruby/build/master' I, [2024-05-12T14:24:37.077065 #3956611] INFO -- : make[1]: Nothing to be done for 'encs'. I, [2024-05-12T14:24:37.077078 #3956611] INFO -- : make[1]: Leaving directory '/home/opc/ruby/build/master' I, [2024-05-12T14:24:37.079141 #3956611] INFO -- : generating makefiles ext/configure-ext.mk I, [2024-05-12T14:24:37.118231 #3956611] INFO -- : ext/configure-ext.mk updated I, [2024-05-12T14:24:37.121882 #3956611] INFO -- : make[1]: Entering directory '/home/opc/ruby/build/master' I, [2024-05-12T14:24:39.148928 #3956611] INFO -- : make[1]: Leaving directory '/home/opc/ruby/build/master' I, [2024-05-12T14:24:39.149648 #3956611] INFO -- : generating makefile exts.mk I, [2024-05-12T14:24:39.207428 #3956611] INFO -- : exts.mk unchanged I, [2024-05-12T14:24:39.212187 #3956611] INFO -- : make[1]: Entering directory '/home/opc/ruby/build/master' I, [2024-05-12T14:24:39.508944 #3956611] INFO -- : make[2]: Entering directory '/home/opc/ruby/build/master/ext/coverage' I, [2024-05-12T14:24:39.513675 #3956611] INFO -- : make[2]: Leaving directory '/home/opc/ruby/build/master/ext/coverage' I, [2024-05-12T14:24:39.519230 #3956611] INFO -- : make[2]: Entering directory '/home/opc/ruby/build/master/ext/date' I, [2024-05-12T14:24:39.524776 #3956611] INFO -- : make[2]: Leaving directory '/home/opc/ruby/build/master/ext/date' I, [2024-05-12T14:24:39.528157 #3956611] INFO -- : make[2]: Entering directory '/home/opc/ruby/build/master/ext/digest' I, [2024-05-12T14:24:39.536987 #3956611] INFO -- : make[2]: Leaving directory '/home/opc/ruby/build/master/ext/digest' I, [2024-05-12T14:24:39.559434 #3956611] INFO -- : make[2]: Entering directory '/home/opc/ruby/build/master/ext/digest/sha2' I, [2024-05-12T14:24:39.564392 #3956611] INFO -- : make[2]: Leaving directory '/home/opc/ruby/build/master/ext/digest/sha2' I, [2024-05-12T14:24:39.582279 #3956611] INFO -- : make[2]: Entering directory '/home/opc/ruby/build/master/ext/fiddle' I, [2024-05-12T14:24:39.592347 #3956611] INFO -- : make[2]: Leaving directory '/home/opc/ruby/build/master/ext/fiddle' I, [2024-05-12T14:24:39.596661 #3956611] INFO -- : make[2]: Entering directory '/home/opc/ruby/build/master/ext/io/console' I, [2024-05-12T14:24:39.600906 #3956611] INFO -- : make[2]: Leaving directory '/home/opc/ruby/build/master/ext/io/console' I, [2024-05-12T14:24:39.611504 #3956611] INFO -- : make[2]: Entering directory '/home/opc/ruby/build/master/ext/json' I, [2024-05-12T14:24:39.620862 #3956611] INFO -- : make[2]: Leaving directory '/home/opc/ruby/build/master/ext/json' I, [2024-05-12T14:24:39.633893 #3956611] INFO -- : make[2]: Entering directory '/home/opc/ruby/build/master/ext/monitor' I, [2024-05-12T14:24:39.637939 #3956611] INFO -- : make[2]: Leaving directory '/home/opc/ruby/build/master/ext/monitor' I, [2024-05-12T14:24:39.643845 #3956611] INFO -- : make[2]: Entering directory '/home/opc/ruby/build/master/ext/objspace' I, [2024-05-12T14:24:39.649753 #3956611] INFO -- : make[2]: Leaving directory '/home/opc/ruby/build/master/ext/objspace' I, [2024-05-12T14:24:39.668550 #3956611] INFO -- : make[2]: Entering directory '/home/opc/ruby/build/master/ext/openssl' I, [2024-05-12T14:24:39.690206 #3956611] INFO -- : make[2]: Leaving directory '/home/opc/ruby/build/master/ext/openssl' I, [2024-05-12T14:24:39.694472 #3956611] INFO -- : make[2]: Entering directory '/home/opc/ruby/build/master/ext/pathname' I, [2024-05-12T14:24:39.698671 #3956611] INFO -- : make[2]: Leaving directory '/home/opc/ruby/build/master/ext/pathname' I, [2024-05-12T14:24:39.704802 #3956611] INFO -- : make[2]: Entering directory '/home/opc/ruby/build/master/ext/psych' I, [2024-05-12T14:24:39.725949 #3956611] INFO -- : make[2]: Leaving directory '/home/opc/ruby/build/master/ext/psych' I, [2024-05-12T14:24:39.730250 #3956611] INFO -- : make[2]: Entering directory '/home/opc/ruby/build/master/ext/pty' I, [2024-05-12T14:24:39.734385 #3956611] INFO -- : make[2]: Leaving directory '/home/opc/ruby/build/master/ext/pty' I, [2024-05-12T14:24:39.747501 #3956611] INFO -- : make[2]: Entering directory '/home/opc/ruby/build/master/ext/ripper' I, [2024-05-12T14:24:39.755304 #3956611] INFO -- : make[2]: Leaving directory '/home/opc/ruby/build/master/ext/ripper' I, [2024-05-12T14:24:39.757362 #3956611] INFO -- : make[2]: Entering directory '/home/opc/ruby/build/master/ext/rubyvm' I, [2024-05-12T14:24:39.760661 #3956611] INFO -- : make[2]: Leaving directory '/home/opc/ruby/build/master/ext/rubyvm' I, [2024-05-12T14:24:39.772626 #3956611] INFO -- : make[2]: Entering directory '/home/opc/ruby/build/master/ext/socket' I, [2024-05-12T14:24:39.783087 #3956611] INFO -- : make[2]: Leaving directory '/home/opc/ruby/build/master/ext/socket' I, [2024-05-12T14:24:39.798338 #3956611] INFO -- : make[2]: Entering directory '/home/opc/ruby/build/master/.bundle/gems/bigdecimal-3.1.7/ext/bigdecimal' I, [2024-05-12T14:24:39.829805 #3956611] INFO -- : make[2]: Leaving directory '/home/opc/ruby/build/master/.bundle/gems/bigdecimal-3.1.7/ext/bigdecimal' I, [2024-05-12T14:24:39.832520 #3956611] INFO -- : make[2]: Entering directory '/home/opc/ruby/build/master/.bundle/gems/bigdecimal-3.1.8/ext/bigdecimal' I, [2024-05-12T14:24:39.862639 #3956611] INFO -- : make[2]: Leaving directory '/home/opc/ruby/build/master/.bundle/gems/bigdecimal-3.1.8/ext/bigdecimal' I, [2024-05-12T14:24:39.865115 #3956611] INFO -- : make[2]: Entering directory '/home/opc/ruby/build/master/.bundle/gems/debug-1.9.2/ext/debug' I, [2024-05-12T14:24:39.894784 #3956611] INFO -- : make[2]: Leaving directory '/home/opc/ruby/build/master/.bundle/gems/debug-1.9.2/ext/debug' I, [2024-05-12T14:24:39.897271 #3956611] INFO -- : make[2]: Entering directory '/home/opc/ruby/build/master/.bundle/gems/nkf-0.2.0/ext/nkf' I, [2024-05-12T14:24:39.926672 #3956611] INFO -- : make[2]: Leaving directory '/home/opc/ruby/build/master/.bundle/gems/nkf-0.2.0/ext/nkf' I, [2024-05-12T14:24:39.929182 #3956611] INFO -- : make[2]: Entering directory '/home/opc/ruby/build/master/.bundle/gems/racc-1.7.3/ext/racc/cparse' I, [2024-05-12T14:24:39.959008 #3956611] INFO -- : make[2]: Leaving directory '/home/opc/ruby/build/master/.bundle/gems/racc-1.7.3/ext/racc/cparse' I, [2024-05-12T14:24:39.961968 #3956611] INFO -- : make[2]: Entering directory '/home/opc/ruby/build/master/.bundle/gems/rbs-3.4.4/ext/rbs_extension' I, [2024-05-12T14:24:39.991548 #3956611] INFO -- : make[2]: Leaving directory '/home/opc/ruby/build/master/.bundle/gems/rbs-3.4.4/ext/rbs_extension' I, [2024-05-12T14:24:39.994061 #3956611] INFO -- : make[2]: Entering directory '/home/opc/ruby/build/master/.bundle/gems/syslog-0.1.2/ext/syslog' I, [2024-05-12T14:24:40.023982 #3956611] INFO -- : make[2]: Leaving directory '/home/opc/ruby/build/master/.bundle/gems/syslog-0.1.2/ext/syslog' I, [2024-05-12T14:24:40.061981 #3956611] INFO -- : make[2]: Entering directory '/home/opc/ruby/build/master' I, [2024-05-12T14:24:40.143442 #3956611] INFO -- : make[2]: 'ruby' is up to date. I, [2024-05-12T14:24:40.143530 #3956611] INFO -- : make[2]: Leaving directory '/home/opc/ruby/build/master' I, [2024-05-12T14:24:40.143628 #3956611] INFO -- : make[1]: Leaving directory '/home/opc/ruby/build/master' I, [2024-05-12T14:24:40.147943 #3956611] INFO -- : make[1]: Entering directory '/home/opc/ruby/build/master' I, [2024-05-12T14:24:40.147991 #3956611] INFO -- : make[1]: Nothing to be done for 'note'. I, [2024-05-12T14:24:40.148004 #3956611] INFO -- : make[1]: Leaving directory '/home/opc/ruby/build/master' I, [2024-05-12T14:24:40.258363 #3956611] INFO -- : Run options: I, [2024-05-12T14:24:40.258440 #3956611] INFO -- : --seed=63180 I, [2024-05-12T14:24:40.258450 #3956611] INFO -- : "--ruby=./miniruby -I/home/opc/ruby/src/master/lib -I. -I.ext/common /home/opc/ruby/src/master/tool/runruby.rb --extout=.ext -- --disable-gems" I, [2024-05-12T14:24:40.258459 #3956611] INFO -- : --excludes-dir=/home/opc/ruby/src/master/test/.excludes I, [2024-05-12T14:24:40.258468 #3956611] INFO -- : --name=!/memory_leak/ I, [2024-05-12T14:24:40.258476 #3956611] INFO -- : --stderr-on-failure I, [2024-05-12T14:24:40.258484 #3956611] INFO -- : -j3 I, [2024-05-12T14:24:40.258492 #3956611] INFO -- : I, [2024-05-12T14:24:40.258500 #3956611] INFO -- : # Running tests: I, [2024-05-12T14:24:40.258508 #3956611] INFO -- : I, [2024-05-12T14:24:40.387838 #3956611] INFO -- : [ 1/885] 3997503=test_gem_commands_yank_command I, [2024-05-12T14:24:40.391767 #3956611] INFO -- : [ 2/885] 3997501=test_yaml_tree I, [2024-05-12T14:24:40.418542 #3956611] INFO -- : [ 3/885] 3997502=test_cstr I, [2024-05-12T14:24:40.475399 #3956611] INFO -- : [ 4/885] 3997501=test_gem_resolver_dependency_request I, [2024-05-12T14:24:40.595797 #3956611] INFO -- : [ 5/885] 3997502=test_command I, [2024-05-12T14:24:40.622274 #3956611] INFO -- : [ 6/885] 3997501=test_euc_tw I, [2024-05-12T14:24:40.625521 #3956611] INFO -- : [ 7/885] 3997501=test_big2str I, [2024-05-12T14:24:40.629608 #3956611] INFO -- : [ 8/885] 3997501=test_gem_resolver_specification I, [2024-05-12T14:24:40.675589 #3956611] INFO -- : [ 9/885] 3997501=test_logger I, [2024-05-12T14:24:40.722239 #3956611] INFO -- : [ 10/885] 3997501=test_pkey_dsa I, [2024-05-12T14:24:40.883816 #3956611] INFO -- : [ 11/885] 3997502=test_wait I, [2024-05-12T14:24:40.942490 #3956611] INFO -- : [ 12/885] 3997502=test_import I, [2024-05-12T14:24:41.068209 #3956611] INFO -- : [ 13/885] 3997503=test_human_typo I, [2024-05-12T14:24:41.080151 #3956611] INFO -- : [ 14/885] 3997503=test_psych I, [2024-05-12T14:24:41.139993 #3956611] INFO -- : [ 15/885] 3997503=test_nil I, [2024-05-12T14:24:41.145866 #3956611] INFO -- : [ 16/885] 3997503=test_io_buffer I, [2024-05-12T14:24:41.184940 #3956611] INFO -- : [ 17/885] 3997503=test_ldap I, [2024-05-12T14:24:41.203813 #3956611] INFO -- : [ 18/885] 3997503=test_kdf I, [2024-05-12T14:24:41.269581 #3956611] INFO -- : [ 19/885] 3997502=test_thread_queue I, [2024-05-12T14:24:41.274351 #3956611] INFO -- : [ 20/885] 3997503=test_nowrite I, [2024-05-12T14:24:41.300351 #3956611] INFO -- : [ 21/885] 3997503=test_passing_block I, [2024-05-12T14:24:41.308784 #3956611] INFO -- : [ 22/885] 3997503=test_defined I, [2024-05-12T14:24:41.384834 #3956611] INFO -- : [ 23/885] 3997503=json_string_matching_test I, [2024-05-12T14:24:41.395562 #3956611] INFO -- : [ 24/885] 3997503=test_gem_config_file I, [2024-05-12T14:24:41.550781 #3956611] INFO -- : [ 25/885] 3997503=test_comparable I, [2024-05-12T14:24:41.702672 #3956611] INFO -- : [ 26/885] 3997503=test_rdoc_rdoc I, [2024-05-12T14:24:41.796903 #3956611] INFO -- : [ 27/885] 3997503=test_yjit_exit_locations I, [2024-05-12T14:24:41.859903 #3956611] INFO -- : [ 28/885] 3997503=test_rdoc_markdown_test I, [2024-05-12T14:24:42.744233 #3956611] INFO -- : [ 29/885] 3997503=test_rdoc_normal_module I, [2024-05-12T14:24:42.790427 #3956611] INFO -- : [ 30/885] 3997503=test_type_completor I, [2024-05-12T14:24:42.795149 #3956611] INFO -- : [ 31/885] 3997503=test_io_timeout I, [2024-05-12T14:24:42.800851 #3956611] INFO -- : [ 32/885] 3997503=test_erb_m17n I, [2024-05-12T14:24:42.807535 #3956611] INFO -- : [ 33/885] 3997503=test_rdoc_generator_pot_po_entry I, [2024-05-12T14:24:42.822264 #3956611] INFO -- : [ 34/885] 3997503=test_timeout I, [2024-05-12T14:24:42.831283 #3956611] INFO -- : [ 35/885] 3997503=test_webauthn_poller I, [2024-05-12T14:24:42.976062 #3956611] INFO -- : [ 36/885] 3997503=test_rdoc_markup_verbatim I, [2024-05-12T14:24:42.983341 #3956611] INFO -- : [ 37/885] 3997503=test_date_conv I, [2024-05-12T14:24:42.987950 #3956611] INFO -- : [ 38/885] 3997503=test_serialize_subclasses I, [2024-05-12T14:24:42.999300 #3956611] INFO -- : [ 39/885] 3997503=test_gem_resolver_index_specification I, [2024-05-12T14:24:43.061755 #3956611] INFO -- : [ 40/885] 3997503=test_frozen I, [2024-05-12T14:24:43.136134 #3956611] INFO -- : [ 41/885] 3997503=test_egrep_cpp I, [2024-05-12T14:24:43.180621 #3956611] INFO -- : [ 42/885] 3997503=test_tree_builder I, [2024-05-12T14:24:43.184649 #3956611] INFO -- : [ 43/885] 3997503=test_protect I, [2024-05-12T14:24:43.189494 #3956611] INFO -- : [ 44/885] 3997503=test_big5 I, [2024-05-12T14:24:43.194920 #3956611] INFO -- : [ 45/885] 3997503=test_date I, [2024-05-12T14:24:43.274719 #3956611] INFO -- : [ 46/885] 3997503=test_gem_commands_update_command I, [2024-05-12T14:24:43.978380 #3956611] INFO -- : [ 47/885] 3997501=test_pathname I, [2024-05-12T14:24:44.210089 #3956611] INFO -- : [ 48/885] 3997501=test_fnmatch I, [2024-05-12T14:24:44.260708 #3956611] INFO -- : [ 49/885] 3997501=test_store I, [2024-05-12T14:24:44.531592 #3956611] INFO -- : [ 50/885] 3997503=test_rdoc_markup_pre_process I, [2024-05-12T14:24:44.538196 #3956611] INFO -- : [ 51/885] 3997501=test_tempfile I, [2024-05-12T14:24:44.644735 #3956611] INFO -- : [ 52/885] 3997503=test_http_request I, [2024-05-12T14:24:44.647802 #3956611] INFO -- : [ 53/885] 3997503=test_coverage I, [2024-05-12T14:24:44.723965 #3956611] INFO -- : [ 54/885] 3997501=test_string I, [2024-05-12T14:24:44.738560 #3956611] INFO -- : [ 55/885] 3997501=json_common_interface_test I, [2024-05-12T14:24:44.763430 #3956611] INFO -- : [ 56/885] 3997501=test_rdoc_any_method I, [2024-05-12T14:24:45.220610 #3956611] INFO -- : [ 57/885] 3997503=test_error_highlight I, [2024-05-12T14:24:45.279620 #3956611] INFO -- : [ 58/885] 3997501=test_function_entry I, [2024-05-12T14:24:45.285754 #3956611] INFO -- : [ 59/885] 3997501=test_complexrational I, [2024-05-12T14:24:45.289378 #3956611] INFO -- : [ 60/885] 3997501=test_raise I, [2024-05-12T14:24:45.292696 #3956611] INFO -- : [ 61/885] 3997501=version_test I, [2024-05-12T14:24:45.358433 #3956611] INFO -- : [ 62/885] 3997501=test_files_lib I, [2024-05-12T14:24:45.715962 #3956611] INFO -- : [ 63/885] 3997503=test_string_memory I, [2024-05-12T14:24:45.769724 #3956611] INFO -- : [ 64/885] 3997503=test_help I, [2024-05-12T14:24:45.774431 #3956611] INFO -- : [ 65/885] 3997503=test_enumerator_kw I, [2024-05-12T14:24:45.819336 #3956611] INFO -- : [ 66/885] 3997503=test_line_editor I, [2024-05-12T14:24:45.831940 #3956611] INFO -- : [ 67/885] 3997503=test_marshalable I, [2024-05-12T14:24:45.834301 #3956611] INFO -- : [ 68/885] 3997503=reflection_test I, [2024-05-12T14:24:45.893666 #3956611] INFO -- : [ 69/885] 3997503=test_hmac I, [2024-05-12T14:24:45.901079 #3956611] INFO -- : [ 70/885] 3997503=test_encoding I, [2024-05-12T14:24:46.111176 #3956611] INFO -- : [ 71/885] 3997503=test_rdoc_generator_markup I, [2024-05-12T14:24:46.293840 #3956611] INFO -- : [ 72/885] 3997503=test_constant I, [2024-05-12T14:24:46.994490 #3956611] INFO -- : [ 73/885] 3997502=test_find I, [2024-05-12T14:24:47.014590 #3956611] INFO -- : [ 74/885] 3997502=test_rat I, [2024-05-12T14:24:47.025102 #3956611] INFO -- : [ 75/885] 3997502=test_init I, [2024-05-12T14:24:47.372395 #3956611] INFO -- : [ 76/885] 3997502=test_gem_request_connection_pools I, [2024-05-12T14:24:47.965480 #3956611] INFO -- : [ 77/885] 3997503=test_flags I, [2024-05-12T14:24:48.089309 #3956611] INFO -- : [ 78/885] 3997501=test_numeric I, [2024-05-12T14:24:48.141777 #3956611] INFO -- : [ 79/885] 3997501=test_yamlstore I, [2024-05-12T14:24:48.167592 #3956611] INFO -- : [ 80/885] 3997501=test_bug-3571 I, [2024-05-12T14:24:48.178135 #3956611] INFO -- : [ 81/885] 3997501=test_time I, [2024-05-12T14:24:48.293337 #3956611] INFO -- : [ 82/885] 3997501=test_file I, [2024-05-12T14:24:48.298960 #3956611] INFO -- : [ 83/885] 3997501=test_capacity I, [2024-05-12T14:24:48.315608 #3956611] INFO -- : [ 84/885] 3997501=test_nextafter I, [2024-05-12T14:24:48.506081 #3956611] INFO -- : [ 85/885] 3997501=test_gem_commands_owner_command I, [2024-05-12T14:24:48.519567 #3956611] INFO -- : [ 86/885] 3997503=test_win32ole_method_event I, [2024-05-12T14:24:48.523304 #3956611] INFO -- : [ 87/885] 3997503=test_tcp I, [2024-05-12T14:24:48.565504 #3956611] INFO -- : [ 88/885] 3997502=parse_comments_test I, [2024-05-12T14:24:48.600011 #3956611] INFO -- : [ 89/885] 3997503=test_rdoc_markup_to_table_of_contents I, [2024-05-12T14:24:48.603019 #3956611] INFO -- : [ 90/885] 3997502=test_gem_name_tuple I, [2024-05-12T14:24:48.620957 #3956611] INFO -- : [ 91/885] 3997502=test_integer I, [2024-05-12T14:24:48.640012 #3956611] INFO -- : [ 92/885] 3997503=test_gem_requirement I, [2024-05-12T14:24:48.674967 #3956611] INFO -- : [ 93/885] 3997502=test_string I, [2024-05-12T14:24:48.788941 #3956611] INFO -- : [ 94/885] 3997503=test_macro I, [2024-05-12T14:24:48.797121 #3956611] INFO -- : [ 95/885] 3997503=test_pipe I, [2024-05-12T14:24:48.914308 #3956611] INFO -- : [ 96/885] 3997503=test_gem_resolver_activation_request I, [2024-05-12T14:24:48.928833 #3956611] INFO -- : [ 97/885] 3997503=test_function I, [2024-05-12T14:24:49.048266 #3956611] INFO -- : [ 98/885] 3997501=test_gem_commands_server_command I, [2024-05-12T14:24:49.060472 #3956611] INFO -- : [ 99/885] 3997501=test_gem_package_tar_reader_entry I, [2024-05-12T14:24:49.166582 #3956611] INFO -- : [100/885] 3997503=test_resource I, [2024-05-12T14:24:49.175918 #3956611] INFO -- : [101/885] 3997503=test_gem_uri I, [2024-05-12T14:24:49.220187 #3956611] INFO -- : [102/885] 3997503=test_bug-5832 I, [2024-05-12T14:24:49.227571 #3956611] INFO -- : [103/885] 3997503=test_yield_block I, [2024-05-12T14:24:49.231838 #3956611] INFO -- : [104/885] 3997503=test_c_struct_builder I, [2024-05-12T14:24:49.249099 #3956611] INFO -- : [105/885] 3997501=test_path_to_class I, [2024-05-12T14:24:49.255142 #3956611] INFO -- : [106/885] 3997501=test_enumerator I, [2024-05-12T14:24:49.261750 #3956611] INFO -- : [107/885] 3997501=test_reqarg I, [2024-05-12T14:24:49.395875 #3956611] INFO -- : [108/885] 3997503=test_frozen_error I, [2024-05-12T14:24:49.429334 #3956611] INFO -- : [109/885] 3997503=test_gem_ext_ext_conf_builder I, [2024-05-12T14:24:49.639887 #3956611] INFO -- : [110/885] 3997501=test_gem_version I, [2024-05-12T14:24:49.742459 #3956611] INFO -- : [111/885] 3997501=test_spell_checker I, [2024-05-12T14:24:49.799353 #3956611] INFO -- : [112/885] 3997501=test_gem_ext_cargo_builder I, [2024-05-12T14:24:49.801101 #3956611] INFO -- : [113/885] 3997501=test_console_attr I, [2024-05-12T14:24:49.824427 #3956611] INFO -- : [114/885] 3997501=test_proc I, [2024-05-12T14:24:50.504245 #3956611] INFO -- : [115/885] 3997503=test_gem_commands_unpack_command I, [2024-05-12T14:24:50.742143 #3956611] INFO -- : [116/885] 3997501=test_zlib I, [2024-05-12T14:24:50.839240 #3956611] INFO -- : [117/885] 3997503=test_rdoc_options I, [2024-05-12T14:24:51.111717 #3956611] INFO -- : [118/885] 3997503=test_ubf_async_safe I, [2024-05-12T14:24:51.120144 #3956611] INFO -- : [119/885] 3997503=test_pstore I, [2024-05-12T14:24:51.354137 #3956611] INFO -- : [120/885] 3997503=test_rdoc_include I, [2024-05-12T14:24:51.383913 #3956611] INFO -- : [121/885] 3997503=test_win32ole_record I, [2024-05-12T14:24:51.396343 #3956611] INFO -- : [122/885] 3997503=test_gem_version_option I, [2024-05-12T14:24:51.455912 #3956611] INFO -- : [123/885] 3997503=test_date_compat I, [2024-05-12T14:24:51.461474 #3956611] INFO -- : [124/885] 3997503=test_httpresponses I, [2024-05-12T14:24:51.471237 #3956611] INFO -- : [125/885] 3997503=test_deprecate I, [2024-05-12T14:24:51.523211 #3956611] INFO -- : [126/885] 3997503=test_rdoc_constant I, [2024-05-12T14:24:51.612861 #3956611] INFO -- : [127/885] 3997503=test_generic I, [2024-05-12T14:24:51.637796 #3956611] INFO -- : [128/885] 3997503=test_common I, [2024-05-12T14:24:51.824763 #3956611] INFO -- : [129/885] 3997503=test_rdoc_markup_to_html_snippet I, [2024-05-12T14:24:51.902378 #3956611] INFO -- : [130/885] 3997503=test_rdoc_encoding I, [2024-05-12T14:24:51.936262 #3956611] INFO -- : [131/885] 3997503=test_win32ole_variant_outarg I, [2024-05-12T14:24:51.948667 #3956611] INFO -- : [132/885] 3997503=test_key_actor_vi I, [2024-05-12T14:24:52.097050 #3956611] INFO -- : [133/885] 3997503=test_postponed_job I, [2024-05-12T14:24:52.398442 #3956611] INFO -- : [134/885] 3997503=test_gem_request_set_lockfile I, [2024-05-12T14:24:53.030431 #3956611] INFO -- : [135/885] 3997503=test_rdoc_markdown I, [2024-05-12T14:24:53.267644 #3956611] INFO -- : [136/885] 3997503=test_rdoc_markup_indented_paragraph I, [2024-05-12T14:24:53.282248 #3956611] INFO -- : [137/885] 3997503=test_rdoc_markup_parser I, [2024-05-12T14:24:53.354764 #3956611] INFO -- : [138/885] 3997503=test_iseq_load I, [2024-05-12T14:24:54.490138 #3956611] INFO -- : [139/885] 3997503=test_stream I, [2024-05-12T14:24:54.710751 #3956611] INFO -- : [140/885] 3997503=test_have_library I, [2024-05-12T14:24:54.819925 #3956611] INFO -- : [141/885] 3997501=test_ns_spki I, [2024-05-12T14:24:54.821879 #3956611] INFO -- : [142/885] 3997501=test_require I, [2024-05-12T14:24:54.830657 #3956611] INFO -- : [143/885] 3997501=test_stringify_symbols I, [2024-05-12T14:24:54.903856 #3956611] INFO -- : [144/885] 3997501=test_objspace I, [2024-05-12T14:24:55.353237 #3956611] INFO -- : [145/885] 3997503=test_rdoc_text I, [2024-05-12T14:24:55.397840 #3956611] INFO -- : [146/885] 3997503=library_symbols_test I, [2024-05-12T14:24:55.404883 #3956611] INFO -- : [147/885] 3997503=test_tsort I, [2024-05-12T14:24:55.429695 #3956611] INFO -- : [148/885] 3997503=test_gem_commands_fetch_command I, [2024-05-12T14:24:55.836307 #3956611] INFO -- : [149/885] 3997503=test_typeddata I, [2024-05-12T14:24:55.846775 #3956611] INFO -- : [150/885] 3997503=test_securerandom I, [2024-05-12T14:24:55.899882 #3956611] INFO -- : [151/885] 3997503=test_gem_commands_outdated_command I, [2024-05-12T14:24:55.951067 #3956611] INFO -- : [152/885] 3997503=test_gem_dependency_list I, [2024-05-12T14:24:56.038033 #3956611] INFO -- : [153/885] 3997503=parameters_signature_test I, [2024-05-12T14:24:56.045987 #3956611] INFO -- : [154/885] 3997503=test_rdoc_parser_changelog I, [2024-05-12T14:24:56.127667 #3956611] INFO -- : [155/885] 3997503=test_gem_doctor I, [2024-05-12T14:24:56.182096 #3956611] INFO -- : [156/885] 3997503=json_fixtures_test I, [2024-05-12T14:24:56.189918 #3956611] INFO -- : [157/885] 3997503=test_len I, [2024-05-12T14:24:56.194444 #3956611] INFO -- : [158/885] 3997503=test_kwargs I, [2024-05-12T14:24:56.208179 #3956611] INFO -- : [159/885] 3997503=test_rdoc_parser_c I, [2024-05-12T14:24:56.468284 #3956611] INFO -- : [160/885] 3997503=test_pack I, [2024-05-12T14:24:56.707465 #3956611] INFO -- : [161/885] 3997503=test_io_wait I, [2024-05-12T14:24:57.111697 #3956611] INFO -- : [162/885] 3997503=parse_test I, [2024-05-12T14:24:59.013036 #3956611] INFO -- : [163/885] 3997502=test_rdoc_code_object I, [2024-05-12T14:24:59.376662 #3956611] INFO -- : [164/885] 3997502=test_process I, [2024-05-12T14:24:59.741405 #3956611] INFO -- : Leaked file descriptor: TestProcess#test_uid_from_name: 7 # I, [2024-05-12T14:24:59.741475 #3956611] INFO -- : Leaked file descriptor: TestProcess#test_uid_from_name: 8 # I, [2024-05-12T14:24:59.777040 #3956611] INFO -- : COMMAND PID USER FD TYPE DEVICE SIZE/OFF NODE NAME I, [2024-05-12T14:24:59.777115 #3956611] INFO -- : ruby 3997502 opc 7r REG 252,0 9253600 13705411 /var/lib/sss/mc/passwd I, [2024-05-12T14:24:59.777126 #3956611] INFO -- : ruby 3997502 opc 8u unix 0x0000000000000000 0t0 2950365897 type=STREAM I, [2024-05-12T14:25:00.023533 #3956611] INFO -- : [165/885] 3997503=test_bmethod I, [2024-05-12T14:25:00.041458 #3956611] INFO -- : [166/885] 3997503=test_gem_source_specific_file I, [2024-05-12T14:25:00.124859 #3956611] INFO -- : [167/885] 3997503=test_provider I, [2024-05-12T14:25:00.132000 #3956611] INFO -- : [168/885] 3997503=test_euc_kr I, [2024-05-12T14:25:00.138175 #3956611] INFO -- : [169/885] 3997503=redundant_return_test I, [2024-05-12T14:25:00.181417 #3956611] INFO -- : [170/885] 3997503=test_rand I, [2024-05-12T14:25:00.479247 #3956611] INFO -- : [171/885] 3997503=test_random_formatter I, [2024-05-12T14:25:00.487632 #3956611] INFO -- : [172/885] 3997503=test_string_processing I, [2024-05-12T14:25:00.496184 #3956611] INFO -- : [173/885] 3997503=test_rdoc_markup_attributes I, [2024-05-12T14:25:00.501602 #3956611] INFO -- : [174/885] 3997503=test_win32ole_typelib I, [2024-05-12T14:25:00.511274 #3956611] INFO -- : [175/885] 3997503=test_pkey I, [2024-05-12T14:25:00.522230 #3956611] INFO -- : [176/885] 3997503=test_external_new I, [2024-05-12T14:25:00.535403 #3956611] INFO -- : [177/885] 3997503=test_bigzero I, [2024-05-12T14:25:00.557015 #3956611] INFO -- : [178/885] 3997503=test_gem_commands_query_command I, [2024-05-12T14:25:01.240227 #3956611] INFO -- : [179/885] 3997503=test_gem_platform I, [2024-05-12T14:25:01.375543 #3956611] INFO -- : [180/885] 3997503=test_null I, [2024-05-12T14:25:01.435936 #3956611] INFO -- : [181/885] 3997503=test_ractor I, [2024-05-12T14:25:01.446470 #3956611] INFO -- : [182/885] 3997503=test_data I, [2024-05-12T14:25:01.456936 #3956611] INFO -- : [183/885] 3997503=test_memory_view I, [2024-05-12T14:25:01.476230 #3956611] INFO -- : [184/885] 3997503=test_multi_irb_commands I, [2024-05-12T14:25:01.492195 #3956611] INFO -- : [185/885] 3997503=test_pkey_dh I, [2024-05-12T14:25:02.812030 #3956611] INFO -- : [186/885] 3997503=test_m17n_comb I, [2024-05-12T14:25:05.130474 #3956611] INFO -- : [187/885] 3997503=test_input_method I, [2024-05-12T14:25:05.231681 #3956611] INFO -- : [188/885] 3997503=test_io I, [2024-05-12T14:25:05.434613 #3956611] INFO -- : [189/885] 3997503=test_rdoc_i18n_text I, [2024-05-12T14:25:05.444680 #3956611] INFO -- : [190/885] 3997503=test_gem_unsatisfiable_dependency_error I, [2024-05-12T14:25:05.499184 #3956611] INFO -- : [191/885] 3997503=test_literal I, [2024-05-12T14:25:06.036361 #3956611] INFO -- : [192/885] 3997503=test_thread I, [2024-05-12T14:25:06.263201 #3956611] INFO -- : [193/885] 3997503=test_gem_security_signer I, [2024-05-12T14:25:06.385062 #3956611] INFO -- : [194/885] 3997503=test_config I, [2024-05-12T14:25:06.431769 #3956611] INFO -- : [195/885] 3997503=test_complex2 I, [2024-05-12T14:25:06.463422 #3956611] INFO -- : [196/885] 3997503=test_gem_util I, [2024-05-12T14:25:06.628189 #3956611] INFO -- : [197/885] 3997503=test_class_name_check I, [2024-05-12T14:25:06.653986 #3956611] INFO -- : [198/885] 3997503=test_scalar I, [2024-05-12T14:25:06.681375 #3956611] INFO -- : [199/885] 3997503=test_syntax I, [2024-05-12T14:25:07.406898 #3956611] INFO -- : .Leaked file descriptor: TestProcess#test_gid_from_name: 9 # I, [2024-05-12T14:25:07.433288 #3956611] INFO -- : COMMAND PID USER FD TYPE DEVICE SIZE/OFF NODE NAME I, [2024-05-12T14:25:07.433363 #3956611] INFO -- : ruby 3997502 opc 9r REG 252,0 6940392 13705429 /var/lib/sss/mc/group I, [2024-05-12T14:25:12.205843 #3956611] INFO -- : [200/885] 3997501=test_zsh_completion I, [2024-05-12T14:25:12.213759 #3956611] INFO -- : [201/885] 3997501=test_basicsocket I, [2024-05-12T14:25:12.229738 #3956611] INFO -- : [202/885] 3997501=test_gem_commands_environment_command I, [2024-05-12T14:25:12.304466 #3956611] INFO -- : [203/885] 3997501=test_pkcs7 I, [2024-05-12T14:25:12.453613 #3956611] INFO -- : [204/885] 3997501=test_pack I, [2024-05-12T14:25:12.622494 #3956611] INFO -- : [205/885] 3997501=test_rdoc_context_section I, [2024-05-12T14:25:12.633582 #3956611] INFO -- : [206/885] 3997501=test_io_buffer I, [2024-05-12T14:25:12.745545 #3956611] INFO -- : [207/885] 3997501=test_deprecated I, [2024-05-12T14:25:12.745990 #3956611] INFO -- : [208/885] 3997501=test_optparse I, [2024-05-12T14:25:12.754846 #3956611] INFO -- : [209/885] 3997501=test_bash_completion I, [2024-05-12T14:25:12.766983 #3956611] INFO -- : [210/885] 3997501=test_exception I, [2024-05-12T14:25:13.774798 #3956611] INFO -- : [211/885] 3997503=test_rdoc_markup_to_html_crossref I, [2024-05-12T14:25:14.142138 #3956611] INFO -- : [212/885] 3997503=test_files_test_2 I, [2024-05-12T14:25:14.747765 #3956611] INFO -- : [213/885] 3997501=test_div I, [2024-05-12T14:25:14.773829 #3956611] INFO -- : [214/885] 3997501=test_singleton I, [2024-05-12T14:25:14.779468 #3956611] INFO -- : [215/885] 3997501=test_fstring I, [2024-05-12T14:25:14.885304 #3956611] INFO -- : [216/885] 3997501=test_numeric I, [2024-05-12T14:25:14.976169 #3956611] INFO -- : [217/885] 3997501=test_gem_ext_rake_builder I, [2024-05-12T14:25:15.499850 #3956611] INFO -- : [218/885] 3997501=test_rdoc_require I, [2024-05-12T14:25:15.504926 #3956611] INFO -- : [219/885] 3997501=test_word I, [2024-05-12T14:25:15.510221 #3956611] INFO -- : [220/885] 3997501=test_timeout I, [2024-05-12T14:25:16.322252 #3956611] INFO -- : [221/885] 3997501=test_key_name_check I, [2024-05-12T14:25:16.331636 #3956611] INFO -- : [222/885] 3997501=test_rdoc_markup_to_bs I, [2024-05-12T14:25:16.376445 #3956611] INFO -- : [223/885] 3997501=test_rdoc_markup_raw I, [2024-05-12T14:25:16.384713 #3956611] INFO -- : [224/885] 3997501=test_weakref I, [2024-05-12T14:25:16.822369 #3956611] INFO -- : [225/885] 3997501=test_instrumentation_api I, [2024-05-12T14:25:16.836797 #3956611] INFO -- : [226/885] 3997503=test_rdoc_alias I, [2024-05-12T14:25:16.854538 #3956611] INFO -- : [227/885] 3997503=test_gem_commands_stale_command I, [2024-05-12T14:25:16.860666 #3956611] INFO -- : [228/885] 3997503=ruby_parser_test I, [2024-05-12T14:25:16.902536 #3956611] INFO -- : [229/885] 3997503=test_rdoc_markup_to_tt_only I, [2024-05-12T14:25:16.933150 #3956611] INFO -- : [230/885] 3997503=test_ws I, [2024-05-12T14:25:16.975802 #3956611] INFO -- : [231/885] 3997503=test_date_strftime I, [2024-05-12T14:25:17.376611 #3956611] INFO -- : [232/885] 3997503=json_parser_test I, [2024-05-12T14:25:17.402991 #3956611] INFO -- : [233/885] 3997503=test_gem_commands_cert_command I, [2024-05-12T14:25:18.162545 #3956611] INFO -- : [234/885] 3997502=test_gem_uri_formatter I, [2024-05-12T14:25:18.180261 #3956611] INFO -- : [235/885] 3997502=test_prettyprint I, [2024-05-12T14:25:18.193732 #3956611] INFO -- : [236/885] 3997502=test_ole_methods I, [2024-05-12T14:25:18.213469 #3956611] INFO -- : [237/885] 3997502=test_cgi_util I, [2024-05-12T14:25:18.444197 #3956611] INFO -- : [238/885] 3997502=test_clone I, [2024-05-12T14:25:18.600659 #3956611] INFO -- : [239/885] 3997502=test_enc_raise I, [2024-05-12T14:25:18.610689 #3956611] INFO -- : [240/885] 3997502=test_queue I, [2024-05-12T14:25:18.630927 #3956611] INFO -- : [241/885] 3997502=test_gem_resolver_lock_specification I, [2024-05-12T14:25:18.699117 #3956611] INFO -- : [242/885] 3997502=test_boolean I, [2024-05-12T14:25:18.770983 #3956611] INFO -- : [243/885] 3997502=test_gc_compact I, [2024-05-12T14:25:19.504278 #3956611] INFO -- : [244/885] 3997503=test_rdoc_i18n_locale I, [2024-05-12T14:25:19.513563 #3956611] INFO -- : [245/885] 3997503=test_dryrun I, [2024-05-12T14:25:19.516425 #3956611] INFO -- : [246/885] 3997501=regexp_test I, [2024-05-12T14:25:19.531668 #3956611] INFO -- : [247/885] 3997503=test_yield I, [2024-05-12T14:25:19.544983 #3956611] INFO -- : [248/885] 3997501=test_remote_fetch_error I, [2024-05-12T14:25:19.653582 #3956611] INFO -- : [249/885] 3997501=test_show_source I, [2024-05-12T14:25:19.681124 #3956611] INFO -- : [250/885] 3997501=test_files_sample I, [2024-05-12T14:25:19.688259 #3956611] INFO -- : [251/885] 3997501=test_rdoc_stats I, [2024-05-12T14:25:19.795300 #3956611] INFO -- : [252/885] 3997501=test_data_error I, [2024-05-12T14:25:19.838839 #3956611] INFO -- : [253/885] 3997501=test_rubyoptions I, [2024-05-12T14:25:21.177350 #3956611] INFO -- : [254/885] 3997502=test_optimization I, [2024-05-12T14:25:22.625746 #3956611] INFO -- : [255/885] 3997503=test_force_exit I, [2024-05-12T14:25:22.633061 #3956611] INFO -- : [256/885] 3997503=test_shift_jis I, [2024-05-12T14:25:22.650843 #3956611] INFO -- : [257/885] 3997503=test_rdoc_store I, [2024-05-12T14:25:23.282824 #3956611] INFO -- : [258/885] 3997503=test_key_event_record I, [2024-05-12T14:25:23.289518 #3956611] INFO -- : [259/885] 3997503=test_mdns I, [2024-05-12T14:25:23.326314 #3956611] INFO -- : [260/885] 3997503=test_open3 I, [2024-05-12T14:25:25.766895 #3956611] INFO -- : [261/885] 3997503=test_date_parse I, [2024-05-12T14:25:25.905997 #3956611] INFO -- : [262/885] 3997503=test_arity I, [2024-05-12T14:25:25.932650 #3956611] INFO -- : [263/885] 3997503=test_thread I, [2024-05-12T14:25:25.945094 #3956611] INFO -- : [264/885] 3997503=test_pkey_ec I, [2024-05-12T14:25:25.970342 #3956611] INFO -- : [265/885] 3997503=test_svcb_https I, [2024-05-12T14:25:25.982636 #3956611] INFO -- : [266/885] 3997503=test_buffering I, [2024-05-12T14:25:25.996250 #3956611] INFO -- : [267/885] 3997503=test_rational I, [2024-05-12T14:25:26.013322 #3956611] INFO -- : [268/885] 3997503=test_case_mapping I, [2024-05-12T14:25:26.036419 #3956611] INFO -- : [269/885] 3997503=test_gem_ext_cargo_builder_unit I, [2024-05-12T14:25:26.076115 #3956611] INFO -- : [270/885] 3997503=test_ractor I, [2024-05-12T14:25:26.086320 #3956611] INFO -- : [271/885] 3997503=test_gem_resolver_api_specification I, [2024-05-12T14:25:26.142072 #3956611] INFO -- : [272/885] 3997503=test_rdoc_rubygems_hook I, [2024-05-12T14:25:26.224975 #3956611] INFO -- : [273/885] 3997503=test_webauthn_listener I, [2024-05-12T14:25:26.313098 #3956611] INFO -- : Leaked file descriptor: WebauthnListenerTest#test_wait_for_otp_code_get_follows_options: 11 : # I, [2024-05-12T14:25:26.347823 #3956611] INFO -- : COMMAND PID USER FD TYPE DEVICE SIZE/OFF NODE NAME I, [2024-05-12T14:25:26.347891 #3956611] INFO -- : ruby 3997503 opc 11u IPv4 2950374660 0t0 TCP localhost:36443->localhost:37100 (CLOSE_WAIT) I, [2024-05-12T14:25:26.395990 #3956611] INFO -- : Closed file descriptor: WebauthnListenerTest#test_wait_for_otp_code_options_request: 11 I, [2024-05-12T14:25:26.404070 #3956611] INFO -- : [274/885] 3997503=test_enumerable I, [2024-05-12T14:25:26.419071 #3956611] INFO -- : [275/885] 3997503=test_rdoc_method_attr I, [2024-05-12T14:25:26.510038 #3956611] INFO -- : [276/885] 3997501=test_set I, [2024-05-12T14:25:26.519660 #3956611] INFO -- : [277/885] 3997503=test_tree_spell_checker I, [2024-05-12T14:25:26.541503 #3956611] INFO -- : [278/885] 3997503=static_literals_test I, [2024-05-12T14:25:26.549241 #3956611] INFO -- : [279/885] 3997501=test_grapheme_breaks I, [2024-05-12T14:25:26.551864 #3956611] INFO -- : [280/885] 3997503=test_hash_create I, [2024-05-12T14:25:26.559190 #3956611] INFO -- : [281/885] 3997503=test_yamldbm I, [2024-05-12T14:25:26.561151 #3956611] INFO -- : [282/885] 3997503=test_gem_spec_fetcher I, [2024-05-12T14:25:26.582850 #3956611] INFO -- : [283/885] 3997501=test_unicode_escape I, [2024-05-12T14:25:26.681923 #3956611] INFO -- : [284/885] 3997501=test_default_gems I, [2024-05-12T14:25:26.732851 #3956611] INFO -- : [285/885] 3997501=test_switch_hitter I, [2024-05-12T14:25:26.746775 #3956611] INFO -- : [286/885] 3997501=test_backtrace I, [2024-05-12T14:25:26.752072 #3956611] INFO -- : [287/885] 3997501=test_gbk I, [2024-05-12T14:25:26.753675 #3956611] INFO -- : [288/885] 3997501=test_gem_commands_dependency_command I, [2024-05-12T14:25:26.775951 #3956611] INFO -- : [289/885] 3997503=test_string I, [2024-05-12T14:25:26.781265 #3956611] INFO -- : [290/885] 3997503=test_iterator I, [2024-05-12T14:25:26.861407 #3956611] INFO -- : [291/885] 3997501=test_gem_commands_install_command I, [2024-05-12T14:25:26.873047 #3956611] INFO -- : [292/885] 3997503=test_rendering I, [2024-05-12T14:25:26.890580 #3956611] INFO -- : [293/885] 3997503=test_kernel I, [2024-05-12T14:25:27.519007 #3956611] INFO -- : [294/885] 3997503=pattern_test I, [2024-05-12T14:25:27.530889 #3956611] INFO -- : [295/885] 3997503=test_dot_dot I, [2024-05-12T14:25:27.542706 #3956611] INFO -- : [296/885] 3997503=test_gem_rdoc I, [2024-05-12T14:25:27.712557 #3956611] INFO -- : [297/885] 3997503=test_did_you_mean I, [2024-05-12T14:25:27.832735 #3956611] INFO -- : [298/885] 3997503=test_shapes I, [2024-05-12T14:25:27.842189 #3956611] INFO -- : [299/885] 3997503=test_cesu8 I, [2024-05-12T14:25:27.859737 #3956611] INFO -- : [300/885] 3997503=test_rdoc_extend I, [2024-05-12T14:25:27.872984 #3956611] INFO -- : [301/885] 3997503=test_storage I, [2024-05-12T14:25:27.891175 #3956611] INFO -- : [302/885] 3997503=test_method_name_check I, [2024-05-12T14:25:27.950291 #3956611] INFO -- : [303/885] 3997503=test_err_in_callback I, [2024-05-12T14:25:27.956312 #3956611] INFO -- : [304/885] 3997503=test_merge_keys I, [2024-05-12T14:25:27.963058 #3956611] INFO -- : [305/885] 3997503=test_array_create I, [2024-05-12T14:25:27.964351 #3956611] INFO -- : [306/885] 3997503=test_memory_view I, [2024-05-12T14:25:28.012629 #3956611] INFO -- : [307/885] 3997502=test_dir_m17n I, [2024-05-12T14:25:28.339986 #3956611] INFO -- : [308/885] 3997503=test_threadgroup I, [2024-05-12T14:25:28.694958 #3956611] INFO -- : [309/885] 3997501=test_complex I, [2024-05-12T14:25:28.775972 #3956611] INFO -- : [310/885] 3997501=!Nothing_to_test I, [2024-05-12T14:25:28.777366 #3956611] INFO -- : [311/885] 3997501=test_fd_setsize I, [2024-05-12T14:25:28.784738 #3956611] INFO -- : [312/885] 3997501=test_forwardable I, [2024-05-12T14:25:28.808940 #3956611] INFO -- : [313/885] 3997501=test_process I, [2024-05-12T14:25:28.873630 #3956611] INFO -- : [314/885] 3997501=test_gem_commands_open_command I, [2024-05-12T14:25:28.932646 #3956611] INFO -- : [315/885] 3997501=test_verbose I, [2024-05-12T14:25:28.956154 #3956611] INFO -- : [316/885] 3997501=test_emoji_breaks I, [2024-05-12T14:25:28.958108 #3956611] INFO -- : [317/885] 3997501=test_normalize I, [2024-05-12T14:25:28.958227 #3956611] INFO -- : [318/885] 3997501=test_gem_update_suggestion I, [2024-05-12T14:25:28.971513 #3956611] INFO -- : [319/885] 3997501=test_assignment I, [2024-05-12T14:25:29.217813 #3956611] INFO -- : [320/885] 3997502=test_undef I, [2024-05-12T14:25:29.227676 #3956611] INFO -- : [321/885] 3997502=test_random I, [2024-05-12T14:25:29.242956 #3956611] INFO -- : [322/885] 3997502=test_gem_resolver_lock_set I, [2024-05-12T14:25:29.320178 #3956611] INFO -- : [323/885] 3997502=test_rdoc_generator_darkfish I, [2024-05-12T14:25:29.352792 #3956611] INFO -- : [324/885] 3997503=test_gem_command I, [2024-05-12T14:25:29.501719 #3956611] INFO -- : [325/885] 3997503=test_asn1 I, [2024-05-12T14:25:29.518859 #3956611] INFO -- : [326/885] 3997503=test_gem_impossible_dependencies_error I, [2024-05-12T14:25:29.536325 #3956611] INFO -- : [327/885] 3997503=test_pp I, [2024-05-12T14:25:29.581464 #3956611] INFO -- : .Leaked file descriptor: PPTestModule::PPFileStatTest#test_nothing_raised: 10 # I, [2024-05-12T14:25:29.581537 #3956611] INFO -- : Leaked file descriptor: PPTestModule::PPFileStatTest#test_nothing_raised: 11 # I, [2024-05-12T14:25:29.605741 #3956611] INFO -- : COMMAND PID USER FD TYPE DEVICE SIZE/OFF NODE NAME I, [2024-05-12T14:25:29.605813 #3956611] INFO -- : ruby 3997503 opc 10r REG 252,0 9253600 13705411 /var/lib/sss/mc/passwd I, [2024-05-12T14:25:29.605824 #3956611] INFO -- : ruby 3997503 opc 11u unix 0x0000000000000000 0t0 2950375043 type=STREAM I, [2024-05-12T14:25:29.646653 #3956611] INFO -- : [328/885] 3997502=memsize_test I, [2024-05-12T14:25:29.654834 #3956611] INFO -- : [329/885] 3997502=test_gem_resolver_requirement_list I, [2024-05-12T14:25:29.658617 #3956611] INFO -- : [330/885] 3997502=test_noarg I, [2024-05-12T14:25:29.668183 #3956611] INFO -- : [331/885] 3997503=test_exception I, [2024-05-12T14:25:29.717317 #3956611] INFO -- : [332/885] 3997503=test_arith_seq_beg_len_step I, [2024-05-12T14:25:29.733520 #3956611] INFO -- : [333/885] 3997503=test_raise_exception I, [2024-05-12T14:25:29.871764 #3956611] INFO -- : [334/885] 3997502=test_basicinstructions I, [2024-05-12T14:25:29.938456 #3956611] INFO -- : [335/885] 3997502=test_gem_resolver_git_specification I, [2024-05-12T14:25:30.243421 #3956611] INFO -- : [336/885] 3997502=test_utf32 I, [2024-05-12T14:25:30.257009 #3956611] INFO -- : [337/885] 3997502=test_gem_security I, [2024-05-12T14:25:30.313089 #3956611] INFO -- : [338/885] 3997503=test_key_actor_emacs I, [2024-05-12T14:25:30.316912 #3956611] INFO -- : [339/885] 3997501=test_date_ractor I, [2024-05-12T14:25:30.427964 #3956611] INFO -- : [340/885] 3997503=test_erb I, [2024-05-12T14:25:30.480684 #3956611] INFO -- : [341/885] 3997503=test_variable I, [2024-05-12T14:25:30.569664 #3956611] INFO -- : [342/885] 3997501=test_hash I, [2024-05-12T14:25:30.577023 #3956611] INFO -- : [343/885] 3997501=test_rdoc_tom_doc I, [2024-05-12T14:25:30.582416 #3956611] INFO -- : [344/885] 3997503=test_optarg I, [2024-05-12T14:25:30.637832 #3956611] INFO -- : [345/885] 3997501=test_gem_commands_pristine_command I, [2024-05-12T14:25:30.652322 #3956611] INFO -- : [346/885] 3997503=test_face I, [2024-05-12T14:25:30.690482 #3956611] INFO -- : [347/885] 3997503=test_gem_request_set_lockfile_parser I, [2024-05-12T14:25:30.837651 #3956611] INFO -- : [348/885] 3997503=test_sizeof I, [2024-05-12T14:25:32.038738 #3956611] INFO -- : [349/885] 3997501=test_date_attr I, [2024-05-12T14:25:32.052914 #3956611] INFO -- : [350/885] 3997501=test_stringchar I, [2024-05-12T14:25:32.135988 #3956611] INFO -- : [351/885] 3997501=warnings_test I, [2024-05-12T14:25:32.155831 #3956611] INFO -- : [352/885] 3997501=test_econv I, [2024-05-12T14:25:33.067833 #3956611] INFO -- : [353/885] 3997501=test_gem_install_update_options I, [2024-05-12T14:25:33.187637 #3956611] INFO -- : [354/885] 3997503=test_jaro_winkler I, [2024-05-12T14:25:33.194056 #3956611] INFO -- : [355/885] 3997503=test_cp949 I, [2024-05-12T14:25:33.201762 #3956611] INFO -- : [356/885] 3997503=test_gem_resolver_vendor_set I, [2024-05-12T14:25:33.207231 #3956611] INFO -- : [357/885] 3997501=test_condition I, [2024-05-12T14:25:33.212616 #3956611] INFO -- : [358/885] 3997501=test_gem_dependency_resolution_error I, [2024-05-12T14:25:33.223612 #3956611] INFO -- : [359/885] 3997501=test_fileutils I, [2024-05-12T14:25:33.248296 #3956611] INFO -- : [360/885] 3997503=test_sleep I, [2024-05-12T14:25:33.565581 #3956611] INFO -- : Leaked file descriptor: TestFileUtils#test_chown_error: 9 # I, [2024-05-12T14:25:33.601370 #3956611] INFO -- : COMMAND PID USER FD TYPE DEVICE SIZE/OFF NODE NAME I, [2024-05-12T14:25:33.601430 #3956611] INFO -- : ruby 3997501 opc 9r REG 252,0 9253600 13705411 /var/lib/sss/mc/passwd I, [2024-05-12T14:25:33.772361 #3956611] INFO -- : [361/885] 3997501=test_mixed_unicode_escapes I, [2024-05-12T14:25:33.781433 #3956611] INFO -- : [362/885] 3997501=test_emoji I, [2024-05-12T14:25:33.871919 #3956611] INFO -- : [363/885] 3997501=test_sorted_set I, [2024-05-12T14:25:33.994864 #3956611] INFO -- : [364/885] 3997501=test_windows_1252 I, [2024-05-12T14:25:34.171607 #3956611] INFO -- : [365/885] 3997501=test_stack I, [2024-05-12T14:25:34.759757 #3956611] INFO -- : [366/885] 3997501=test_win32ole_variable I, [2024-05-12T14:25:34.761123 #3956611] INFO -- : [367/885] 3997501=test_method_cache I, [2024-05-12T14:25:34.825102 #3956611] INFO -- : [368/885] 3997501=test_parse I, [2024-05-12T14:25:35.218529 #3956611] INFO -- : [369/885] 3997501=test_rdoc_cross_reference I, [2024-05-12T14:25:35.287976 #3956611] INFO -- : [370/885] 3997503=test_rdoc_class_module I, [2024-05-12T14:25:35.627347 #3956611] INFO -- : [371/885] 3997501=test_gem_specification I, [2024-05-12T14:25:35.852565 #3956611] INFO -- : [372/885] 3997503=test_flush I, [2024-05-12T14:25:35.863866 #3956611] INFO -- : [373/885] 3997503=test_pkey_rsa I, [2024-05-12T14:25:36.159355 #3956611] INFO -- : [374/885] 3997503=test_system I, [2024-05-12T14:25:37.009822 #3956611] INFO -- : [375/885] 3997503=test_numhash I, [2024-05-12T14:25:37.017607 #3956611] INFO -- : [376/885] 3997503=ripper_test I, [2024-05-12T14:25:37.616101 #3956611] INFO -- : [377/885] 3997503=test_iso_8859 I, [2024-05-12T14:25:37.639849 #3956611] INFO -- : [378/885] 3997503=test_libs I, [2024-05-12T14:25:37.657973 #3956611] INFO -- : [379/885] 3997503=test_math I, [2024-05-12T14:25:37.676665 #3956611] INFO -- : [380/885] 3997503=test_gc I, [2024-05-12T14:25:37.676957 #3956611] INFO -- : [381/885] 3997503=test_qsort I, [2024-05-12T14:25:37.689279 #3956611] INFO -- : [382/885] 3997503=comments_test I, [2024-05-12T14:25:37.690222 #3956611] INFO -- : [383/885] 3997503=test_safe_load I, [2024-05-12T14:25:37.704161 #3956611] INFO -- : [384/885] 3997503=test_sprintf I, [2024-05-12T14:25:37.986063 #3956611] INFO -- : [385/885] 3997503=test_exit I, [2024-05-12T14:25:37.999133 #3956611] INFO -- : [386/885] 3997503=test_class I, [2024-05-12T14:25:38.519903 #3956611] INFO -- : [387/885] 3997501=test_rdoc_parser_rd I, [2024-05-12T14:25:38.533891 #3956611] INFO -- : [388/885] 3997501=index_write_test I, [2024-05-12T14:25:38.539771 #3956611] INFO -- : [389/885] 3997501=test_const I, [2024-05-12T14:25:38.544593 #3956611] INFO -- : [390/885] 3997501=test_recorder I, [2024-05-12T14:25:38.552996 #3956611] INFO -- : [391/885] 3997501=test_yaml_special_cases I, [2024-05-12T14:25:38.574120 #3956611] INFO -- : [392/885] 3997501=test_gem_commands_sources_command I, [2024-05-12T14:25:38.813030 #3956611] INFO -- : [393/885] 3997501=json_addition_test I, [2024-05-12T14:25:38.827463 #3956611] INFO -- : [394/885] 3997501=test_gem_source_list I, [2024-05-12T14:25:38.905594 #3956611] INFO -- : [395/885] 3997501=test_name_error I, [2024-05-12T14:25:39.004840 #3956611] INFO -- : [396/885] 3997501=test_case I, [2024-05-12T14:25:39.090138 #3956611] INFO -- : [397/885] 3997501=test_open-uri I, [2024-05-12T14:25:39.502974 #3956611] INFO -- : [398/885] 3997501=test_enc_associate I, [2024-05-12T14:25:39.935125 #3956611] INFO -- : [399/885] 3997501=test_enumerator I, [2024-05-12T14:25:41.209370 #3956611] INFO -- : [400/885] 3997503=test_gem_command_manager I, [2024-05-12T14:25:41.405216 #3956611] INFO -- : [401/885] 3997503=test_rdoc_context I, [2024-05-12T14:25:42.145013 #3956611] INFO -- : [402/885] 3997503=test_array I, [2024-05-12T14:25:42.156655 #3956611] INFO -- : [403/885] 3997503=test_rdoc_generator_json_index I, [2024-05-12T14:25:42.192347 #3956611] INFO -- : [404/885] 3997503=test_date_time I, [2024-05-12T14:25:42.204692 #3956611] INFO -- : [405/885] 3997503=test_nil2vtempty I, [2024-05-12T14:25:42.206489 #3956611] INFO -- : [406/885] 3997503=test_framework I, [2024-05-12T14:25:42.328009 #3956611] INFO -- : [407/885] 3997503=test_weakmap I, [2024-05-12T14:25:44.499015 #3956611] INFO -- : [408/885] 3997502=test_coderange I, [2024-05-12T14:25:44.511686 #3956611] INFO -- : [409/885] 3997502=test_ansi_with_terminfo I, [2024-05-12T14:25:44.601020 #3956611] INFO -- : [410/885] 3997502=test_inadvertent_creation I, [2024-05-12T14:25:44.626390 #3956611] INFO -- : [411/885] 3997502=test_cgi_tag_helper I, [2024-05-12T14:25:44.659247 #3956611] INFO -- : [412/885] 3997502=test_pack I, [2024-05-12T14:25:44.689864 #3956611] INFO -- : [413/885] 3997502=test_pinned I, [2024-05-12T14:25:44.743307 #3956611] INFO -- : [414/885] 3997502=test_gem_source_local I, [2024-05-12T14:25:44.972483 #3956611] INFO -- : [415/885] 3997502=desugar_compiler_test I, [2024-05-12T14:25:44.981639 #3956611] INFO -- : [416/885] 3997502=test_internal_ivar I, [2024-05-12T14:25:44.988343 #3956611] INFO -- : [417/885] 3997502=test_win32ole I, [2024-05-12T14:25:44.996281 #3956611] INFO -- : [418/885] 3997502=test_rendering I, [2024-05-12T14:25:45.013719 #3956611] INFO -- : [419/885] 3997502=test_gem_gemcutter_utilities I, [2024-05-12T14:25:45.486382 #3956611] INFO -- : [420/885] 3997502=test_rdoc_task I, [2024-05-12T14:25:45.533483 #3956611] INFO -- : [421/885] 3997502=test_settracefunc I, [2024-05-12T14:25:46.337897 #3956611] INFO -- : [422/885] 3997502=test_gem_text I, [2024-05-12T14:25:46.552212 #3956611] INFO -- : [423/885] 3997502=test_tracepoint I, [2024-05-12T14:25:46.791997 #3956611] INFO -- : [424/885] 3997502=test_backtrace I, [2024-05-12T14:25:48.078427 #3956611] INFO -- : [425/885] 3997502=test_gem_commands_push_command I, [2024-05-12T14:25:48.692263 #3956611] INFO -- : [426/885] 3997502=locals_test I, [2024-05-12T14:25:49.219492 #3956611] INFO -- : [427/885] 3997502=test_method_cache I, [2024-05-12T14:25:49.274808 #3956611] INFO -- : [428/885] 3997502=test_too_many_dummy_encodings I, [2024-05-12T14:25:49.287190 #3956611] INFO -- : [429/885] 3997502=test_sprintf_comb I, [2024-05-12T14:25:49.474242 #3956611] INFO -- : [430/885] 3997502=encoding_test I, [2024-05-12T14:25:49.544886 #3956611] INFO -- : [431/885] 3997502=test_scan_args I, [2024-05-12T14:25:49.573960 #3956611] INFO -- : [432/885] 3997502=test_gem_commands_specification_command I, [2024-05-12T14:25:49.727047 #3956611] INFO -- : [433/885] 3997502=test_gem_commands_which_command I, [2024-05-12T14:25:49.783726 #3956611] INFO -- : [434/885] 3997502=test_gem_request I, [2024-05-12T14:25:50.036539 #3956611] INFO -- : [435/885] 3997502=test_gem_package_old I, [2024-05-12T14:25:50.090887 #3956611] INFO -- : [436/885] 3997502=test_pty I, [2024-05-12T14:25:50.631526 #3956611] INFO -- : [437/885] 3997502=test_gem_dependency_installer I, [2024-05-12T14:25:51.010668 #3956611] INFO -- : [438/885] 3997503=test_http I, [2024-05-12T14:25:51.015428 #3956611] INFO -- : [439/885] 3997503=parser_test I, [2024-05-12T14:25:51.032672 #3956611] INFO -- : [440/885] 3997503=test_hash I, [2024-05-12T14:25:53.265750 #3956611] INFO -- : [441/885] 3997502=test_parser_events I, [2024-05-12T14:25:53.360389 #3956611] INFO -- : [442/885] 3997502=test_filter I, [2024-05-12T14:25:53.454382 #3956611] INFO -- : [443/885] 3997502=test_pkcs12 I, [2024-05-12T14:25:54.095439 #3956611] INFO -- : [444/885] 3997502=test_json_tree I, [2024-05-12T14:25:54.104192 #3956611] INFO -- : [445/885] 3997502=test_koi8 I, [2024-05-12T14:25:54.157418 #3956611] INFO -- : [446/885] 3997502=test_gem_remote_fetcher I, [2024-05-12T14:25:55.245069 #3956611] INFO -- : [447/885] 3997503=test_argf I, [2024-05-12T14:25:56.084459 #3956611] INFO -- : [448/885] 3997502=test_yaml I, [2024-05-12T14:25:56.191745 #3956611] INFO -- : [449/885] 3997502=test_x509name I, [2024-05-12T14:25:56.213536 #3956611] INFO -- : [450/885] 3997502=test_gem_dependency I, [2024-05-12T14:25:56.383548 #3956611] INFO -- : [451/885] 3997502=test_yjit I, [2024-05-12T14:25:56.430389 #3956611] INFO -- : [452/885] 3997502=test_gem_uninstaller I, [2024-05-12T14:25:57.694186 #3956611] INFO -- : [453/885] 3997502=test_cclass I, [2024-05-12T14:25:57.762230 #3956611] INFO -- : [454/885] 3997502=test_method I, [2024-05-12T14:25:58.947216 #3956611] INFO -- : [455/885] 3997503=test_m17n I, [2024-05-12T14:25:59.073126 #3956611] INFO -- : [456/885] 3997503=test_rdoc_markup_to_rdoc I, [2024-05-12T14:25:59.129354 #3956611] INFO -- : [457/885] 3997503=test_ractor I, [2024-05-12T14:25:59.130072 #3956611] INFO -- : [458/885] 3997503=test_case I, [2024-05-12T14:25:59.139180 #3956611] INFO -- : [459/885] 3997503=test_severity I, [2024-05-12T14:25:59.146148 #3956611] INFO -- : [460/885] 3997503=test_str2big I, [2024-05-12T14:25:59.166671 #3956611] INFO -- : [461/885] 3997503=test_gem_package_tar_writer I, [2024-05-12T14:25:59.353322 #3956611] INFO -- : [462/885] 3997503=attribute_write_test I, [2024-05-12T14:25:59.364916 #3956611] INFO -- : [463/885] 3997503=test_utf16 I, [2024-05-12T14:25:59.414157 #3956611] INFO -- : [464/885] 3997503=test_http I, [2024-05-12T14:26:01.127573 #3956611] INFO -- : [465/885] 3997501=test_set I, [2024-05-12T14:26:01.132742 #3956611] INFO -- : [466/885] 3997501=test_win32ole_param_event I, [2024-05-12T14:26:01.138057 #3956611] INFO -- : [467/885] 3997501=test_https_proxy I, [2024-05-12T14:26:01.144633 #3956611] INFO -- : [468/885] 3997501=test_rdoc_parser I, [2024-05-12T14:26:01.178653 #3956611] INFO -- : [469/885] 3997501=test_nomethod_error I, [2024-05-12T14:26:01.224615 #3956611] INFO -- : [470/885] 3997501=test_gem_commands_rebuild_command I, [2024-05-12T14:26:01.280001 #3956611] INFO -- : [471/885] 3997501=test_etc I, [2024-05-12T14:26:01.352272 #3956611] INFO -- : [472/885] 3997501=test_stat I, [2024-05-12T14:26:01.359112 #3956611] INFO -- : [473/885] 3997501=test_x509attr I, [2024-05-12T14:26:01.367922 #3956611] INFO -- : [474/885] 3997501=test_printf I, [2024-05-12T14:26:01.385749 #3956611] INFO -- : [475/885] 3997501=test_workspace I, [2024-05-12T14:26:01.505717 #3956611] INFO -- : [476/885] 3997501=test_win32ole_variant I, [2024-05-12T14:26:01.512309 #3956611] INFO -- : [477/885] 3997501=magic_comment_test I, [2024-05-12T14:26:01.523239 #3956611] INFO -- : [478/885] 3997501=test_cgi_modruby I, [2024-05-12T14:26:01.527780 #3956611] INFO -- : [479/885] 3997501=test_uncorrectable_name_check I, [2024-05-12T14:26:01.558746 #3956611] INFO -- : [480/885] 3997501=test_io I, [2024-05-12T14:26:03.964219 #3956611] INFO -- : [481/885] 3997502=test_dir I, [2024-05-12T14:26:04.352377 #3956611] INFO -- : [482/885] 3997502=test_files_test_1 I, [2024-05-12T14:26:06.703780 #3956611] INFO -- : [483/885] 3997502=test_closure I, [2024-05-12T14:26:08.061029 #3956611] INFO -- : [484/885] 3997503=test_resolve_symbol I, [2024-05-12T14:26:08.161262 #3956611] INFO -- : [485/885] 3997503=test_rubygems I, [2024-05-12T14:26:08.269519 #3956611] INFO -- : [486/885] 3997503=test_path I, [2024-05-12T14:26:08.276752 #3956611] INFO -- : [487/885] 3997503=test_digest I, [2024-05-12T14:26:08.283746 #3956611] INFO -- : [488/885] 3997503=test_rdoc_rd_inline I, [2024-05-12T14:26:08.291647 #3956611] INFO -- : [489/885] 3997503=test_propertyputref I, [2024-05-12T14:26:08.296981 #3956611] INFO -- : [490/885] 3997503=test_gb18030 I, [2024-05-12T14:26:08.309597 #3956611] INFO -- : [491/885] 3997503=test_gem_commands_lock_command I, [2024-05-12T14:26:08.386546 #3956611] INFO -- : [492/885] 3997503=test_reline_key I, [2024-05-12T14:26:08.388928 #3956611] INFO -- : [493/885] 3997503=test_unicode_normalize I, [2024-05-12T14:26:09.070817 #3956611] INFO -- : [494/885] 3997502=test_gem_stream_ui I, [2024-05-12T14:26:09.194806 #3956611] INFO -- : [495/885] 3997502=test_rdoc_generator_ri I, [2024-05-12T14:26:09.208909 #3956611] INFO -- : [496/885] 3997502=test_rdoc_top_level I, [2024-05-12T14:26:09.533077 #3956611] INFO -- : [497/885] 3997502=test_io_m17n I, [2024-05-12T14:26:10.730533 #3956611] INFO -- : [498/885] 3997502=test_cmethod I, [2024-05-12T14:26:10.745535 #3956611] INFO -- : [499/885] 3997502=test_gem_stub_specification I, [2024-05-12T14:26:10.949807 #3956611] INFO -- : [500/885] 3997502=test_float I, [2024-05-12T14:26:11.072889 #3956611] INFO -- : [501/885] 3997501=test_color I, [2024-05-12T14:26:11.105405 #3956611] INFO -- : [502/885] 3997501=json_ext_parser_test I, [2024-05-12T14:26:11.123013 #3956611] INFO -- : [503/885] 3997501=test_gem_ext_configure_builder I, [2024-05-12T14:26:11.156180 #3956611] INFO -- : [504/885] 3997501=test_nonblock I, [2024-05-12T14:26:11.176690 #3956611] INFO -- : [505/885] 3997501=test_rdoc_parser_simple I, [2024-05-12T14:26:11.201045 #3956611] INFO -- : [506/885] 3997501=test_ocsp I, [2024-05-12T14:26:11.301564 #3956611] INFO -- : [507/885] 3997501=test_scanner_events I, [2024-05-12T14:26:11.376028 #3956611] INFO -- : [508/885] 3997501=test_ipaddr I, [2024-05-12T14:26:11.424637 #3956611] INFO -- : [509/885] 3997501=test_date_strptime I, [2024-05-12T14:26:11.540108 #3956611] INFO -- : [510/885] 3997501=test_omap I, [2024-05-12T14:26:11.554745 #3956611] INFO -- : [511/885] 3997501=test_rdoc_generator_pot_po I, [2024-05-12T14:26:11.560254 #3956611] INFO -- : [512/885] 3997501=test_mul I, [2024-05-12T14:26:11.571763 #3956611] INFO -- : [513/885] 3997501=test_shellwords I, [2024-05-12T14:26:11.572188 #3956611] INFO -- : [514/885] 3997501=test_benchmark I, [2024-05-12T14:26:12.093773 #3956611] INFO -- : [515/885] 3997503=test_at_exit I, [2024-05-12T14:26:12.117765 #3956611] INFO -- : [516/885] 3997503=test_gem_source I, [2024-05-12T14:26:12.446196 #3956611] INFO -- : [517/885] 3997503=test_mkmf I, [2024-05-12T14:26:12.545710 #3956611] INFO -- : [518/885] 3997503=test_have_macro I, [2024-05-12T14:26:12.653236 #3956611] INFO -- : [519/885] 3997502=test_class I, [2024-05-12T14:26:12.677822 #3956611] INFO -- : [520/885] 3997502=test_autoload I, [2024-05-12T14:26:12.753831 #3956611] INFO -- : [521/885] 3997503=test_gem_package I, [2024-05-12T14:26:13.067910 #3956611] INFO -- : [522/885] 3997501=test_array I, [2024-05-12T14:26:13.555500 #3956611] INFO -- : [523/885] 3997503=dispatcher_test I, [2024-05-12T14:26:13.569701 #3956611] INFO -- : [524/885] 3997503=test_eval_history I, [2024-05-12T14:26:13.582745 #3956611] INFO -- : [525/885] 3997503=test_unicode I, [2024-05-12T14:26:13.621519 #3956611] INFO -- : [526/885] 3997503=test_gem_source_git I, [2024-05-12T14:26:14.719051 #3956611] INFO -- : [527/885] 3997503=test_regex_casefold I, [2024-05-12T14:26:15.119626 #3956611] INFO -- : [528/885] 3997503=test_lexer I, [2024-05-12T14:26:15.132777 #3956611] INFO -- : [529/885] 3997503=test_win32ole_method I, [2024-05-12T14:26:15.229571 #3956611] INFO -- : [530/885] 3997503=test_ripper I, [2024-05-12T14:26:15.445079 #3956611] INFO -- : [531/885] 3997503=test_files_ext I, [2024-05-12T14:26:15.447585 #3956611] INFO -- : [532/885] 3997503=test_assembler I, [2024-05-12T14:26:15.462300 #3956611] INFO -- : [533/885] 3997503=test_stringio I, [2024-05-12T14:26:15.551967 #3956611] INFO -- : [534/885] 3997503=test_thread_cv I, [2024-05-12T14:26:16.221869 #3956611] INFO -- : [535/885] 3997503=test_random I, [2024-05-12T14:26:16.246150 #3956611] INFO -- : [536/885] 3997503=test_iseq I, [2024-05-12T14:26:16.788508 #3956611] INFO -- : [537/885] 3997503=test_primitive I, [2024-05-12T14:26:16.806740 #3956611] INFO -- : [538/885] 3997503=test_parser I, [2024-05-12T14:26:16.829950 #3956611] INFO -- : [539/885] 3997503=test_rdoc_ri_paths I, [2024-05-12T14:26:16.866083 #3956611] INFO -- : [540/885] 3997503=command_line_test I, [2024-05-12T14:26:16.954857 #3956611] INFO -- : [541/885] 3997503=test_pair I, [2024-05-12T14:26:17.311193 #3956611] INFO -- : [542/885] 3997502=test_win32ole_variant_m I, [2024-05-12T14:26:17.326356 #3956611] INFO -- : [543/885] 3997502=test_env I, [2024-05-12T14:26:19.803787 #3956611] INFO -- : [544/885] 3997502=test_gem_commands_signout_command I, [2024-05-12T14:26:19.826615 #3956611] INFO -- : [545/885] 3997502=test_gem_package_tar_reader I, [2024-05-12T14:26:19.911068 #3956611] INFO -- : [546/885] 3997502=test_gem_safe_yaml I, [2024-05-12T14:26:19.923416 #3956611] INFO -- : [547/885] 3997502=test_eval I, [2024-05-12T14:26:19.930932 #3956611] INFO -- : [548/885] 3997502=test_document I, [2024-05-12T14:26:19.942985 #3956611] INFO -- : [549/885] 3997502=test_history I, [2024-05-12T14:26:20.029949 #3956611] INFO -- : [550/885] 3997502=test_gem_commands_setup_command I, [2024-05-12T14:26:20.755281 #3956611] INFO -- : [551/885] 3997502=test_singleton_function I, [2024-05-12T14:26:20.764895 #3956611] INFO -- : [552/885] 3997502=test_sockopt I, [2024-05-12T14:26:20.772358 #3956611] INFO -- : [553/885] 3997502=test_ftp I, [2024-05-12T14:26:20.788689 #3956611] INFO -- : [554/885] 3997502=test_gem_source_fetch_problem I, [2024-05-12T14:26:20.807405 #3956611] INFO -- : [555/885] 3997502=test_encoding I, [2024-05-12T14:26:20.860216 #3956611] INFO -- : [556/885] 3997502=test_install I, [2024-05-12T14:26:21.037699 #3956611] INFO -- : [557/885] 3997502=test_rdoc_comment I, [2024-05-12T14:26:21.089550 #3956611] INFO -- : [558/885] 3997502=test_lazy_enumerator I, [2024-05-12T14:26:21.531557 #3956611] INFO -- : [559/885] 3997502=test_cgi_multipart I, [2024-05-12T14:26:21.636697 #3956611] INFO -- : [560/885] 3997502=test_gem_request_set_lockfile_tokenizer I, [2024-05-12T14:26:21.720754 #3956611] INFO -- : [561/885] 3997502=test_arithmetic_sequence I, [2024-05-12T14:26:21.775124 #3956611] INFO -- : [562/885] 3997502=test_ractor_compatibility I, [2024-05-12T14:26:22.102464 #3956611] INFO -- : [563/885] 3997502=integer_parse_test I, [2024-05-12T14:26:22.109575 #3956611] INFO -- : [564/885] 3997502=test_autoconf I, [2024-05-12T14:26:22.116713 #3956611] INFO -- : [565/885] 3997502=test_find_executable I, [2024-05-12T14:26:22.138804 #3956611] INFO -- : [566/885] 3997502=test_irb I, [2024-05-12T14:26:22.235915 #3956611] INFO -- : [567/885] 3997503=test_x509cert I, [2024-05-12T14:26:22.328281 #3956611] INFO -- : [568/885] 3997503=test_rdoc_markup_paragraph I, [2024-05-12T14:26:22.371209 #3956611] INFO -- : [569/885] 3997503=test_require_path_check I, [2024-05-12T14:26:22.400764 #3956611] INFO -- : [570/885] 3997502=test_bn I, [2024-05-12T14:26:22.430311 #3956611] INFO -- : [571/885] 3997502=test_variable_name_check I, [2024-05-12T14:26:22.503186 #3956611] INFO -- : [572/885] 3997503=test_logdevice I, [2024-05-12T14:26:22.593303 #3956611] INFO -- : [573/885] 3997502=test_ast I, [2024-05-12T14:26:22.913773 #3956611] INFO -- : [574/885] 3997501=test_rdoc_markup_to_ansi I, [2024-05-12T14:26:22.973844 #3956611] INFO -- : [575/885] 3997501=test_files_test I, [2024-05-12T14:26:22.987578 #3956611] INFO -- : [576/885] 3997501=test_weakkeymap I, [2024-05-12T14:26:23.362467 #3956611] INFO -- : [577/885] 3997501=test_protocol I, [2024-05-12T14:26:23.511135 #3956611] INFO -- : [578/885] 3997503=test_evaluation I, [2024-05-12T14:26:23.528837 #3956611] INFO -- : [579/885] 3997503=test_https I, [2024-05-12T14:26:23.660379 #3956611] INFO -- : [580/885] 3997501=test_gem_commands_info_command I, [2024-05-12T14:26:23.686967 #3956611] INFO -- : [581/885] 3997501=test_object_create_start I, [2024-05-12T14:26:23.696672 #3956611] INFO -- : [582/885] 3997503=test_gem_request_set_gem_dependency_api I, [2024-05-12T14:26:23.707070 #3956611] INFO -- : [583/885] 3997501=test_name_error_extension I, [2024-05-12T14:26:23.712768 #3956611] INFO -- : [584/885] 3997501=test_file_exhaustive I, [2024-05-12T14:26:24.061976 #3956611] INFO -- : [585/885] 3997503=test_completion I, [2024-05-12T14:26:24.830975 #3956611] INFO -- : [586/885] 3997503=test_handle I, [2024-05-12T14:26:26.252828 #3956611] INFO -- : [587/885] 3997503=parse_stream_test I, [2024-05-12T14:26:26.257349 #3956611] INFO -- : [588/885] 3997503=test_delete I, [2024-05-12T14:26:26.276617 #3956611] INFO -- : [589/885] 3997503=test_rdoc_markup_document I, [2024-05-12T14:26:26.296035 #3956611] INFO -- : [590/885] 3997503=test_gem_security_policy I, [2024-05-12T14:26:26.751887 #3956611] INFO -- : [591/885] 3997503=test_io_wait_uncommon I, [2024-05-12T14:26:26.769257 #3956611] INFO -- : [592/885] 3997503=test_gem_ci_detector I, [2024-05-12T14:26:26.772705 #3956611] INFO -- : [593/885] 3997503=test_signal I, [2024-05-12T14:26:28.804906 #3956611] INFO -- : [594/885] 3997503=test_gem_silent_ui I, [2024-05-12T14:26:28.850070 #3956611] INFO -- : [595/885] 3997503=test_fixnum I, [2024-05-12T14:26:28.869774 #3956611] INFO -- : [596/885] 3997503=test_continuation I, [2024-05-12T14:26:28.923119 #3956611] INFO -- : [597/885] 3997503=test_ssl_session I, [2024-05-12T14:26:29.765263 #3956611] INFO -- : [598/885] 3997503=test_gem_package_tar_header I, [2024-05-12T14:26:29.843203 #3956611] INFO -- : [599/885] 3997503=test_rational2 I, [2024-05-12T14:26:29.958936 #3956611] INFO -- : [600/885] 3997503=test_case_comprehensive I, [2024-05-12T14:26:32.669110 #3956611] INFO -- : [601/885] 3997501=test_logperiod I, [2024-05-12T14:26:32.681777 #3956611] INFO -- : [602/885] 3997501=test_placearg I, [2024-05-12T14:26:32.746969 #3956611] INFO -- : [603/885] 3997501=test_rdoc_token_stream I, [2024-05-12T14:26:32.759129 #3956611] INFO -- : [604/885] 3997501=test_mutex I, [2024-05-12T14:26:33.889663 #3956611] INFO -- : [605/885] 3997501=heredoc_dedent_test I, [2024-05-12T14:26:33.901318 #3956611] INFO -- : [606/885] 3997501=test_type I, [2024-05-12T14:26:33.907527 #3956611] INFO -- : [607/885] 3997501=test_tmpdir I, [2024-05-12T14:26:33.985929 #3956611] INFO -- : [608/885] 3997501=test_struct I, [2024-05-12T14:26:34.560097 #3956611] INFO -- : [609/885] 3997501=test_rdoc_single_class I, [2024-05-12T14:26:34.601622 #3956611] INFO -- : [610/885] 3997501=test_dup I, [2024-05-12T14:26:34.764939 #3956611] INFO -- : [611/885] 3997501=test_acceptable I, [2024-05-12T14:26:34.831795 #3956611] INFO -- : [612/885] 3997501=test_gem_ext_cargo_builder_link_flag_converter I, [2024-05-12T14:26:34.916226 #3956611] INFO -- : [613/885] 3997501=test_gem_local_remote_options I, [2024-05-12T14:26:34.970406 #3956611] INFO -- : [614/885] 3997501=test_gem_safe_marshal I, [2024-05-12T14:26:35.888999 #3956611] INFO -- : [615/885] 3997501=test_rdoc_ri_driver I, [2024-05-12T14:26:36.276836 #3956611] INFO -- : [616/885] 3997501=test_sexp I, [2024-05-12T14:26:36.301681 #3956611] INFO -- : [617/885] 3997501=test_httpheader I, [2024-05-12T14:26:36.332555 #3956611] INFO -- : [618/885] 3997501=test_ractor I, [2024-05-12T14:26:36.373429 #3956611] INFO -- : [619/885] 3997501=test_gem_commands_check_command I, [2024-05-12T14:26:36.402780 #3956611] INFO -- : [620/885] 3997501=test_gem_resolver_git_set I, [2024-05-12T14:26:37.037752 #3956611] INFO -- : [621/885] 3997501=test_signedness I, [2024-05-12T14:26:38.995130 #3956611] INFO -- : [622/885] 3997501=test_digest I, [2024-05-12T14:26:39.788882 #3956611] INFO -- : [623/885] 3997501=test_ractor I, [2024-05-12T14:26:39.884595 #3956611] INFO -- : [624/885] 3997501=test_exception_at_throwing I, [2024-05-12T14:26:39.911138 #3956611] INFO -- : [625/885] 3997501=test_gem_resolver_installed_specification I, [2024-05-12T14:26:39.954257 #3956611] INFO -- : [626/885] 3997501=test_stringscanner I, [2024-05-12T14:26:40.098362 #3956611] INFO -- : [627/885] 3997501=test_fiddle I, [2024-05-12T14:26:40.234946 #3956611] INFO -- : [628/885] 3997501=json_generic_object_test I, [2024-05-12T14:26:40.246362 #3956611] INFO -- : [629/885] 3997501=test_date_arith I, [2024-05-12T14:26:40.259204 #3956611] INFO -- : [630/885] 3997501=test_gem_resolver_vendor_specification I, [2024-05-12T14:26:40.303224 #3956611] INFO -- : [631/885] 3997501=test_config I, [2024-05-12T14:26:40.345682 #3956611] INFO -- : [632/885] 3997501=test_ostruct I, [2024-05-12T14:26:40.478523 #3956611] INFO -- : [633/885] 3997501=test_depth_first I, [2024-05-12T14:26:40.484367 #3956611] INFO -- : [634/885] 3997501=test_change_word I, [2024-05-12T14:26:40.497672 #3956611] INFO -- : [635/885] 3997501=test_rdoc_parser_markdown I, [2024-05-12T14:26:40.502476 #3956611] INFO -- : [636/885] 3997501=test_custom_command I, [2024-05-12T14:26:40.508268 #3956611] INFO -- : [637/885] 3997501=test_rubyvm I, [2024-05-12T14:26:40.521243 #3956611] INFO -- : [638/885] 3997501=fuzzer_test I, [2024-05-12T14:26:40.522925 #3956611] INFO -- : [639/885] 3997501=test_cparser I, [2024-05-12T14:26:42.313429 #3956611] INFO -- : [640/885] 3997501=test_struct I, [2024-05-12T14:26:42.320352 #3956611] INFO -- : [641/885] 3997501=static_inspect_test I, [2024-05-12T14:26:42.369575 #3956611] INFO -- : [642/885] 3997501=test_c_struct_entry I, [2024-05-12T14:26:43.047302 #3956611] INFO -- : [643/885] 3997501=test_gem_package_task I, [2024-05-12T14:26:43.091080 #3956611] INFO -- : [644/885] 3997501=test_lock_native_thread I, [2024-05-12T14:26:43.310635 #3956611] INFO -- : [645/885] 3997501=test_resize I, [2024-05-12T14:26:43.316841 #3956611] INFO -- : [646/885] 3997501=test_key_error I, [2024-05-12T14:26:43.320709 #3956611] INFO -- : [647/885] 3997501=test_win32ole_param I, [2024-05-12T14:26:43.352583 #3956611] INFO -- : [648/885] 3997501=test_engine I, [2024-05-12T14:26:43.820668 #3956611] INFO -- : [649/885] 3997501=test_gem_commands_mirror I, [2024-05-12T14:26:43.832845 #3956611] INFO -- : [650/885] 3997501=test_fiber I, [2024-05-12T14:26:49.974368 #3956611] INFO -- : [651/885] 3997501=test_gem_security_trust_dir I, [2024-05-12T14:26:50.028064 #3956611] INFO -- : [652/885] 3997501=test_module I, [2024-05-12T14:26:51.256747 #3956611] INFO -- : [653/885] 3997503=test_erb_command I, [2024-05-12T14:26:51.274290 #3956611] INFO -- : [654/885] 3997503=test_usrmarshal I, [2024-05-12T14:26:51.496295 #3956611] INFO -- : [655/885] 3997503=test_gem_source_installed I, [2024-05-12T14:26:51.509993 #3956611] INFO -- : [656/885] 3997503=test_gem_validator I, [2024-05-12T14:26:51.598882 #3956611] INFO -- : [657/885] 3997503=test_abi I, [2024-05-12T14:26:51.715989 #3956611] INFO -- : [658/885] 3997503=test_load I, [2024-05-12T14:26:51.737985 #3956611] INFO -- : [659/885] 3997503=test_integer_comb I, [2024-05-12T14:26:53.639339 #3956611] INFO -- : [660/885] 3997501=test_bundled_ca I, [2024-05-12T14:26:54.832428 #3956611] INFO -- : [661/885] 3997503=test_ssl I, [2024-05-12T14:26:56.275439 #3956611] INFO -- : [662/885] 3997501=test_require I, [2024-05-12T14:26:58.969050 #3956611] INFO -- : [663/885] 3997501=test_objectspace I, [2024-05-12T14:26:59.910373 #3956611] INFO -- : [664/885] 3997501=test_debugger_integration I, [2024-05-12T14:26:59.911654 #3956611] INFO -- : [665/885] 3997501=test_gem_resolver_composed_set I, [2024-05-12T14:26:59.954146 #3956611] INFO -- : [666/885] 3997501=test_my_integer I, [2024-05-12T14:26:59.961859 #3956611] INFO -- : [667/885] 3997501=test_tracer I, [2024-05-12T14:26:59.969841 #3956611] INFO -- : [668/885] 3997501=test_cgi_cookie I, [2024-05-12T14:26:59.976911 #3956611] INFO -- : [669/885] 3997501=test_not I, [2024-05-12T14:27:00.051102 #3956611] INFO -- : [670/885] 3997501=test_option I, [2024-05-12T14:27:00.095478 #3956611] INFO -- : [671/885] 3997501=test_wss I, [2024-05-12T14:27:00.102239 #3956611] INFO -- : [672/885] 3997501=test_rdoc_markup_attribute_manager I, [2024-05-12T14:27:00.142441 #3956611] INFO -- : [673/885] 3997501=test_rdoc_rd_block_parser I, [2024-05-12T14:27:00.214620 #3956611] INFO -- : [674/885] 3997501=test_x509store I, [2024-05-12T14:27:00.687688 #3956611] INFO -- : [675/885] 3997501=test_rdoc_rd I, [2024-05-12T14:27:00.694303 #3956611] INFO -- : [676/885] 3997501=test_rdoc_markup_to_joined_paragraph I, [2024-05-12T14:27:00.704810 #3956611] INFO -- : [677/885] 3997501=test_rdoc_markup_to_markdown I, [2024-05-12T14:27:00.766006 #3956611] INFO -- : [678/885] 3997501=test_rdoc_generator_pot I, [2024-05-12T14:27:00.844798 #3956611] INFO -- : [679/885] 3997501=test_require_lib I, [2024-05-12T14:27:03.685794 #3956611] INFO -- : [680/885] 3997501=test_gem_gem_runner I, [2024-05-12T14:27:03.804041 #3956611] INFO -- : [681/885] 3997501=test_metaclass I, [2024-05-12T14:27:03.810683 #3956611] INFO -- : [682/885] 3997501=test_win32ole_type I, [2024-05-12T14:27:03.819564 #3956611] INFO -- : [683/885] 3997501=test_rdoc_rd_inline_parser I, [2024-05-12T14:27:03.838194 #3956611] INFO -- : [684/885] 3997501=test_load I, [2024-05-12T14:27:03.851188 #3956611] INFO -- : [685/885] 3997501=test_gem_source_lock I, [2024-05-12T14:27:03.927321 #3956611] INFO -- : [686/885] 3997501=test_cipher I, [2024-05-12T14:27:03.944195 #3956611] INFO -- : [687/885] 3997501=test_update I, [2024-05-12T14:27:03.951393 #3956611] INFO -- : [688/885] 3997501=test_new I, [2024-05-12T14:27:03.960790 #3956611] INFO -- : [689/885] 3997501=test_parser I, [2024-05-12T14:27:03.984246 #3956611] INFO -- : [690/885] 3997501=test_rdoc_markup_to_label I, [2024-05-12T14:27:04.042445 #3956611] INFO -- : [691/885] 3997501=test_gem_resolver_best_set I, [2024-05-12T14:27:04.116055 #3956611] INFO -- : [692/885] 3997501=test_cgi_core I, [2024-05-12T14:27:04.131251 #3956611] INFO -- : [693/885] 3997501=test_registry I, [2024-05-12T14:27:04.156417 #3956611] INFO -- : [694/885] 3997501=test_gem I, [2024-05-12T14:27:05.272361 #3956611] INFO -- : [695/885] 3997503=json_generator_test I, [2024-05-12T14:27:05.404464 #3956611] INFO -- : [696/885] 3997503=test_ansi_without_terminfo I, [2024-05-12T14:27:05.420333 #3956611] INFO -- : [697/885] 3997503=test_ractor I, [2024-05-12T14:27:05.448672 #3956611] INFO -- : [698/885] 3997503=test_gem_resolver_conflict I, [2024-05-12T14:27:05.471962 #3956611] INFO -- : [699/885] 3997503=test_ractor I, [2024-05-12T14:27:05.826970 #3956611] INFO -- : [700/885] 3997503=test_gem_commands_help_command I, [2024-05-12T14:27:05.905235 #3956611] INFO -- : [701/885] 3997503=test_scheduler I, [2024-05-12T14:27:06.093773 #3956611] INFO -- : [702/885] 3997503=test_ssl I, [2024-05-12T14:27:06.201855 #3956611] INFO -- : [703/885] 3997503=test_enc_str_buf_cat I, [2024-05-12T14:27:06.220091 #3956611] INFO -- : [704/885] 3997503=test_bignum I, [2024-05-12T14:27:06.552052 #3956611] INFO -- : [705/885] 3997501=newline_test I, [2024-05-12T14:27:06.628899 #3956611] INFO -- : [706/885] 3997501=test_rdoc_markup_hard_break I, [2024-05-12T14:27:06.641033 #3956611] INFO -- : [707/885] 3997501=test_marshal I, [2024-05-12T14:27:07.891353 #3956611] INFO -- : [708/885] 3997501=test_ancdata I, [2024-05-12T14:27:07.932948 #3956611] INFO -- : [709/885] 3997501=ractor_test I, [2024-05-12T14:27:07.965419 #3956611] INFO -- : [710/885] 3997501=test_nesting_parser I, [2024-05-12T14:27:07.991077 #3956611] INFO -- : [711/885] 3997501=test_gem_commands_contents_command I, [2024-05-12T14:27:08.121475 #3956611] INFO -- : [712/885] 3997501=test_context I, [2024-05-12T14:27:08.132576 #3956611] INFO -- : [713/885] 3997502=test_udp I, [2024-05-12T14:27:08.152703 #3956611] INFO -- : [714/885] 3997502=test_symbol I, [2024-05-12T14:27:08.238338 #3956611] INFO -- : [715/885] 3997501=test_gem_commands_search_command I, [2024-05-12T14:27:08.249734 #3956611] INFO -- : [716/885] 3997501=test_rdoc_servlet I, [2024-05-12T14:27:08.356435 #3956611] INFO -- : [717/885] 3997501=test_coder I, [2024-05-12T14:27:08.375600 #3956611] INFO -- : [718/885] 3997501=test_formatter I, [2024-05-12T14:27:08.388639 #3956611] INFO -- : [719/885] 3997501=test_unix I, [2024-05-12T14:27:09.608639 #3956611] INFO -- : [720/885] 3997501=test_integer I, [2024-05-12T14:27:09.877668 #3956611] INFO -- : [721/885] 3997503=test_date_marshal I, [2024-05-12T14:27:10.053034 #3956611] INFO -- : [722/885] 3997503=test_have_func I, [2024-05-12T14:27:11.293479 #3956611] INFO -- : [723/885] 3997501=test_gem_resolver_local_specification I, [2024-05-12T14:27:11.322151 #3956611] INFO -- : [724/885] 3997501=test_configuration I, [2024-05-12T14:27:11.412796 #3956611] INFO -- : [725/885] 3997501=test_date_new I, [2024-05-12T14:27:11.428425 #3956611] INFO -- : [726/885] 3997501=test_gem_commands_list_command I, [2024-05-12T14:27:11.440711 #3956611] INFO -- : [727/885] 3997501=test_address_resolve I, [2024-05-12T14:27:11.463414 #3956611] INFO -- : [728/885] 3997501=test_stream I, [2024-05-12T14:27:11.483114 #3956611] INFO -- : [729/885] 3997501=test_trick I, [2024-05-12T14:27:11.501782 #3956611] INFO -- : [730/885] 3997503=test_ractor I, [2024-05-12T14:27:11.564682 #3956611] INFO -- : [731/885] 3997503=test_rdoc_attr I, [2024-05-12T14:27:11.591229 #3956611] INFO -- : [732/885] 3997503=test_locale I, [2024-05-12T14:27:11.617296 #3956611] INFO -- : [733/885] 3997503=test_ts I, [2024-05-12T14:27:11.897544 #3956611] INFO -- : [734/885] 3997503=test_rbconfig I, [2024-05-12T14:27:11.911808 #3956611] INFO -- : [735/885] 3997503=test_num2int I, [2024-05-12T14:27:11.976953 #3956611] INFO -- : [736/885] 3997503=test_extlibs I, [2024-05-12T14:27:13.508571 #3956611] INFO -- : [737/885] 3997503=test_iter_break I, [2024-05-12T14:27:13.527461 #3956611] INFO -- : [738/885] 3997503=test_range I, [2024-05-12T14:27:13.895963 #3956611] INFO -- : [739/885] 3997502=test_gem_commands_signin_command I, [2024-05-12T14:27:13.990926 #3956611] INFO -- : [740/885] 3997501=test_recursion I, [2024-05-12T14:27:14.003848 #3956611] INFO -- : [741/885] 3997501=test_require I, [2024-05-12T14:27:14.087464 #3956611] INFO -- : [742/885] 3997502=test_rdoc_markup_include I, [2024-05-12T14:27:14.104936 #3956611] INFO -- : [743/885] 3997502=test_enum I, [2024-05-12T14:27:14.437732 #3956611] INFO -- : [744/885] 3997503=test_ensured I, [2024-05-12T14:27:14.450681 #3956611] INFO -- : [745/885] 3997503=test_euc_jp I, [2024-05-12T14:27:14.461728 #3956611] INFO -- : [746/885] 3997503=test_rdoc_markup I, [2024-05-12T14:27:14.466181 #3956611] INFO -- : [747/885] 3997503=test_key_stroke I, [2024-05-12T14:27:14.500219 #3956611] INFO -- : [748/885] 3997503=test_alias_and_anchor I, [2024-05-12T14:27:14.515129 #3956611] INFO -- : [749/885] 3997503=test_time I, [2024-05-12T14:27:14.676410 #3956611] INFO -- : [750/885] 3997503=test_popen_deadlock I, [2024-05-12T14:27:15.090830 #3956611] INFO -- : [751/885] 3997502=test_project_sanity I, [2024-05-12T14:27:15.148883 #3956611] INFO -- : [752/885] 3997502=test_symbol I, [2024-05-12T14:27:15.150510 #3956611] INFO -- : [753/885] 3997502=location_test I, [2024-05-12T14:27:15.206387 #3956611] INFO -- : [754/885] 3997502=test_chilled I, [2024-05-12T14:27:15.223896 #3956611] INFO -- : [755/885] 3997502=test_delegate I, [2024-05-12T14:27:15.272434 #3956611] INFO -- : [756/885] 3997502=test_set_len I, [2024-05-12T14:27:15.282167 #3956611] INFO -- : [757/885] 3997503=constant_path_node_test I, [2024-05-12T14:27:15.293584 #3956611] INFO -- : [758/885] 3997503=test_interned_str I, [2024-05-12T14:27:15.294973 #3956611] INFO -- : [759/885] 3997502=test_folderitem2_invokeverb I, [2024-05-12T14:27:15.299736 #3956611] INFO -- : [760/885] 3997503=test_pattern_matching I, [2024-05-12T14:27:15.301536 #3956611] INFO -- : [761/885] 3997502=test_gc I, [2024-05-12T14:27:15.367943 #3956611] INFO -- : [762/885] 3997503=test_gem_bundler_version_finder I, [2024-05-12T14:27:15.424237 #3956611] INFO -- : [763/885] 3997503=test_gem_request_set I, [2024-05-12T14:27:15.436711 #3956611] INFO -- : [764/885] 3997501=ruby_api_test I, [2024-05-12T14:27:15.666122 #3956611] INFO -- : [765/885] 3997501=test_gem_resolver_index_set I, [2024-05-12T14:27:15.723458 #3956611] INFO -- : [766/885] 3997501=test_sleep I, [2024-05-12T14:27:16.038744 #3956611] INFO -- : [767/885] 3997503=test_webauthn_listener_response I, [2024-05-12T14:27:16.081018 #3956611] INFO -- : [768/885] 3997503=test_time_tz I, [2024-05-12T14:27:16.150134 #3956611] INFO -- : [769/885] 3997503=test_addrinfo I, [2024-05-12T14:27:16.188660 #3956611] INFO -- : [770/885] 3997503=test_to_ruby I, [2024-05-12T14:27:16.206048 #3956611] INFO -- : [771/885] 3997503=test_data I, [2024-05-12T14:27:16.272954 #3956611] INFO -- : [772/885] 3997503=test_bug-14834 I, [2024-05-12T14:27:16.330442 #3956611] INFO -- : [773/885] 3997503=test_inlinecache I, [2024-05-12T14:27:16.350267 #3956611] INFO -- : [774/885] 3997503=test_socket I, [2024-05-12T14:27:17.236864 #3956611] INFO -- : [775/885] 3997503=test_terminfo I, [2024-05-12T14:27:17.260240 #3956611] INFO -- : [776/885] 3997503=test_thread I, [2024-05-12T14:27:20.731621 #3956611] INFO -- : [777/885] 3997501=test_reline I, [2024-05-12T14:27:20.977002 #3956611] INFO -- : [778/885] 3997501=test_ellipsize I, [2024-05-12T14:27:21.020298 #3956611] INFO -- : [779/885] 3997501=test_call I, [2024-05-12T14:27:21.232471 #3956611] INFO -- : [780/885] 3997501=test_gem_commands_build_command I, [2024-05-12T14:27:21.587277 #3956611] INFO -- : [781/885] 3997501=test_windows_1251 I, [2024-05-12T14:27:21.599838 #3956611] INFO -- : [782/885] 3997501=test_gem_ext_builder I, [2024-05-12T14:27:22.759175 #3956611] INFO -- : [783/885] 3997501=test_to_ary_concat I, [2024-05-12T14:27:24.567726 #3956611] INFO -- : [784/885] 3997502=test_history I, [2024-05-12T14:27:24.594456 #3956611] INFO -- : [785/885] 3997502=test_addr I, [2024-05-12T14:27:24.604660 #3956611] INFO -- : [786/885] 3997502=test_mailto I, [2024-05-12T14:27:24.615062 #3956611] INFO -- : [787/885] 3997502=test_kill_ring I, [2024-05-12T14:27:24.624419 #3956611] INFO -- : [788/885] 3997502=test_member I, [2024-05-12T14:27:24.631496 #3956611] INFO -- : [789/885] 3997502=test_object I, [2024-05-12T14:27:24.640164 #3956611] INFO -- : [790/885] 3997502=format_errors_test I, [2024-05-12T14:27:24.648273 #3956611] INFO -- : [791/885] 3997502=test_cgi_header I, [2024-05-12T14:27:24.657418 #3956611] INFO -- : [792/885] 3997502=test_case_options I, [2024-05-12T14:27:24.662259 #3956611] INFO -- : [793/885] 3997502=test_helper I, [2024-05-12T14:27:24.669469 #3956611] INFO -- : [794/885] 3997502=test_duplicate I, [2024-05-12T14:27:24.683584 #3956611] INFO -- : [795/885] 3997502=test_gem_resolver_api_set I, [2024-05-12T14:27:24.794418 #3956611] INFO -- : [796/885] 3997502=test_gem_installer I, [2024-05-12T14:27:26.087359 #3956611] INFO -- : [797/885] 3997503=test_bug_reporter I, [2024-05-12T14:27:26.300310 #3956611] INFO -- : [798/885] 3997503=test_buffered_io I, [2024-05-12T14:27:26.306559 #3956611] INFO -- : [799/885] 3997503=test_ossl I, [2024-05-12T14:27:26.785935 #3956611] INFO -- : [800/885] 3997501=test_ruby_lex I, [2024-05-12T14:27:26.901380 #3956611] INFO -- : [801/885] 3997501=test_arith_seq_extract I, [2024-05-12T14:27:27.052686 #3956611] INFO -- : [802/885] 3997501=compiler_test I, [2024-05-12T14:27:27.054177 #3956611] INFO -- : [803/885] 3997501=test_gem_source_subpath_problem I, [2024-05-12T14:27:27.180229 #3956611] INFO -- : [804/885] 3997501=test_object_references I, [2024-05-12T14:27:27.207649 #3956611] INFO -- : [805/885] 3997501=test_eval I, [2024-05-12T14:27:27.475688 #3956611] INFO -- : [806/885] 3997501=test_beginendblock I, [2024-05-12T14:27:27.782268 #3956611] INFO -- : [807/885] 3997501=test_monitor I, [2024-05-12T14:27:28.052516 #3956611] INFO -- : [808/885] 3997501=test_nofree I, [2024-05-12T14:27:28.059073 #3956611] INFO -- : [809/885] 3997501=test_whileuntil I, [2024-05-12T14:27:28.263185 #3956611] INFO -- : [810/885] 3997501=test_regexp I, [2024-05-12T14:27:29.763026 #3956611] INFO -- : [811/885] 3997502=test_pointer I, [2024-05-12T14:27:31.537254 #3956611] INFO -- : [812/885] 3997502=test_rdoc_normal_class I, [2024-05-12T14:27:31.580641 #3956611] INFO -- : [813/885] 3997502=test_within_pipe I, [2024-05-12T14:27:31.604106 #3956611] INFO -- : [814/885] 3997502=test_scalar_scanner I, [2024-05-12T14:27:31.619113 #3956611] INFO -- : [815/885] 3997502=test_lambda I, [2024-05-12T14:27:31.680957 #3956611] INFO -- : [816/885] 3997502=test_rb_str_dup I, [2024-05-12T14:27:31.691317 #3956611] INFO -- : [817/885] 3997502=test_trace I, [2024-05-12T14:27:31.699424 #3956611] INFO -- : [818/885] 3997502=test_arity I, [2024-05-12T14:27:31.711248 #3956611] INFO -- : [819/885] 3997502=test_gem_path_support I, [2024-05-12T14:27:31.792670 #3956611] INFO -- : [820/885] 3997502=test_keyword I, [2024-05-12T14:27:32.319053 #3956611] INFO -- : [821/885] 3997502=test_win32ole_type_event I, [2024-05-12T14:27:32.330805 #3956611] INFO -- : [822/885] 3997502=test_rdoc_markup_to_html I, [2024-05-12T14:27:32.433080 #3956611] INFO -- : [823/885] 3997502=test_foreach I, [2024-05-12T14:27:32.440004 #3956611] INFO -- : [824/885] 3997502=test_append I, [2024-05-12T14:27:32.472948 #3956611] INFO -- : [825/885] 3997502=test_gem_resolver_installer_set I, [2024-05-12T14:27:32.742777 #3956611] INFO -- : [826/885] 3997502=test_x509ext I, [2024-05-12T14:27:32.760875 #3956611] INFO -- : [827/885] 3997502=test_emitter I, [2024-05-12T14:27:32.773222 #3956611] INFO -- : [828/885] 3997502=bom_test I, [2024-05-12T14:27:32.789293 #3956611] INFO -- : [829/885] 3997502=test_file I, [2024-05-12T14:27:33.837890 #3956611] INFO -- : [830/885] 3997503=test_config I, [2024-05-12T14:27:34.150254 #3956611] INFO -- : [831/885] 3997503=test_summary I, [2024-05-12T14:27:34.218423 #3956611] INFO -- : [832/885] 3997503=test_helper_method I, [2024-05-12T14:27:34.238142 #3956611] INFO -- : [833/885] 3997503=test_dns I, [2024-05-12T14:27:34.790046 #3956611] INFO -- : [834/885] 3997503=test_c_union_entity I, [2024-05-12T14:27:34.988623 #3956611] INFO -- : [835/885] 3997503=test_notimplement I, [2024-05-12T14:27:35.002392 #3956611] INFO -- : [836/885] 3997503=test_cgi_session I, [2024-05-12T14:27:35.019687 #3956611] INFO -- : [837/885] 3997503=test_x509crl I, [2024-05-12T14:27:35.127216 #3956611] INFO -- : [838/885] 3997503=test_rdoc_markup_heading I, [2024-05-12T14:27:35.138338 #3956611] INFO -- : [839/885] 3997503=test_flip I, [2024-05-12T14:27:35.170065 #3956611] INFO -- : [840/885] 3997503=test_io_console I, [2024-05-12T14:27:37.819398 #3956611] INFO -- : [841/885] 3997503=test_pattern_key_name_check I, [2024-05-12T14:27:37.830413 #3956611] INFO -- : [842/885] 3997503=test_profile_frames I, [2024-05-12T14:27:38.001327 #3956611] INFO -- : [843/885] 3997503=test_debug I, [2024-05-12T14:27:38.394886 #3956611] INFO -- : [844/885] 3997503=test_refinement I, [2024-05-12T14:27:38.993000 #3956611] INFO -- : [845/885] 3997502=test_transcode I, [2024-05-12T14:27:39.202409 #3956611] INFO -- : [846/885] 3997502=test_class2name I, [2024-05-12T14:27:39.212736 #3956611] INFO -- : [847/885] 3997502=test_gem_commands_cleanup_command I, [2024-05-12T14:27:39.935853 #3956611] INFO -- : [848/885] 3997502=test_gem_ext_cmake_builder I, [2024-05-12T14:27:39.949732 #3956611] INFO -- : [849/885] 3997502=test_digest_extend I, [2024-05-12T14:27:41.021124 #3956611] INFO -- : [850/885] 3997502=test_last_thread I, [2024-05-12T14:27:41.034134 #3956611] INFO -- : [851/885] 3997502=test_thread_fd_close I, [2024-05-12T14:27:41.042626 #3956611] INFO -- : [852/885] 3997502=test_getopts I, [2024-05-12T14:27:41.052478 #3956611] INFO -- : [853/885] 3997502=test_emitter I, [2024-05-12T14:27:41.167837 #3956611] INFO -- : [854/885] 3997502=test_fips I, [2024-05-12T14:27:41.340891 #3956611] INFO -- : [855/885] 3997502=test_alias I, [2024-05-12T14:27:41.490906 #3956611] INFO -- : [856/885] 3997502=test_compile_prism I, [2024-05-12T14:27:41.808923 #3956611] INFO -- : [857/885] 3997502=test_helper I, [2024-05-12T14:27:41.813139 #3956611] INFO -- : [858/885] 3997502=test_win32ole_event I, [2024-05-12T14:27:41.823481 #3956611] INFO -- : [859/885] 3997502=test_gem_commands_uninstall_command I, [2024-05-12T14:27:42.057437 #3956611] INFO -- : [860/885] 3997503=test_rdoc_markup_formatter I, [2024-05-12T14:27:42.074642 #3956611] INFO -- : [861/885] 3997503=test_modify_expand I, [2024-05-12T14:27:42.087892 #3956611] INFO -- : [862/885] 3997503=test_pkg_config I, [2024-05-12T14:27:42.128219 #3956611] INFO -- : [863/885] 3997503=test_gem_available_set I, [2024-05-12T14:27:42.314424 #3956611] INFO -- : [864/885] 3997503=test_convertible I, [2024-05-12T14:27:42.804557 #3956611] INFO -- : [865/885] 3997502=errors_test I, [2024-05-12T14:27:42.898609 #3956611] INFO -- : [866/885] 3997502=json_encoding_test I, [2024-05-12T14:27:42.902551 #3956611] INFO -- : [867/885] 3997502=test_vm_dump I, [2024-05-12T14:27:44.397504 #3956611] INFO -- : [868/885] 3997502=test_func I, [2024-05-12T14:27:45.907285 #3956611] INFO -- : [869/885] 3997503=test_config I, [2024-05-12T14:27:45.975616 #3956611] INFO -- : [870/885] 3997503=test_gem_resolver I, [2024-05-12T14:27:46.492132 #3956611] INFO -- : [871/885] 3997503=test_gem_source_vendor I, [2024-05-12T14:27:46.513644 #3956611] INFO -- : [872/885] 3997503=test_object I, [2024-05-12T14:27:47.012014 #3956611] INFO -- : [873/885] 3997503=test_dln I, [2024-05-12T14:27:47.139844 #3956611] INFO -- : [874/885] 3997503=test_gem_commands_exec_command I, [2024-05-12T14:27:48.435664 #3956611] INFO -- : [875/885] 3997503=unescape_test I, [2024-05-12T14:27:48.507142 #3956611] INFO -- : [876/885] 3997502=test_color_printer I, [2024-05-12T14:27:48.532782 #3956611] INFO -- : [877/885] 3997502=test_super I, [2024-05-12T14:27:49.935375 #3956611] INFO -- : [878/885] 3997503=test_readpartial I, [2024-05-12T14:27:50.150551 #3956611] INFO -- : [879/885] 3997503=test_httpresponse I, [2024-05-12T14:27:50.199673 #3956611] INFO -- : [880/885] 3997503=test_rdoc_parser_ruby I, [2024-05-12T14:27:50.444361 #3956611] INFO -- : [881/885] 3997502=test_x509req I, [2024-05-12T14:27:50.472738 #3956611] INFO -- : [882/885] 3997502=test_gem_console_ui I, [2024-05-12T14:27:50.486406 #3956611] INFO -- : [883/885] 3997502=test_allocation I, [2024-05-12T14:27:51.930009 #3956611] INFO -- : [884/885] 3997503=test_ifunless I, [2024-05-12T14:27:51.939400 #3956611] INFO -- : [885/885] 3997503=test_insns_leaf I, [2024-05-12T14:27:59.531748 #3956611] INFO -- : Finished tests in 199.286402s, 132.0361 tests/s, 46909.9793 assertions/s. E, [2024-05-12T14:27:59.532071 #3956611] ERROR -- : Children under /tmp/rubytest.i6c3v7: E, [2024-05-12T14:27:59.532188 #3956611] ERROR -- : * drwx------ 4 28 2024-05-12 14:26:01 +0000 gem_rebuild20240512-3997501-5imw6h/ E, [2024-05-12T14:27:59.532217 #3956611] ERROR -- : * drwxrwxr-x 2 40 2024-05-12 14:26:01 +0000 old/ E, [2024-05-12T14:27:59.532249 #3956611] ERROR -- : * -rw-rw-r-- 1 4096 2024-05-12 14:26:01 +0000 rebuild_test_gem-1.0.0.gem E, [2024-05-12T14:27:59.532404 #3956611] ERROR -- : * drwxrwxr-x 2 40 2024-05-12 14:26:01 +0000 new/ E, [2024-05-12T14:27:59.532430 #3956611] ERROR -- : * -rw-rw-r-- 1 4096 2024-05-12 14:26:01 +0000 rebuild_test_gem-1.0.0.gem I, [2024-05-12T14:27:59.539410 #3956611] INFO -- : 26313 tests, 9348521 assertions, 0 failures, 0 errors, 320 skips I, [2024-05-12T14:27:59.539456 #3956611] INFO -- : I, [2024-05-12T14:27:59.539469 #3956611] INFO -- : ruby -v: ruby 3.4.0dev (2024-05-12T07:23:00Z master b911d2222f) [aarch64-linux] I, [2024-05-12T14:27:59.540339 #3956611] INFO -- : $$$[end] "make yes-test-all TESTOPTS='--stderr-on-failure' TESTS='-j3'" exit with 0. I, [2024-05-12T14:27:59.540501 #3956611] INFO -- : $$$[beg] make yes-test-rubyspec MSPECOPT='--error-output stderr --debug -j' TESTS='-j3' I, [2024-05-12T14:27:59.672259 #3956611] INFO -- : BASERUBY = /usr/local/bin/ruby --disable=gems I, [2024-05-12T14:27:59.672332 #3956611] INFO -- : CC = gcc I, [2024-05-12T14:27:59.672343 #3956611] INFO -- : LD = ld I, [2024-05-12T14:27:59.672354 #3956611] INFO -- : LDSHARED = gcc -shared I, [2024-05-12T14:27:59.672364 #3956611] INFO -- : CFLAGS = -O3 -fno-fast-math -ggdb3 -Wall -Wextra -Wdeprecated-declarations -Wdiv-by-zero -Wduplicated-cond -Wimplicit-function-declaration -Wimplicit-int -Wpointer-arith -Wwrite-strings -Wold-style-definition -Wimplicit-fallthrough=0 -Wmissing-noreturn -Wno-cast-function-type -Wno-constant-logical-operand -Wno-long-long -Wno-missing-field-initializers -Wno-overlength-strings -Wno-packed-bitfield-compat -Wno-parentheses-equality -Wno-self-assign -Wno-tautological-compare -Wno-unused-parameter -Wno-unused-value -Wsuggest-attribute=format -Wsuggest-attribute=noreturn -Wunused-variable -Wmisleading-indentation -Wundef I, [2024-05-12T14:27:59.672374 #3956611] INFO -- : XCFLAGS = -U_FORTIFY_SOURCE -D_FORTIFY_SOURCE=2 -fstack-protector-strong -msign-return-address=all -fno-strict-overflow -fvisibility=hidden -fexcess-precision=standard -DRUBY_EXPORT -fPIE -I. -I.ext/include/aarch64-linux -I/home/opc/ruby/src/master/include -I/home/opc/ruby/src/master -I/home/opc/ruby/src/master/prism -I/home/opc/ruby/src/master/enc/unicode/15.0.0 I, [2024-05-12T14:27:59.672382 #3956611] INFO -- : CPPFLAGS = I, [2024-05-12T14:27:59.672391 #3956611] INFO -- : DLDFLAGS = -Wl,--compress-debug-sections=zlib -fstack-protector-strong -pie I, [2024-05-12T14:27:59.672400 #3956611] INFO -- : SOLIBS = -lz -lrt -lrt -ldl -lcrypt -lm -lpthread I, [2024-05-12T14:27:59.672408 #3956611] INFO -- : LANG = en_US.UTF-8 I, [2024-05-12T14:27:59.672416 #3956611] INFO -- : LC_ALL = I, [2024-05-12T14:27:59.672424 #3956611] INFO -- : LC_CTYPE = I, [2024-05-12T14:27:59.672432 #3956611] INFO -- : MFLAGS = I, [2024-05-12T14:27:59.672440 #3956611] INFO -- : RUSTC = rustc I, [2024-05-12T14:27:59.672448 #3956611] INFO -- : YJIT_RUSTC_ARGS = --crate-name=yjit --crate-type=staticlib --edition=2021 -g -C lto=thin -C opt-level=3 -C overflow-checks=on '--out-dir=/home/opc/ruby/build/master/yjit/target/release/' /home/opc/ruby/src/master/yjit/src/lib.rs I, [2024-05-12T14:27:59.673150 #3956611] INFO -- : gcc (GCC) 8.5.0 20210514 (Red Hat 8.5.0-10.1.0.1) I, [2024-05-12T14:27:59.673205 #3956611] INFO -- : Copyright (C) 2018 Free Software Foundation, Inc. I, [2024-05-12T14:27:59.673218 #3956611] INFO -- : This is free software; see the source for copying conditions. There is NO I, [2024-05-12T14:27:59.673227 #3956611] INFO -- : warranty; not even for MERCHANTABILITY or FITNESS FOR A PARTICULAR PURPOSE. I, [2024-05-12T14:27:59.673235 #3956611] INFO -- : I, [2024-05-12T14:27:59.675243 #3956611] INFO -- : generating enc.mk I, [2024-05-12T14:27:59.909484 #3956611] INFO -- : generating encdb.h I, [2024-05-12T14:27:59.946580 #3956611] INFO -- : encdb.h unchanged I, [2024-05-12T14:27:59.947865 #3956611] INFO -- : making enc I, [2024-05-12T14:27:59.975185 #3956611] INFO -- : make[1]: Entering directory '/home/opc/ruby/build/master' I, [2024-05-12T14:27:59.975271 #3956611] INFO -- : make[1]: Nothing to be done for 'enc'. I, [2024-05-12T14:27:59.975293 #3956611] INFO -- : make[1]: Leaving directory '/home/opc/ruby/build/master' I, [2024-05-12T14:27:59.976050 #3956611] INFO -- : making srcs under enc I, [2024-05-12T14:28:00.017820 #3956611] INFO -- : make[1]: Entering directory '/home/opc/ruby/build/master' I, [2024-05-12T14:28:00.017889 #3956611] INFO -- : make[1]: Nothing to be done for 'srcs'. I, [2024-05-12T14:28:00.017899 #3956611] INFO -- : make[1]: Leaving directory '/home/opc/ruby/build/master' I, [2024-05-12T14:28:00.019003 #3956611] INFO -- : generating transdb.h I, [2024-05-12T14:28:00.162735 #3956611] INFO -- : transdb.h unchanged I, [2024-05-12T14:28:00.164003 #3956611] INFO -- : making trans I, [2024-05-12T14:28:00.212021 #3956611] INFO -- : make[1]: Entering directory '/home/opc/ruby/build/master' I, [2024-05-12T14:28:00.212075 #3956611] INFO -- : make[1]: Nothing to be done for 'trans'. I, [2024-05-12T14:28:00.212085 #3956611] INFO -- : make[1]: Leaving directory '/home/opc/ruby/build/master' I, [2024-05-12T14:28:00.212914 #3956611] INFO -- : making encs I, [2024-05-12T14:28:00.265484 #3956611] INFO -- : make[1]: Entering directory '/home/opc/ruby/build/master' I, [2024-05-12T14:28:00.265547 #3956611] INFO -- : make[1]: Nothing to be done for 'encs'. I, [2024-05-12T14:28:00.265557 #3956611] INFO -- : make[1]: Leaving directory '/home/opc/ruby/build/master' I, [2024-05-12T14:28:00.267522 #3956611] INFO -- : generating makefiles ext/configure-ext.mk I, [2024-05-12T14:28:00.307465 #3956611] INFO -- : ext/configure-ext.mk updated I, [2024-05-12T14:28:00.310931 #3956611] INFO -- : make[1]: Entering directory '/home/opc/ruby/build/master' I, [2024-05-12T14:28:02.362809 #3956611] INFO -- : make[1]: Leaving directory '/home/opc/ruby/build/master' I, [2024-05-12T14:28:02.363476 #3956611] INFO -- : generating makefile exts.mk I, [2024-05-12T14:28:02.422678 #3956611] INFO -- : exts.mk unchanged I, [2024-05-12T14:28:02.427618 #3956611] INFO -- : make[1]: Entering directory '/home/opc/ruby/build/master' I, [2024-05-12T14:28:02.725003 #3956611] INFO -- : make[2]: Entering directory '/home/opc/ruby/build/master/ext/coverage' I, [2024-05-12T14:28:02.729637 #3956611] INFO -- : make[2]: Leaving directory '/home/opc/ruby/build/master/ext/coverage' I, [2024-05-12T14:28:02.735498 #3956611] INFO -- : make[2]: Entering directory '/home/opc/ruby/build/master/ext/date' I, [2024-05-12T14:28:02.740700 #3956611] INFO -- : make[2]: Leaving directory '/home/opc/ruby/build/master/ext/date' I, [2024-05-12T14:28:02.744040 #3956611] INFO -- : make[2]: Entering directory '/home/opc/ruby/build/master/ext/digest' I, [2024-05-12T14:28:02.752728 #3956611] INFO -- : make[2]: Leaving directory '/home/opc/ruby/build/master/ext/digest' I, [2024-05-12T14:28:02.775820 #3956611] INFO -- : make[2]: Entering directory '/home/opc/ruby/build/master/ext/digest/sha2' I, [2024-05-12T14:28:02.781056 #3956611] INFO -- : make[2]: Leaving directory '/home/opc/ruby/build/master/ext/digest/sha2' I, [2024-05-12T14:28:02.799452 #3956611] INFO -- : make[2]: Entering directory '/home/opc/ruby/build/master/ext/fiddle' I, [2024-05-12T14:28:02.809737 #3956611] INFO -- : make[2]: Leaving directory '/home/opc/ruby/build/master/ext/fiddle' I, [2024-05-12T14:28:02.814094 #3956611] INFO -- : make[2]: Entering directory '/home/opc/ruby/build/master/ext/io/console' I, [2024-05-12T14:28:02.818483 #3956611] INFO -- : make[2]: Leaving directory '/home/opc/ruby/build/master/ext/io/console' I, [2024-05-12T14:28:02.829448 #3956611] INFO -- : make[2]: Entering directory '/home/opc/ruby/build/master/ext/json' I, [2024-05-12T14:28:02.838966 #3956611] INFO -- : make[2]: Leaving directory '/home/opc/ruby/build/master/ext/json' I, [2024-05-12T14:28:02.851944 #3956611] INFO -- : make[2]: Entering directory '/home/opc/ruby/build/master/ext/monitor' I, [2024-05-12T14:28:02.856036 #3956611] INFO -- : make[2]: Leaving directory '/home/opc/ruby/build/master/ext/monitor' I, [2024-05-12T14:28:02.862173 #3956611] INFO -- : make[2]: Entering directory '/home/opc/ruby/build/master/ext/objspace' I, [2024-05-12T14:28:02.868088 #3956611] INFO -- : make[2]: Leaving directory '/home/opc/ruby/build/master/ext/objspace' I, [2024-05-12T14:28:02.887072 #3956611] INFO -- : make[2]: Entering directory '/home/opc/ruby/build/master/ext/openssl' I, [2024-05-12T14:28:02.908630 #3956611] INFO -- : make[2]: Leaving directory '/home/opc/ruby/build/master/ext/openssl' I, [2024-05-12T14:28:02.912838 #3956611] INFO -- : make[2]: Entering directory '/home/opc/ruby/build/master/ext/pathname' I, [2024-05-12T14:28:02.917063 #3956611] INFO -- : make[2]: Leaving directory '/home/opc/ruby/build/master/ext/pathname' I, [2024-05-12T14:28:02.923651 #3956611] INFO -- : make[2]: Entering directory '/home/opc/ruby/build/master/ext/psych' I, [2024-05-12T14:28:02.945204 #3956611] INFO -- : make[2]: Leaving directory '/home/opc/ruby/build/master/ext/psych' I, [2024-05-12T14:28:02.949681 #3956611] INFO -- : make[2]: Entering directory '/home/opc/ruby/build/master/ext/pty' I, [2024-05-12T14:28:02.953813 #3956611] INFO -- : make[2]: Leaving directory '/home/opc/ruby/build/master/ext/pty' I, [2024-05-12T14:28:02.967168 #3956611] INFO -- : make[2]: Entering directory '/home/opc/ruby/build/master/ext/ripper' I, [2024-05-12T14:28:02.974870 #3956611] INFO -- : make[2]: Leaving directory '/home/opc/ruby/build/master/ext/ripper' I, [2024-05-12T14:28:02.977987 #3956611] INFO -- : make[2]: Entering directory '/home/opc/ruby/build/master/ext/rubyvm' I, [2024-05-12T14:28:02.981373 #3956611] INFO -- : make[2]: Leaving directory '/home/opc/ruby/build/master/ext/rubyvm' I, [2024-05-12T14:28:02.993348 #3956611] INFO -- : make[2]: Entering directory '/home/opc/ruby/build/master/ext/socket' I, [2024-05-12T14:28:03.004031 #3956611] INFO -- : make[2]: Leaving directory '/home/opc/ruby/build/master/ext/socket' I, [2024-05-12T14:28:03.019351 #3956611] INFO -- : make[2]: Entering directory '/home/opc/ruby/build/master/.bundle/gems/bigdecimal-3.1.7/ext/bigdecimal' I, [2024-05-12T14:28:03.050028 #3956611] INFO -- : make[2]: Leaving directory '/home/opc/ruby/build/master/.bundle/gems/bigdecimal-3.1.7/ext/bigdecimal' I, [2024-05-12T14:28:03.052680 #3956611] INFO -- : make[2]: Entering directory '/home/opc/ruby/build/master/.bundle/gems/bigdecimal-3.1.8/ext/bigdecimal' I, [2024-05-12T14:28:03.082572 #3956611] INFO -- : make[2]: Leaving directory '/home/opc/ruby/build/master/.bundle/gems/bigdecimal-3.1.8/ext/bigdecimal' I, [2024-05-12T14:28:03.085206 #3956611] INFO -- : make[2]: Entering directory '/home/opc/ruby/build/master/.bundle/gems/debug-1.9.2/ext/debug' I, [2024-05-12T14:28:03.115414 #3956611] INFO -- : make[2]: Leaving directory '/home/opc/ruby/build/master/.bundle/gems/debug-1.9.2/ext/debug' I, [2024-05-12T14:28:03.117991 #3956611] INFO -- : make[2]: Entering directory '/home/opc/ruby/build/master/.bundle/gems/nkf-0.2.0/ext/nkf' I, [2024-05-12T14:28:03.148535 #3956611] INFO -- : make[2]: Leaving directory '/home/opc/ruby/build/master/.bundle/gems/nkf-0.2.0/ext/nkf' I, [2024-05-12T14:28:03.151112 #3956611] INFO -- : make[2]: Entering directory '/home/opc/ruby/build/master/.bundle/gems/racc-1.7.3/ext/racc/cparse' I, [2024-05-12T14:28:03.181148 #3956611] INFO -- : make[2]: Leaving directory '/home/opc/ruby/build/master/.bundle/gems/racc-1.7.3/ext/racc/cparse' I, [2024-05-12T14:28:03.184315 #3956611] INFO -- : make[2]: Entering directory '/home/opc/ruby/build/master/.bundle/gems/rbs-3.4.4/ext/rbs_extension' I, [2024-05-12T14:28:03.214806 #3956611] INFO -- : make[2]: Leaving directory '/home/opc/ruby/build/master/.bundle/gems/rbs-3.4.4/ext/rbs_extension' I, [2024-05-12T14:28:03.217409 #3956611] INFO -- : make[2]: Entering directory '/home/opc/ruby/build/master/.bundle/gems/syslog-0.1.2/ext/syslog' I, [2024-05-12T14:28:03.247459 #3956611] INFO -- : make[2]: Leaving directory '/home/opc/ruby/build/master/.bundle/gems/syslog-0.1.2/ext/syslog' I, [2024-05-12T14:28:03.285528 #3956611] INFO -- : make[2]: Entering directory '/home/opc/ruby/build/master' I, [2024-05-12T14:28:03.369050 #3956611] INFO -- : make[2]: 'ruby' is up to date. I, [2024-05-12T14:28:03.369133 #3956611] INFO -- : make[2]: Leaving directory '/home/opc/ruby/build/master' I, [2024-05-12T14:28:03.369328 #3956611] INFO -- : make[1]: Leaving directory '/home/opc/ruby/build/master' I, [2024-05-12T14:28:03.373960 #3956611] INFO -- : make[1]: Entering directory '/home/opc/ruby/build/master' I, [2024-05-12T14:28:03.374007 #3956611] INFO -- : make[1]: Nothing to be done for 'note'. I, [2024-05-12T14:28:03.374018 #3956611] INFO -- : make[1]: Leaving directory '/home/opc/ruby/build/master' E, [2024-05-12T14:28:03.448637 #3956611] ERROR -- : $ /home/opc/ruby/build/master/miniruby -I/home/opc/ruby/src/master/lib /home/opc/ruby/src/master/tool/runruby.rb --archdir=/home/opc/ruby/build/master --extout=.ext -- /home/opc/ruby/src/master/spec/mspec/bin/mspec-run -B /home/opc/ruby/src/master/spec/default.mspec --error-output stderr --debug -fy -o /tmp/rubytest.14dn2z/1-mspec-multi-0 E, [2024-05-12T14:28:03.449003 #3956611] ERROR -- : $ /home/opc/ruby/build/master/miniruby -I/home/opc/ruby/src/master/lib /home/opc/ruby/src/master/tool/runruby.rb --archdir=/home/opc/ruby/build/master --extout=.ext -- /home/opc/ruby/src/master/spec/mspec/bin/mspec-run -B /home/opc/ruby/src/master/spec/default.mspec --error-output stderr --debug -fy -o /tmp/rubytest.14dn2z/2-mspec-multi-1 E, [2024-05-12T14:28:03.449291 #3956611] ERROR -- : $ /home/opc/ruby/build/master/miniruby -I/home/opc/ruby/src/master/lib /home/opc/ruby/src/master/tool/runruby.rb --archdir=/home/opc/ruby/build/master --extout=.ext -- /home/opc/ruby/src/master/spec/mspec/bin/mspec-run -B /home/opc/ruby/src/master/spec/default.mspec --error-output stderr --debug -fy -o /tmp/rubytest.14dn2z/3-mspec-multi-2 I, [2024-05-12T14:28:03.579912 #3956611] INFO -- : ruby 3.4.0dev (2024-05-12T07:23:00Z master b911d2222f) [aarch64-linux] I, [2024-05-12T14:28:08.871658 #3956611] INFO -- : 0 ......................................................................... I, [2024-05-12T14:28:11.240578 #3956611] INFO -- : 73 ......................................................................... I, [2024-05-12T14:28:11.439310 #3956611] INFO -- : 146 ......................................................................... I, [2024-05-12T14:28:11.730973 #3956611] INFO -- : 219 ......................................................................... I, [2024-05-12T14:28:11.898179 #3956611] INFO -- : 292 ......................................................................... I, [2024-05-12T14:28:12.131636 #3956611] INFO -- : 365 ......................................................................... I, [2024-05-12T14:28:12.252067 #3956611] INFO -- : 438 ......................................................................... I, [2024-05-12T14:28:12.310311 #3956611] INFO -- : 511 ......................................................................... I, [2024-05-12T14:28:12.369722 #3956611] INFO -- : 584 ......................................................................... I, [2024-05-12T14:28:12.971218 #3956611] INFO -- : 657 ......................................................................... I, [2024-05-12T14:28:13.070744 #3956611] INFO -- : 730 ......................................................................... I, [2024-05-12T14:28:13.120209 #3956611] INFO -- : 803 ......................................................................... I, [2024-05-12T14:28:13.312351 #3956611] INFO -- : 876 ......................................................................... I, [2024-05-12T14:28:13.416028 #3956611] INFO -- : 949 ......................................................................... I, [2024-05-12T14:28:14.014524 #3956611] INFO -- : 1022 ......................................................................... I, [2024-05-12T14:28:16.322517 #3956611] INFO -- : 1095 ......................................................................... I, [2024-05-12T14:28:17.125037 #3956611] INFO -- : 1168 ......................................................................... I, [2024-05-12T14:28:17.298994 #3956611] INFO -- : 1241 ......................................................................... I, [2024-05-12T14:28:17.482320 #3956611] INFO -- : 1314 ......................................................................... I, [2024-05-12T14:28:17.576982 #3956611] INFO -- : 1387 ......................................................................... I, [2024-05-12T14:28:19.626911 #3956611] INFO -- : 1460 ......................................................................... I, [2024-05-12T14:28:23.062824 #3956611] INFO -- : 1533 ......................................................................... I, [2024-05-12T14:28:23.195084 #3956611] INFO -- : 1606 ......................................................................... I, [2024-05-12T14:28:24.021713 #3956611] INFO -- : 1679 ......................................................................... I, [2024-05-12T14:28:24.370564 #3956611] INFO -- : 1752 ......................................................................... I, [2024-05-12T14:28:24.686235 #3956611] INFO -- : 1825 ......................................................................... I, [2024-05-12T14:28:25.053245 #3956611] INFO -- : 1898 ......................................................................... I, [2024-05-12T14:28:25.480529 #3956611] INFO -- : 1971 ......................................................................... I, [2024-05-12T14:28:26.065011 #3956611] INFO -- : 2044 ......................................................................... I, [2024-05-12T14:28:26.204704 #3956611] INFO -- : 2117 ......................................................................... I, [2024-05-12T14:28:26.272422 #3956611] INFO -- : 2190 ......................................................................... I, [2024-05-12T14:28:26.346477 #3956611] INFO -- : 2263 ......................................................................... I, [2024-05-12T14:28:26.409543 #3956611] INFO -- : 2336 ......................................................................... I, [2024-05-12T14:28:26.535908 #3956611] INFO -- : 2409 ......................................................................... I, [2024-05-12T14:28:26.823399 #3956611] INFO -- : 2482 ......................................................................... I, [2024-05-12T14:28:26.972875 #3956611] INFO -- : 2555 ......................................................................... I, [2024-05-12T14:28:28.329660 #3956611] INFO -- : 2628 ......................................................................... I, [2024-05-12T14:28:28.512836 #3956611] INFO -- : 2701 ......................................................................... I, [2024-05-12T14:28:28.660757 #3956611] INFO -- : 2774 ......................................................................... I, [2024-05-12T14:28:29.144617 #3956611] INFO -- : 2847 ......................................................................... I, [2024-05-12T14:28:29.468361 #3956611] INFO -- : 2920 ......................................................................... I, [2024-05-12T14:28:29.608116 #3956611] INFO -- : 2993 ......................................................................... I, [2024-05-12T14:28:29.685036 #3956611] INFO -- : 3066 ......................................................................... I, [2024-05-12T14:28:29.741980 #3956611] INFO -- : 3139 ......................................................................... I, [2024-05-12T14:28:29.814002 #3956611] INFO -- : 3212 ......................................................................... I, [2024-05-12T14:28:29.899925 #3956611] INFO -- : 3285 ......................................................................... I, [2024-05-12T14:28:33.721353 #3956611] INFO -- : 3358 ........................................................................ I, [2024-05-12T14:28:33.721429 #3956611] INFO -- : I, [2024-05-12T14:28:33.721442 #3956611] INFO -- : Finished in 30.272548 seconds I, [2024-05-12T14:28:33.721452 #3956611] INFO -- : I, [2024-05-12T14:28:33.721461 #3956611] INFO -- : 3429 files, 32607 examples, 185223 expectations, 0 failures, 0 errors, 0 tagged I, [2024-05-12T14:28:33.723061 #3956611] INFO -- : $$$[end] "make yes-test-rubyspec MSPECOPT='--error-output stderr --debug -j' TESTS='-j3'" exit with 0.