# Logfile created on 2024-05-11 08:12:14 +0000 by logger.rb/v1.5.3 I, [2024-05-11T08:12:14.392302 #796041] INFO -- : #, @formatter=nil, @logdev=#, @binmode=false, @mon_data=#, @mon_data_owner_object_id=860>>> I, [2024-05-11T08:12:14.392614 #796041] INFO -- : $$$[beg] make update-unicode -j3 I, [2024-05-11T08:12:14.481895 #796041] INFO -- : Downloading Unicode emoji 15.0 files... I, [2024-05-11T08:12:14.482163 #796041] INFO -- : Downloading Unicode emoji 15.0 files... I, [2024-05-11T08:12:14.482319 #796041] INFO -- : Downloading Unicode emoji 15.0 files... I, [2024-05-11T08:12:14.557932 #796041] INFO -- : made symlink emoji/15.0/emoji-sequences.txt to /home/opc/ruby/src/master/.downloaded-cache/emoji/15.0/emoji-sequences.txt I, [2024-05-11T08:12:14.557989 #796041] INFO -- : /home/opc/ruby/src/master/enc/unicode/data/emoji/15.0/emoji-sequences.txt already exists I, [2024-05-11T08:12:14.562871 #796041] INFO -- : downloading emoji/15.0/emoji-test.txt ... downloading emoji/15.0/emoji-test.txt ... /home/opc/ruby/src/master/enc/unicode/data/emoji/15.0/emoji-sequences.txt already exists E, [2024-05-11T08:12:15.040583 #796041] ERROR -- : /home/opc/ruby/src/master/tool/downloader.rb:302:in `rescue in download': failed to download emoji/15.0/emoji-test.txt (RuntimeError) E, [2024-05-11T08:12:15.040648 #796041] ERROR -- : OpenURI::HTTPError: 403 Forbidden: https://www.unicode.org/Public/emoji/15.0/emoji-test.txt E, [2024-05-11T08:12:15.040660 #796041] ERROR -- : from /home/opc/ruby/src/master/tool/downloader.rb:201:in `download' E, [2024-05-11T08:12:15.040669 #796041] ERROR -- : from /home/opc/ruby/src/master/tool/downloader.rb:136:in `download' E, [2024-05-11T08:12:15.040678 #796041] ERROR -- : from /home/opc/ruby/src/master/tool/downloader.rb:482:in `block in
' E, [2024-05-11T08:12:15.040686 #796041] ERROR -- : from /home/opc/ruby/src/master/tool/downloader.rb:465:in `each' E, [2024-05-11T08:12:15.040694 #796041] ERROR -- : from /home/opc/ruby/src/master/tool/downloader.rb:465:in `
' E, [2024-05-11T08:12:15.040702 #796041] ERROR -- : /usr/local/lib/ruby/3.2.0/open-uri.rb:369:in `open_http': 403 Forbidden (OpenURI::HTTPError) E, [2024-05-11T08:12:15.040711 #796041] ERROR -- : from /usr/local/lib/ruby/3.2.0/open-uri.rb:760:in `buffer_open' E, [2024-05-11T08:12:15.040719 #796041] ERROR -- : from /usr/local/lib/ruby/3.2.0/open-uri.rb:214:in `block in open_loop' E, [2024-05-11T08:12:15.040727 #796041] ERROR -- : from /usr/local/lib/ruby/3.2.0/open-uri.rb:212:in `catch' E, [2024-05-11T08:12:15.040735 #796041] ERROR -- : from /usr/local/lib/ruby/3.2.0/open-uri.rb:212:in `open_loop' E, [2024-05-11T08:12:15.040744 #796041] ERROR -- : from /usr/local/lib/ruby/3.2.0/open-uri.rb:153:in `open_uri' E, [2024-05-11T08:12:15.040752 #796041] ERROR -- : from /usr/local/lib/ruby/3.2.0/open-uri.rb:740:in `open' E, [2024-05-11T08:12:15.040763 #796041] ERROR -- : from /usr/local/lib/ruby/3.2.0/open-uri.rb:748:in `read' E, [2024-05-11T08:12:15.040772 #796041] ERROR -- : from /home/opc/ruby/src/master/tool/downloader.rb:247:in `block in download' E, [2024-05-11T08:12:15.040780 #796041] ERROR -- : from /home/opc/ruby/src/master/tool/downloader.rb:378:in `with_retry' E, [2024-05-11T08:12:15.040788 #796041] ERROR -- : from /home/opc/ruby/src/master/tool/downloader.rb:246:in `download' E, [2024-05-11T08:12:15.040796 #796041] ERROR -- : from /home/opc/ruby/src/master/tool/downloader.rb:136:in `download' E, [2024-05-11T08:12:15.040804 #796041] ERROR -- : from /home/opc/ruby/src/master/tool/downloader.rb:482:in `block in
' E, [2024-05-11T08:12:15.040813 #796041] ERROR -- : from /home/opc/ruby/src/master/tool/downloader.rb:465:in `each' E, [2024-05-11T08:12:15.040821 #796041] ERROR -- : from /home/opc/ruby/src/master/tool/downloader.rb:465:in `
' E, [2024-05-11T08:12:15.043583 #796041] ERROR -- : make: *** [uncommon.mk:1765: /home/opc/ruby/src/master/enc/unicode/data/emoji/15.0/emoji-zwj-sequences.txt] Error 1 E, [2024-05-11T08:12:15.043620 #796041] ERROR -- : make: *** Waiting for unfinished jobs.... E, [2024-05-11T08:12:15.068070 #796041] ERROR -- : /home/opc/ruby/src/master/tool/downloader.rb:302:in `rescue in download': failed to download emoji/15.0/emoji-test.txt (RuntimeError) E, [2024-05-11T08:12:15.068115 #796041] ERROR -- : OpenURI::HTTPError: 403 Forbidden: https://www.unicode.org/Public/emoji/15.0/emoji-test.txt E, [2024-05-11T08:12:15.068127 #796041] ERROR -- : from /home/opc/ruby/src/master/tool/downloader.rb:201:in `download' E, [2024-05-11T08:12:15.068136 #796041] ERROR -- : from /home/opc/ruby/src/master/tool/downloader.rb:136:in `download' E, [2024-05-11T08:12:15.068145 #796041] ERROR -- : from /home/opc/ruby/src/master/tool/downloader.rb:482:in `block in
' E, [2024-05-11T08:12:15.068153 #796041] ERROR -- : from /home/opc/ruby/src/master/tool/downloader.rb:465:in `each' E, [2024-05-11T08:12:15.068161 #796041] ERROR -- : from /home/opc/ruby/src/master/tool/downloader.rb:465:in `
' E, [2024-05-11T08:12:15.068169 #796041] ERROR -- : /usr/local/lib/ruby/3.2.0/open-uri.rb:369:in `open_http': 403 Forbidden (OpenURI::HTTPError) E, [2024-05-11T08:12:15.068178 #796041] ERROR -- : from /usr/local/lib/ruby/3.2.0/open-uri.rb:760:in `buffer_open' E, [2024-05-11T08:12:15.068186 #796041] ERROR -- : from /usr/local/lib/ruby/3.2.0/open-uri.rb:214:in `block in open_loop' E, [2024-05-11T08:12:15.068195 #796041] ERROR -- : from /usr/local/lib/ruby/3.2.0/open-uri.rb:212:in `catch' E, [2024-05-11T08:12:15.068203 #796041] ERROR -- : from /usr/local/lib/ruby/3.2.0/open-uri.rb:212:in `open_loop' E, [2024-05-11T08:12:15.068211 #796041] ERROR -- : from /usr/local/lib/ruby/3.2.0/open-uri.rb:153:in `open_uri' E, [2024-05-11T08:12:15.068219 #796041] ERROR -- : from /usr/local/lib/ruby/3.2.0/open-uri.rb:740:in `open' E, [2024-05-11T08:12:15.068227 #796041] ERROR -- : from /usr/local/lib/ruby/3.2.0/open-uri.rb:748:in `read' E, [2024-05-11T08:12:15.068235 #796041] ERROR -- : from /home/opc/ruby/src/master/tool/downloader.rb:247:in `block in download' E, [2024-05-11T08:12:15.068243 #796041] ERROR -- : from /home/opc/ruby/src/master/tool/downloader.rb:378:in `with_retry' E, [2024-05-11T08:12:15.068251 #796041] ERROR -- : from /home/opc/ruby/src/master/tool/downloader.rb:246:in `download' E, [2024-05-11T08:12:15.068259 #796041] ERROR -- : from /home/opc/ruby/src/master/tool/downloader.rb:136:in `download' E, [2024-05-11T08:12:15.068268 #796041] ERROR -- : from /home/opc/ruby/src/master/tool/downloader.rb:482:in `block in
' E, [2024-05-11T08:12:15.068276 #796041] ERROR -- : from /home/opc/ruby/src/master/tool/downloader.rb:465:in `each' E, [2024-05-11T08:12:15.068284 #796041] ERROR -- : from /home/opc/ruby/src/master/tool/downloader.rb:465:in `
' E, [2024-05-11T08:12:15.071089 #796041] ERROR -- : make: *** [uncommon.mk:1765: /home/opc/ruby/src/master/enc/unicode/data/emoji/15.0/emoji-test.txt] Error 1 E, [2024-05-11T08:12:15.139325 #796041] ERROR -- : /home/opc/ruby/src/master/tool/downloader.rb:302:in `rescue in download': failed to download emoji/15.0/emoji-test.txt (RuntimeError) E, [2024-05-11T08:12:15.139379 #796041] ERROR -- : OpenURI::HTTPError: 403 Forbidden: https://www.unicode.org/Public/emoji/15.0/emoji-test.txt E, [2024-05-11T08:12:15.139391 #796041] ERROR -- : from /home/opc/ruby/src/master/tool/downloader.rb:201:in `download' E, [2024-05-11T08:12:15.139401 #796041] ERROR -- : from /home/opc/ruby/src/master/tool/downloader.rb:136:in `download' E, [2024-05-11T08:12:15.139409 #796041] ERROR -- : from /home/opc/ruby/src/master/tool/downloader.rb:482:in `block in
' E, [2024-05-11T08:12:15.139417 #796041] ERROR -- : from /home/opc/ruby/src/master/tool/downloader.rb:465:in `each' E, [2024-05-11T08:12:15.139425 #796041] ERROR -- : from /home/opc/ruby/src/master/tool/downloader.rb:465:in `
' E, [2024-05-11T08:12:15.139434 #796041] ERROR -- : /usr/local/lib/ruby/3.2.0/open-uri.rb:369:in `open_http': 403 Forbidden (OpenURI::HTTPError) E, [2024-05-11T08:12:15.139442 #796041] ERROR -- : from /usr/local/lib/ruby/3.2.0/open-uri.rb:760:in `buffer_open' E, [2024-05-11T08:12:15.139450 #796041] ERROR -- : from /usr/local/lib/ruby/3.2.0/open-uri.rb:214:in `block in open_loop' E, [2024-05-11T08:12:15.139458 #796041] ERROR -- : from /usr/local/lib/ruby/3.2.0/open-uri.rb:212:in `catch' E, [2024-05-11T08:12:15.139466 #796041] ERROR -- : from /usr/local/lib/ruby/3.2.0/open-uri.rb:212:in `open_loop' E, [2024-05-11T08:12:15.139475 #796041] ERROR -- : from /usr/local/lib/ruby/3.2.0/open-uri.rb:153:in `open_uri' E, [2024-05-11T08:12:15.139483 #796041] ERROR -- : from /usr/local/lib/ruby/3.2.0/open-uri.rb:740:in `open' E, [2024-05-11T08:12:15.139491 #796041] ERROR -- : from /usr/local/lib/ruby/3.2.0/open-uri.rb:748:in `read' E, [2024-05-11T08:12:15.139499 #796041] ERROR -- : from /home/opc/ruby/src/master/tool/downloader.rb:247:in `block in download' E, [2024-05-11T08:12:15.139507 #796041] ERROR -- : from /home/opc/ruby/src/master/tool/downloader.rb:378:in `with_retry' E, [2024-05-11T08:12:15.139516 #796041] ERROR -- : from /home/opc/ruby/src/master/tool/downloader.rb:246:in `download' E, [2024-05-11T08:12:15.139524 #796041] ERROR -- : from /home/opc/ruby/src/master/tool/downloader.rb:136:in `download' E, [2024-05-11T08:12:15.139532 #796041] ERROR -- : from /home/opc/ruby/src/master/tool/downloader.rb:482:in `block in
' E, [2024-05-11T08:12:15.139540 #796041] ERROR -- : from /home/opc/ruby/src/master/tool/downloader.rb:465:in `each' E, [2024-05-11T08:12:15.139548 #796041] ERROR -- : from /home/opc/ruby/src/master/tool/downloader.rb:465:in `
' E, [2024-05-11T08:12:15.142377 #796041] ERROR -- : make: *** [uncommon.mk:1765: /home/opc/ruby/src/master/enc/unicode/data/emoji/15.0/emoji-sequences.txt] Error 1 E, [2024-05-11T08:12:15.142413 #796041] ERROR -- : make: *** Deleting file '/home/opc/ruby/src/master/enc/unicode/data/emoji/15.0/emoji-sequences.txt' I, [2024-05-11T08:12:15.142547 #796041] INFO -- : downloading emoji/15.0/emoji-test.txt ... I, [2024-05-11T08:12:15.142725 #796041] INFO -- : $$$[end] "make update-unicode -j3" exit with 512. I, [2024-05-11T08:12:15.142759 #796041] INFO -- : $$$[beg] make update-download -j3 I, [2024-05-11T08:12:15.304324 #796041] INFO -- : tool/config.guess already exists I, [2024-05-11T08:12:15.304394 #796041] INFO -- : tool/config.sub already exists I, [2024-05-11T08:12:15.307044 #796041] INFO -- : Update minitest to ea9caafc0754b1d6236a490d59e624b53209734a I, [2024-05-11T08:12:15.307150 #796041] INFO -- : Update power_assert to 84e85124c5014a139af39161d484156cfe87a9ed I, [2024-05-11T08:12:15.307450 #796041] INFO -- : Update rbs to ba7872795d5de04adb8ff500c0e6afdc81a041dd I, [2024-05-11T08:12:15.310505 #796041] INFO -- : echo ba7872795d5de04adb8ff500c0e6afdc81a041dd | /bin/sh /home/opc/ruby/src/master/tool/ifchange /home/opc/ruby/src/master/.bundle/.timestamp/rbs.revision - I, [2024-05-11T08:12:15.310758 #796041] INFO -- : echo ea9caafc0754b1d6236a490d59e624b53209734a | /bin/sh /home/opc/ruby/src/master/tool/ifchange /home/opc/ruby/src/master/.bundle/.timestamp/minitest.revision - I, [2024-05-11T08:12:15.310943 #796041] INFO -- : echo 84e85124c5014a139af39161d484156cfe87a9ed | /bin/sh /home/opc/ruby/src/master/tool/ifchange /home/opc/ruby/src/master/.bundle/.timestamp/power_assert.revision - I, [2024-05-11T08:12:15.316393 #796041] INFO -- : /home/opc/ruby/src/master/.bundle/.timestamp/minitest.revision unchanged I, [2024-05-11T08:12:15.316534 #796041] INFO -- : /home/opc/ruby/src/master/.bundle/.timestamp/rbs.revision unchanged I, [2024-05-11T08:12:15.316705 #796041] INFO -- : /home/opc/ruby/src/master/.bundle/.timestamp/power_assert.revision unchanged I, [2024-05-11T08:12:15.319575 #796041] INFO -- : Update typeprof to b19a6416da3a05d57fadd6ffdadb382b6d236ca5 I, [2024-05-11T08:12:15.327010 #796041] INFO -- : echo b19a6416da3a05d57fadd6ffdadb382b6d236ca5 | /bin/sh /home/opc/ruby/src/master/tool/ifchange /home/opc/ruby/src/master/.bundle/.timestamp/typeprof.revision - I, [2024-05-11T08:12:15.332453 #796041] INFO -- : /home/opc/ruby/src/master/.bundle/.timestamp/typeprof.revision unchanged I, [2024-05-11T08:12:15.404600 #796041] INFO -- : Building power_assert@84e85124c5014a139af39161d484156cfe87a9ed to /home/opc/ruby/src/master/gems/power_assert-2.0.3.gem I, [2024-05-11T08:12:15.513772 #796041] INFO -- : Successfully built RubyGem I, [2024-05-11T08:12:15.513832 #796041] INFO -- : Name: power_assert I, [2024-05-11T08:12:15.513843 #796041] INFO -- : Version: 2.0.4dev I, [2024-05-11T08:12:15.513851 #796041] INFO -- : File: power_assert-2.0.4dev.gem I, [2024-05-11T08:12:15.592528 #796041] INFO -- : $$$[end] "make update-download -j3" exit with 0. I, [2024-05-11T08:12:15.592596 #796041] INFO -- : $$$[beg] make update-rubyspec -j3 I, [2024-05-11T08:12:15.679896 #796041] INFO -- : make: Nothing to be done for 'update-rubyspec'. I, [2024-05-11T08:12:15.680112 #796041] INFO -- : $$$[end] "make update-rubyspec -j3" exit with 0. I, [2024-05-11T08:12:15.680160 #796041] INFO -- : $$$[beg] make update-src -j3 I, [2024-05-11T08:12:16.764585 #796041] INFO -- : Already up to date. I, [2024-05-11T08:12:16.779044 #796041] INFO -- : Latest commit hash = 68b6fe7048 I, [2024-05-11T08:12:16.779591 #796041] INFO -- : $$$[end] "make update-src -j3" exit with 0. I, [2024-05-11T08:12:16.779623 #796041] INFO -- : $$$[beg] make after-update -j3 I, [2024-05-11T08:12:16.881272 #796041] INFO -- : generating /home/opc/ruby/src/master/ext/ripper/eventids2table.c I, [2024-05-11T08:12:16.887569 #796041] INFO -- : make[1]: Entering directory '/home/opc/ruby/src/master/ext/ripper' I, [2024-05-11T08:12:16.887620 #796041] INFO -- : make[1]: Nothing to be done for 'src'. I, [2024-05-11T08:12:16.887632 #796041] INFO -- : make[1]: Leaving directory '/home/opc/ruby/src/master/ext/ripper' I, [2024-05-11T08:12:16.915405 #796041] INFO -- : /home/opc/ruby/src/master/revision.h updated I, [2024-05-11T08:12:16.916542 #796041] INFO -- : generating aarch64-linux-fake.rb I, [2024-05-11T08:12:16.974053 #796041] INFO -- : aarch64-linux-fake.rb updated I, [2024-05-11T08:12:16.975217 #796041] INFO -- : generating enc.mk I, [2024-05-11T08:12:17.202733 #796041] INFO -- : making srcs under enc I, [2024-05-11T08:12:17.244951 #796041] INFO -- : make[1]: Entering directory '/home/opc/ruby/build/master' I, [2024-05-11T08:12:17.245001 #796041] INFO -- : make[1]: Nothing to be done for 'srcs'. I, [2024-05-11T08:12:17.245012 #796041] INFO -- : make[1]: Leaving directory '/home/opc/ruby/build/master' I, [2024-05-11T08:12:17.324595 #796041] INFO -- : Update minitest to ea9caafc0754b1d6236a490d59e624b53209734a I, [2024-05-11T08:12:17.324714 #796041] INFO -- : Update power_assert to 84e85124c5014a139af39161d484156cfe87a9ed I, [2024-05-11T08:12:17.325110 #796041] INFO -- : Update rbs to ba7872795d5de04adb8ff500c0e6afdc81a041dd I, [2024-05-11T08:12:17.328034 #796041] INFO -- : echo ea9caafc0754b1d6236a490d59e624b53209734a | /bin/sh /home/opc/ruby/src/master/tool/ifchange /home/opc/ruby/src/master/.bundle/.timestamp/minitest.revision - I, [2024-05-11T08:12:17.328170 #796041] INFO -- : echo 84e85124c5014a139af39161d484156cfe87a9ed | /bin/sh /home/opc/ruby/src/master/tool/ifchange /home/opc/ruby/src/master/.bundle/.timestamp/power_assert.revision - I, [2024-05-11T08:12:17.328451 #796041] INFO -- : echo ba7872795d5de04adb8ff500c0e6afdc81a041dd | /bin/sh /home/opc/ruby/src/master/tool/ifchange /home/opc/ruby/src/master/.bundle/.timestamp/rbs.revision - I, [2024-05-11T08:12:17.333783 #796041] INFO -- : /home/opc/ruby/src/master/.bundle/.timestamp/rbs.revision unchanged I, [2024-05-11T08:12:17.333831 #796041] INFO -- : /home/opc/ruby/src/master/.bundle/.timestamp/power_assert.revision unchanged I, [2024-05-11T08:12:17.333842 #796041] INFO -- : /home/opc/ruby/src/master/.bundle/.timestamp/minitest.revision unchanged I, [2024-05-11T08:12:17.336286 #796041] INFO -- : Update typeprof to b19a6416da3a05d57fadd6ffdadb382b6d236ca5 I, [2024-05-11T08:12:17.342350 #796041] INFO -- : echo b19a6416da3a05d57fadd6ffdadb382b6d236ca5 | /bin/sh /home/opc/ruby/src/master/tool/ifchange /home/opc/ruby/src/master/.bundle/.timestamp/typeprof.revision - I, [2024-05-11T08:12:17.347601 #796041] INFO -- : /home/opc/ruby/src/master/.bundle/.timestamp/typeprof.revision unchanged I, [2024-05-11T08:12:17.431229 #796041] INFO -- : Building power_assert@84e85124c5014a139af39161d484156cfe87a9ed to /home/opc/ruby/src/master/gems/power_assert-2.0.3.gem I, [2024-05-11T08:12:17.540249 #796041] INFO -- : Successfully built RubyGem I, [2024-05-11T08:12:17.540310 #796041] INFO -- : Name: power_assert I, [2024-05-11T08:12:17.540321 #796041] INFO -- : Version: 2.0.4dev I, [2024-05-11T08:12:17.540330 #796041] INFO -- : File: power_assert-2.0.4dev.gem I, [2024-05-11T08:12:17.542596 #796041] INFO -- : Extracting bundle gem power_assert-2.0.3... I, [2024-05-11T08:12:17.640517 #796041] INFO -- : Try with hash version of bundled gems instead of gems/power_assert-2.0.3.gem. We don't use this gem with release version of Ruby. I, [2024-05-11T08:12:17.650653 #796041] INFO -- : Unpacked gems/power_assert-2.0.4dev.gem I, [2024-05-11T08:12:17.652400 #796041] INFO -- : $$$[end] "make after-update -j3" exit with 0. I, [2024-05-11T08:12:17.652567 #796041] INFO -- : $$$[beg] make miniruby -j3 I, [2024-05-11T08:12:17.740389 #796041] INFO -- : BASERUBY = /usr/local/bin/ruby --disable=gems I, [2024-05-11T08:12:17.740454 #796041] INFO -- : CC = gcc I, [2024-05-11T08:12:17.740465 #796041] INFO -- : LD = ld I, [2024-05-11T08:12:17.740475 #796041] INFO -- : LDSHARED = gcc -shared I, [2024-05-11T08:12:17.740506 #796041] INFO -- : CFLAGS = -O3 -fno-fast-math -ggdb3 -Wall -Wextra -Wdeprecated-declarations -Wdiv-by-zero -Wduplicated-cond -Wimplicit-function-declaration -Wimplicit-int -Wpointer-arith -Wwrite-strings -Wold-style-definition -Wimplicit-fallthrough=0 -Wmissing-noreturn -Wno-cast-function-type -Wno-constant-logical-operand -Wno-long-long -Wno-missing-field-initializers -Wno-overlength-strings -Wno-packed-bitfield-compat -Wno-parentheses-equality -Wno-self-assign -Wno-tautological-compare -Wno-unused-parameter -Wno-unused-value -Wsuggest-attribute=format -Wsuggest-attribute=noreturn -Wunused-variable -Wmisleading-indentation -Wundef I, [2024-05-11T08:12:17.740523 #796041] INFO -- : XCFLAGS = -U_FORTIFY_SOURCE -D_FORTIFY_SOURCE=2 -fstack-protector-strong -msign-return-address=all -fno-strict-overflow -fvisibility=hidden -fexcess-precision=standard -DRUBY_EXPORT -fPIE -I. -I.ext/include/aarch64-linux -I/home/opc/ruby/src/master/include -I/home/opc/ruby/src/master -I/home/opc/ruby/src/master/prism -I/home/opc/ruby/src/master/enc/unicode/15.0.0 I, [2024-05-11T08:12:17.740533 #796041] INFO -- : CPPFLAGS = I, [2024-05-11T08:12:17.740541 #796041] INFO -- : DLDFLAGS = -Wl,--compress-debug-sections=zlib -fstack-protector-strong -pie I, [2024-05-11T08:12:17.740550 #796041] INFO -- : SOLIBS = -lz -lrt -lrt -ldl -lcrypt -lm -lpthread I, [2024-05-11T08:12:17.740558 #796041] INFO -- : LANG = en_US.UTF-8 I, [2024-05-11T08:12:17.740591 #796041] INFO -- : LC_ALL = I, [2024-05-11T08:12:17.740599 #796041] INFO -- : LC_CTYPE = I, [2024-05-11T08:12:17.740607 #796041] INFO -- : MFLAGS = -j3 --jobserver-auth=4,5 I, [2024-05-11T08:12:17.740614 #796041] INFO -- : RUSTC = rustc I, [2024-05-11T08:12:17.740623 #796041] INFO -- : YJIT_RUSTC_ARGS = --crate-name=yjit --crate-type=staticlib --edition=2021 -g -C lto=thin -C opt-level=3 -C overflow-checks=on '--out-dir=/home/opc/ruby/build/master/yjit/target/release/' /home/opc/ruby/src/master/yjit/src/lib.rs I, [2024-05-11T08:12:17.741376 #796041] INFO -- : gcc (GCC) 8.5.0 20210514 (Red Hat 8.5.0-10.1.0.1) I, [2024-05-11T08:12:17.741411 #796041] INFO -- : Copyright (C) 2018 Free Software Foundation, Inc. I, [2024-05-11T08:12:17.741421 #796041] INFO -- : This is free software; see the source for copying conditions. There is NO I, [2024-05-11T08:12:17.741430 #796041] INFO -- : warranty; not even for MERCHANTABILITY or FITNESS FOR A PARTICULAR PURPOSE. I, [2024-05-11T08:12:17.741439 #796041] INFO -- : I, [2024-05-11T08:12:17.766384 #796041] INFO -- : compiling /home/opc/ruby/src/master/version.c I, [2024-05-11T08:12:17.904658 #796041] INFO -- : linking miniruby I, [2024-05-11T08:12:18.783002 #796041] INFO -- : $$$[end] "make miniruby -j3" exit with 0. I, [2024-05-11T08:12:18.783166 #796041] INFO -- : $$$[beg] make ruby -j3 I, [2024-05-11T08:12:18.871385 #796041] INFO -- : BASERUBY = /usr/local/bin/ruby --disable=gems I, [2024-05-11T08:12:18.871469 #796041] INFO -- : CC = gcc I, [2024-05-11T08:12:18.871481 #796041] INFO -- : LD = ld I, [2024-05-11T08:12:18.871491 #796041] INFO -- : LDSHARED = gcc -shared I, [2024-05-11T08:12:18.871502 #796041] INFO -- : CFLAGS = -O3 -fno-fast-math -ggdb3 -Wall -Wextra -Wdeprecated-declarations -Wdiv-by-zero -Wduplicated-cond -Wimplicit-function-declaration -Wimplicit-int -Wpointer-arith -Wwrite-strings -Wold-style-definition -Wimplicit-fallthrough=0 -Wmissing-noreturn -Wno-cast-function-type -Wno-constant-logical-operand -Wno-long-long -Wno-missing-field-initializers -Wno-overlength-strings -Wno-packed-bitfield-compat -Wno-parentheses-equality -Wno-self-assign -Wno-tautological-compare -Wno-unused-parameter -Wno-unused-value -Wsuggest-attribute=format -Wsuggest-attribute=noreturn -Wunused-variable -Wmisleading-indentation -Wundef I, [2024-05-11T08:12:18.871512 #796041] INFO -- : XCFLAGS = -U_FORTIFY_SOURCE -D_FORTIFY_SOURCE=2 -fstack-protector-strong -msign-return-address=all -fno-strict-overflow -fvisibility=hidden -fexcess-precision=standard -DRUBY_EXPORT -fPIE -I. -I.ext/include/aarch64-linux -I/home/opc/ruby/src/master/include -I/home/opc/ruby/src/master -I/home/opc/ruby/src/master/prism -I/home/opc/ruby/src/master/enc/unicode/15.0.0 I, [2024-05-11T08:12:18.871520 #796041] INFO -- : CPPFLAGS = I, [2024-05-11T08:12:18.871529 #796041] INFO -- : DLDFLAGS = -Wl,--compress-debug-sections=zlib -fstack-protector-strong -pie I, [2024-05-11T08:12:18.871538 #796041] INFO -- : SOLIBS = -lz -lrt -lrt -ldl -lcrypt -lm -lpthread I, [2024-05-11T08:12:18.871546 #796041] INFO -- : LANG = en_US.UTF-8 I, [2024-05-11T08:12:18.871554 #796041] INFO -- : LC_ALL = I, [2024-05-11T08:12:18.871562 #796041] INFO -- : LC_CTYPE = I, [2024-05-11T08:12:18.871570 #796041] INFO -- : MFLAGS = -j3 --jobserver-auth=4,5 I, [2024-05-11T08:12:18.871578 #796041] INFO -- : RUSTC = rustc I, [2024-05-11T08:12:18.871586 #796041] INFO -- : YJIT_RUSTC_ARGS = --crate-name=yjit --crate-type=staticlib --edition=2021 -g -C lto=thin -C opt-level=3 -C overflow-checks=on '--out-dir=/home/opc/ruby/build/master/yjit/target/release/' /home/opc/ruby/src/master/yjit/src/lib.rs I, [2024-05-11T08:12:18.872281 #796041] INFO -- : gcc (GCC) 8.5.0 20210514 (Red Hat 8.5.0-10.1.0.1) I, [2024-05-11T08:12:18.872316 #796041] INFO -- : Copyright (C) 2018 Free Software Foundation, Inc. I, [2024-05-11T08:12:18.872326 #796041] INFO -- : This is free software; see the source for copying conditions. There is NO I, [2024-05-11T08:12:18.872339 #796041] INFO -- : warranty; not even for MERCHANTABILITY or FITNESS FOR A PARTICULAR PURPOSE. I, [2024-05-11T08:12:18.872347 #796041] INFO -- : I, [2024-05-11T08:12:19.049860 #796041] INFO -- : builtin_binary.inc updated I, [2024-05-11T08:12:19.054469 #796041] INFO -- : c5234a9416e4f20f175185e840b25b0f08674d14078ed7083f37e655458e3ca9 builtin_binary.inc I, [2024-05-11T08:12:19.055350 #796041] INFO -- : compiling /home/opc/ruby/src/master/builtin.c I, [2024-05-11T08:12:19.379923 #796041] INFO -- : linking static-library libruby-static.a I, [2024-05-11T08:12:22.035821 #796041] INFO -- : linking ruby I, [2024-05-11T08:12:22.963902 #796041] INFO -- : $$$[end] "make ruby -j3" exit with 0. I, [2024-05-11T08:12:22.964068 #796041] INFO -- : $$$[beg] make all -j3 I, [2024-05-11T08:12:23.052516 #796041] INFO -- : BASERUBY = /usr/local/bin/ruby --disable=gems I, [2024-05-11T08:12:23.052585 #796041] INFO -- : CC = gcc I, [2024-05-11T08:12:23.052596 #796041] INFO -- : LD = ld I, [2024-05-11T08:12:23.052605 #796041] INFO -- : LDSHARED = gcc -shared I, [2024-05-11T08:12:23.052616 #796041] INFO -- : CFLAGS = -O3 -fno-fast-math -ggdb3 -Wall -Wextra -Wdeprecated-declarations -Wdiv-by-zero -Wduplicated-cond -Wimplicit-function-declaration -Wimplicit-int -Wpointer-arith -Wwrite-strings -Wold-style-definition -Wimplicit-fallthrough=0 -Wmissing-noreturn -Wno-cast-function-type -Wno-constant-logical-operand -Wno-long-long -Wno-missing-field-initializers -Wno-overlength-strings -Wno-packed-bitfield-compat -Wno-parentheses-equality -Wno-self-assign -Wno-tautological-compare -Wno-unused-parameter -Wno-unused-value -Wsuggest-attribute=format -Wsuggest-attribute=noreturn -Wunused-variable -Wmisleading-indentation -Wundef I, [2024-05-11T08:12:23.052626 #796041] INFO -- : XCFLAGS = -U_FORTIFY_SOURCE -D_FORTIFY_SOURCE=2 -fstack-protector-strong -msign-return-address=all -fno-strict-overflow -fvisibility=hidden -fexcess-precision=standard -DRUBY_EXPORT -fPIE -I. -I.ext/include/aarch64-linux -I/home/opc/ruby/src/master/include -I/home/opc/ruby/src/master -I/home/opc/ruby/src/master/prism -I/home/opc/ruby/src/master/enc/unicode/15.0.0 I, [2024-05-11T08:12:23.052635 #796041] INFO -- : CPPFLAGS = I, [2024-05-11T08:12:23.052643 #796041] INFO -- : DLDFLAGS = -Wl,--compress-debug-sections=zlib -fstack-protector-strong -pie I, [2024-05-11T08:12:23.052652 #796041] INFO -- : SOLIBS = -lz -lrt -lrt -ldl -lcrypt -lm -lpthread I, [2024-05-11T08:12:23.052660 #796041] INFO -- : LANG = en_US.UTF-8 I, [2024-05-11T08:12:23.052668 #796041] INFO -- : LC_ALL = I, [2024-05-11T08:12:23.052676 #796041] INFO -- : LC_CTYPE = I, [2024-05-11T08:12:23.052684 #796041] INFO -- : MFLAGS = -j3 --jobserver-auth=4,5 I, [2024-05-11T08:12:23.052692 #796041] INFO -- : RUSTC = rustc I, [2024-05-11T08:12:23.052700 #796041] INFO -- : YJIT_RUSTC_ARGS = --crate-name=yjit --crate-type=staticlib --edition=2021 -g -C lto=thin -C opt-level=3 -C overflow-checks=on '--out-dir=/home/opc/ruby/build/master/yjit/target/release/' /home/opc/ruby/src/master/yjit/src/lib.rs I, [2024-05-11T08:12:23.053409 #796041] INFO -- : gcc (GCC) 8.5.0 20210514 (Red Hat 8.5.0-10.1.0.1) I, [2024-05-11T08:12:23.053427 #796041] INFO -- : Copyright (C) 2018 Free Software Foundation, Inc. I, [2024-05-11T08:12:23.053437 #796041] INFO -- : This is free software; see the source for copying conditions. There is NO I, [2024-05-11T08:12:23.053445 #796041] INFO -- : warranty; not even for MERCHANTABILITY or FITNESS FOR A PARTICULAR PURPOSE. I, [2024-05-11T08:12:23.053453 #796041] INFO -- : I, [2024-05-11T08:12:23.087612 #796041] INFO -- : generating encdb.h I, [2024-05-11T08:12:23.089022 #796041] INFO -- : generating enc.mk I, [2024-05-11T08:12:23.126094 #796041] INFO -- : encdb.h unchanged I, [2024-05-11T08:12:23.330335 #796041] INFO -- : making srcs under enc I, [2024-05-11T08:12:23.330509 #796041] INFO -- : making enc I, [2024-05-11T08:12:23.358658 #796041] INFO -- : make[1]: Entering directory '/home/opc/ruby/build/master' I, [2024-05-11T08:12:23.358746 #796041] INFO -- : make[1]: Nothing to be done for 'enc'. I, [2024-05-11T08:12:23.358760 #796041] INFO -- : make[1]: Leaving directory '/home/opc/ruby/build/master' I, [2024-05-11T08:12:23.372179 #796041] INFO -- : make[1]: Entering directory '/home/opc/ruby/build/master' I, [2024-05-11T08:12:23.372230 #796041] INFO -- : make[1]: Nothing to be done for 'srcs'. I, [2024-05-11T08:12:23.372241 #796041] INFO -- : make[1]: Leaving directory '/home/opc/ruby/build/master' I, [2024-05-11T08:12:23.373145 #796041] INFO -- : generating transdb.h I, [2024-05-11T08:12:23.516387 #796041] INFO -- : transdb.h unchanged I, [2024-05-11T08:12:23.517898 #796041] INFO -- : generating makefiles ext/configure-ext.mk I, [2024-05-11T08:12:23.518069 #796041] INFO -- : making trans I, [2024-05-11T08:12:23.557667 #796041] INFO -- : ext/configure-ext.mk updated I, [2024-05-11T08:12:23.560908 #796041] INFO -- : make[1]: Entering directory '/home/opc/ruby/build/master' I, [2024-05-11T08:12:23.566311 #796041] INFO -- : make[1]: Entering directory '/home/opc/ruby/build/master' I, [2024-05-11T08:12:23.566360 #796041] INFO -- : make[1]: Nothing to be done for 'trans'. I, [2024-05-11T08:12:23.566373 #796041] INFO -- : make[1]: Leaving directory '/home/opc/ruby/build/master' I, [2024-05-11T08:12:24.246515 #796041] INFO -- : making encs I, [2024-05-11T08:12:24.284697 #796041] INFO -- : make[1]: Leaving directory '/home/opc/ruby/build/master' I, [2024-05-11T08:12:24.285407 #796041] INFO -- : generating makefile exts.mk I, [2024-05-11T08:12:24.302376 #796041] INFO -- : make[1]: Entering directory '/home/opc/ruby/build/master' I, [2024-05-11T08:12:24.302437 #796041] INFO -- : make[1]: Nothing to be done for 'encs'. I, [2024-05-11T08:12:24.302448 #796041] INFO -- : make[1]: Leaving directory '/home/opc/ruby/build/master' I, [2024-05-11T08:12:24.343468 #796041] INFO -- : exts.mk unchanged I, [2024-05-11T08:12:24.348299 #796041] INFO -- : make[1]: Entering directory '/home/opc/ruby/build/master' I, [2024-05-11T08:12:24.452826 #796041] INFO -- : make[2]: Entering directory '/home/opc/ruby/build/master/ext/coverage' I, [2024-05-11T08:12:24.455400 #796041] INFO -- : make[2]: Entering directory '/home/opc/ruby/build/master/ext/date' I, [2024-05-11T08:12:24.455531 #796041] INFO -- : make[2]: Entering directory '/home/opc/ruby/build/master/ext/digest' I, [2024-05-11T08:12:24.457388 #796041] INFO -- : make[2]: Leaving directory '/home/opc/ruby/build/master/ext/coverage' I, [2024-05-11T08:12:24.461114 #796041] INFO -- : make[2]: Leaving directory '/home/opc/ruby/build/master/ext/date' I, [2024-05-11T08:12:24.465730 #796041] INFO -- : make[2]: Leaving directory '/home/opc/ruby/build/master/ext/digest' I, [2024-05-11T08:12:24.470248 #796041] INFO -- : make[2]: Entering directory '/home/opc/ruby/build/master/ext/io/console' I, [2024-05-11T08:12:24.472874 #796041] INFO -- : make[2]: Entering directory '/home/opc/ruby/build/master/ext/fiddle' I, [2024-05-11T08:12:24.477248 #796041] INFO -- : make[2]: Leaving directory '/home/opc/ruby/build/master/ext/io/console' I, [2024-05-11T08:12:24.479001 #796041] INFO -- : make[2]: Entering directory '/home/opc/ruby/build/master/ext/json' I, [2024-05-11T08:12:24.480735 #796041] INFO -- : make[2]: Leaving directory '/home/opc/ruby/build/master/ext/fiddle' I, [2024-05-11T08:12:24.482737 #796041] INFO -- : make[2]: Entering directory '/home/opc/ruby/build/master/ext/monitor' I, [2024-05-11T08:12:24.486833 #796041] INFO -- : make[2]: Leaving directory '/home/opc/ruby/build/master/ext/json' I, [2024-05-11T08:12:24.486953 #796041] INFO -- : make[2]: Entering directory '/home/opc/ruby/build/master/ext/objspace' I, [2024-05-11T08:12:24.491368 #796041] INFO -- : make[2]: Leaving directory '/home/opc/ruby/build/master/ext/monitor' I, [2024-05-11T08:12:24.495188 #796041] INFO -- : make[2]: Leaving directory '/home/opc/ruby/build/master/ext/objspace' I, [2024-05-11T08:12:24.497231 #796041] INFO -- : make[2]: Entering directory '/home/opc/ruby/build/master/ext/pathname' I, [2024-05-11T08:12:24.501225 #796041] INFO -- : make[2]: Leaving directory '/home/opc/ruby/build/master/ext/pathname' I, [2024-05-11T08:12:24.501621 #796041] INFO -- : make[2]: Entering directory '/home/opc/ruby/build/master/ext/psych' I, [2024-05-11T08:12:24.505499 #796041] INFO -- : make[2]: Entering directory '/home/opc/ruby/build/master/ext/pty' I, [2024-05-11T08:12:24.508149 #796041] INFO -- : make[2]: Entering directory '/home/opc/ruby/build/master/ext/openssl' I, [2024-05-11T08:12:24.513725 #796041] INFO -- : make[2]: Leaving directory '/home/opc/ruby/build/master/ext/pty' I, [2024-05-11T08:12:24.520918 #796041] INFO -- : make[2]: Leaving directory '/home/opc/ruby/build/master/ext/psych' I, [2024-05-11T08:12:24.522809 #796041] INFO -- : make[2]: Entering directory '/home/opc/ruby/build/master/ext/rubyvm' I, [2024-05-11T08:12:24.526311 #796041] INFO -- : make[2]: Leaving directory '/home/opc/ruby/build/master/ext/rubyvm' I, [2024-05-11T08:12:24.526825 #796041] INFO -- : make[2]: Entering directory '/home/opc/ruby/build/master/ext/ripper' I, [2024-05-11T08:12:24.529409 #796041] INFO -- : make[2]: Leaving directory '/home/opc/ruby/build/master/ext/openssl' I, [2024-05-11T08:12:24.534763 #796041] INFO -- : make[2]: Leaving directory '/home/opc/ruby/build/master/ext/ripper' I, [2024-05-11T08:12:24.538952 #796041] INFO -- : make[2]: Entering directory '/home/opc/ruby/build/master/ext/socket' I, [2024-05-11T08:12:24.540412 #796041] INFO -- : make[2]: Entering directory '/home/opc/ruby/build/master/.bundle/gems/bigdecimal-3.1.7/ext/bigdecimal' I, [2024-05-11T08:12:24.541637 #796041] INFO -- : make[2]: Entering directory '/home/opc/ruby/build/master/.bundle/gems/bigdecimal-3.1.8/ext/bigdecimal' I, [2024-05-11T08:12:24.549914 #796041] INFO -- : make[2]: Leaving directory '/home/opc/ruby/build/master/ext/socket' I, [2024-05-11T08:12:24.552340 #796041] INFO -- : make[2]: Entering directory '/home/opc/ruby/build/master/.bundle/gems/debug-1.9.2/ext/debug' I, [2024-05-11T08:12:24.572251 #796041] INFO -- : make[2]: Leaving directory '/home/opc/ruby/build/master/.bundle/gems/bigdecimal-3.1.7/ext/bigdecimal' I, [2024-05-11T08:12:24.573254 #796041] INFO -- : make[2]: Leaving directory '/home/opc/ruby/build/master/.bundle/gems/bigdecimal-3.1.8/ext/bigdecimal' I, [2024-05-11T08:12:24.575304 #796041] INFO -- : make[2]: Entering directory '/home/opc/ruby/build/master/.bundle/gems/nkf-0.2.0/ext/nkf' I, [2024-05-11T08:12:24.575571 #796041] INFO -- : make[2]: Entering directory '/home/opc/ruby/build/master/.bundle/gems/racc-1.7.3/ext/racc/cparse' I, [2024-05-11T08:12:24.583504 #796041] INFO -- : make[2]: Leaving directory '/home/opc/ruby/build/master/.bundle/gems/debug-1.9.2/ext/debug' I, [2024-05-11T08:12:24.586444 #796041] INFO -- : make[2]: Entering directory '/home/opc/ruby/build/master/.bundle/gems/rbs-3.4.4/ext/rbs_extension' I, [2024-05-11T08:12:24.606629 #796041] INFO -- : make[2]: Leaving directory '/home/opc/ruby/build/master/.bundle/gems/racc-1.7.3/ext/racc/cparse' I, [2024-05-11T08:12:24.606689 #796041] INFO -- : make[2]: Leaving directory '/home/opc/ruby/build/master/.bundle/gems/nkf-0.2.0/ext/nkf' I, [2024-05-11T08:12:24.608946 #796041] INFO -- : make[2]: Entering directory '/home/opc/ruby/build/master/.bundle/gems/syslog-0.1.2/ext/syslog' I, [2024-05-11T08:12:24.619007 #796041] INFO -- : make[2]: Leaving directory '/home/opc/ruby/build/master/.bundle/gems/rbs-3.4.4/ext/rbs_extension' I, [2024-05-11T08:12:24.632255 #796041] INFO -- : make[2]: Entering directory '/home/opc/ruby/build/master/ext/digest/sha2' I, [2024-05-11T08:12:24.637321 #796041] INFO -- : make[2]: Leaving directory '/home/opc/ruby/build/master/ext/digest/sha2' I, [2024-05-11T08:12:24.638998 #796041] INFO -- : make[2]: Leaving directory '/home/opc/ruby/build/master/.bundle/gems/syslog-0.1.2/ext/syslog' I, [2024-05-11T08:12:24.676814 #796041] INFO -- : make[2]: Entering directory '/home/opc/ruby/build/master' I, [2024-05-11T08:12:24.759396 #796041] INFO -- : make[2]: 'ruby' is up to date. I, [2024-05-11T08:12:24.759470 #796041] INFO -- : make[2]: Leaving directory '/home/opc/ruby/build/master' I, [2024-05-11T08:12:24.759597 #796041] INFO -- : make[1]: Leaving directory '/home/opc/ruby/build/master' I, [2024-05-11T08:12:24.763940 #796041] INFO -- : make[1]: Entering directory '/home/opc/ruby/build/master' I, [2024-05-11T08:12:24.763987 #796041] INFO -- : make[1]: Nothing to be done for 'note'. I, [2024-05-11T08:12:24.763999 #796041] INFO -- : make[1]: Leaving directory '/home/opc/ruby/build/master' I, [2024-05-11T08:12:24.764601 #796041] INFO -- : $$$[end] "make all -j3" exit with 0. I, [2024-05-11T08:12:24.764740 #796041] INFO -- : $$$[beg] make install -j3 I, [2024-05-11T08:12:24.858732 #796041] INFO -- : Update minitest to ea9caafc0754b1d6236a490d59e624b53209734a I, [2024-05-11T08:12:24.858979 #796041] INFO -- : Update power_assert to 84e85124c5014a139af39161d484156cfe87a9ed I, [2024-05-11T08:12:24.859163 #796041] INFO -- : Update rbs to ba7872795d5de04adb8ff500c0e6afdc81a041dd I, [2024-05-11T08:12:24.861907 #796041] INFO -- : echo ea9caafc0754b1d6236a490d59e624b53209734a | /bin/sh /home/opc/ruby/src/master/tool/ifchange /home/opc/ruby/src/master/.bundle/.timestamp/minitest.revision - I, [2024-05-11T08:12:24.862125 #796041] INFO -- : echo 84e85124c5014a139af39161d484156cfe87a9ed | /bin/sh /home/opc/ruby/src/master/tool/ifchange /home/opc/ruby/src/master/.bundle/.timestamp/power_assert.revision - I, [2024-05-11T08:12:24.862242 #796041] INFO -- : echo ba7872795d5de04adb8ff500c0e6afdc81a041dd | /bin/sh /home/opc/ruby/src/master/tool/ifchange /home/opc/ruby/src/master/.bundle/.timestamp/rbs.revision - I, [2024-05-11T08:12:24.867058 #796041] INFO -- : /home/opc/ruby/src/master/.bundle/.timestamp/power_assert.revision unchanged I, [2024-05-11T08:12:24.868538 #796041] INFO -- : /home/opc/ruby/src/master/.bundle/.timestamp/rbs.revision unchanged I, [2024-05-11T08:12:24.868764 #796041] INFO -- : /home/opc/ruby/src/master/.bundle/.timestamp/minitest.revision unchanged I, [2024-05-11T08:12:24.869329 #796041] INFO -- : Update typeprof to b19a6416da3a05d57fadd6ffdadb382b6d236ca5 I, [2024-05-11T08:12:24.873836 #796041] INFO -- : BASERUBY = /usr/local/bin/ruby --disable=gems I, [2024-05-11T08:12:24.873892 #796041] INFO -- : CC = gcc I, [2024-05-11T08:12:24.873903 #796041] INFO -- : LD = ld I, [2024-05-11T08:12:24.873911 #796041] INFO -- : LDSHARED = gcc -shared I, [2024-05-11T08:12:24.873921 #796041] INFO -- : CFLAGS = -O3 -fno-fast-math -ggdb3 -Wall -Wextra -Wdeprecated-declarations -Wdiv-by-zero -Wduplicated-cond -Wimplicit-function-declaration -Wimplicit-int -Wpointer-arith -Wwrite-strings -Wold-style-definition -Wimplicit-fallthrough=0 -Wmissing-noreturn -Wno-cast-function-type -Wno-constant-logical-operand -Wno-long-long -Wno-missing-field-initializers -Wno-overlength-strings -Wno-packed-bitfield-compat -Wno-parentheses-equality -Wno-self-assign -Wno-tautological-compare -Wno-unused-parameter -Wno-unused-value -Wsuggest-attribute=format -Wsuggest-attribute=noreturn -Wunused-variable -Wmisleading-indentation -Wundef I, [2024-05-11T08:12:24.873930 #796041] INFO -- : XCFLAGS = -U_FORTIFY_SOURCE -D_FORTIFY_SOURCE=2 -fstack-protector-strong -msign-return-address=all -fno-strict-overflow -fvisibility=hidden -fexcess-precision=standard -DRUBY_EXPORT -fPIE -I. -I.ext/include/aarch64-linux -I/home/opc/ruby/src/master/include -I/home/opc/ruby/src/master -I/home/opc/ruby/src/master/prism -I/home/opc/ruby/src/master/enc/unicode/15.0.0 I, [2024-05-11T08:12:24.873938 #796041] INFO -- : CPPFLAGS = I, [2024-05-11T08:12:24.873946 #796041] INFO -- : DLDFLAGS = -Wl,--compress-debug-sections=zlib -fstack-protector-strong -pie I, [2024-05-11T08:12:24.873955 #796041] INFO -- : SOLIBS = -lz -lrt -lrt -ldl -lcrypt -lm -lpthread I, [2024-05-11T08:12:24.873962 #796041] INFO -- : LANG = en_US.UTF-8 I, [2024-05-11T08:12:24.873970 #796041] INFO -- : LC_ALL = I, [2024-05-11T08:12:24.873978 #796041] INFO -- : LC_CTYPE = I, [2024-05-11T08:12:24.873985 #796041] INFO -- : MFLAGS = -j3 --jobserver-auth=4,5 I, [2024-05-11T08:12:24.873993 #796041] INFO -- : RUSTC = rustc I, [2024-05-11T08:12:24.874004 #796041] INFO -- : YJIT_RUSTC_ARGS = --crate-name=yjit --crate-type=staticlib --edition=2021 -g -C lto=thin -C opt-level=3 -C overflow-checks=on '--out-dir=/home/opc/ruby/build/master/yjit/target/release/' /home/opc/ruby/src/master/yjit/src/lib.rs I, [2024-05-11T08:12:24.903152 #796041] INFO -- : echo b19a6416da3a05d57fadd6ffdadb382b6d236ca5 | /bin/sh /home/opc/ruby/src/master/tool/ifchange /home/opc/ruby/src/master/.bundle/.timestamp/typeprof.revision - I, [2024-05-11T08:12:24.904063 #796041] INFO -- : gcc (GCC) 8.5.0 20210514 (Red Hat 8.5.0-10.1.0.1) I, [2024-05-11T08:12:24.904098 #796041] INFO -- : Copyright (C) 2018 Free Software Foundation, Inc. I, [2024-05-11T08:12:24.904107 #796041] INFO -- : This is free software; see the source for copying conditions. There is NO I, [2024-05-11T08:12:24.904117 #796041] INFO -- : warranty; not even for MERCHANTABILITY or FITNESS FOR A PARTICULAR PURPOSE. I, [2024-05-11T08:12:24.904125 #796041] INFO -- : I, [2024-05-11T08:12:24.904692 #796041] INFO -- : generating encdb.h I, [2024-05-11T08:12:24.906524 #796041] INFO -- : generating enc.mk I, [2024-05-11T08:12:24.910207 #796041] INFO -- : /home/opc/ruby/src/master/.bundle/.timestamp/typeprof.revision unchanged I, [2024-05-11T08:12:24.941860 #796041] INFO -- : encdb.h unchanged I, [2024-05-11T08:12:25.038170 #796041] INFO -- : Building power_assert@84e85124c5014a139af39161d484156cfe87a9ed to /home/opc/ruby/src/master/gems/power_assert-2.0.3.gem I, [2024-05-11T08:12:25.142815 #796041] INFO -- : making srcs under enc I, [2024-05-11T08:12:25.142875 #796041] INFO -- : making enc I, [2024-05-11T08:12:25.153339 #796041] INFO -- : Successfully built RubyGem I, [2024-05-11T08:12:25.153384 #796041] INFO -- : Name: power_assert I, [2024-05-11T08:12:25.153394 #796041] INFO -- : Version: 2.0.4dev I, [2024-05-11T08:12:25.153403 #796041] INFO -- : File: power_assert-2.0.4dev.gem I, [2024-05-11T08:12:25.158986 #796041] INFO -- : Extracting bundle gem power_assert-2.0.3... I, [2024-05-11T08:12:25.170734 #796041] INFO -- : make[1]: Entering directory '/home/opc/ruby/build/master' I, [2024-05-11T08:12:25.170781 #796041] INFO -- : make[1]: Nothing to be done for 'enc'. I, [2024-05-11T08:12:25.170791 #796041] INFO -- : make[1]: Leaving directory '/home/opc/ruby/build/master' I, [2024-05-11T08:12:25.184675 #796041] INFO -- : make[1]: Entering directory '/home/opc/ruby/build/master' I, [2024-05-11T08:12:25.184721 #796041] INFO -- : make[1]: Nothing to be done for 'srcs'. I, [2024-05-11T08:12:25.184732 #796041] INFO -- : make[1]: Leaving directory '/home/opc/ruby/build/master' I, [2024-05-11T08:12:25.185639 #796041] INFO -- : generating transdb.h I, [2024-05-11T08:12:25.255988 #796041] INFO -- : Try with hash version of bundled gems instead of gems/power_assert-2.0.3.gem. We don't use this gem with release version of Ruby. I, [2024-05-11T08:12:25.265940 #796041] INFO -- : Unpacked gems/power_assert-2.0.4dev.gem I, [2024-05-11T08:12:25.328337 #796041] INFO -- : transdb.h unchanged I, [2024-05-11T08:12:25.329693 #796041] INFO -- : generating makefiles ext/configure-ext.mk I, [2024-05-11T08:12:25.329833 #796041] INFO -- : making trans I, [2024-05-11T08:12:25.368216 #796041] INFO -- : ext/configure-ext.mk unchanged I, [2024-05-11T08:12:25.371176 #796041] INFO -- : make[1]: Entering directory '/home/opc/ruby/build/master' I, [2024-05-11T08:12:25.377940 #796041] INFO -- : make[1]: Entering directory '/home/opc/ruby/build/master' I, [2024-05-11T08:12:25.378000 #796041] INFO -- : make[1]: Nothing to be done for 'trans'. I, [2024-05-11T08:12:25.378013 #796041] INFO -- : make[1]: Leaving directory '/home/opc/ruby/build/master' I, [2024-05-11T08:12:26.045573 #796041] INFO -- : making encs I, [2024-05-11T08:12:26.091442 #796041] INFO -- : make[1]: Leaving directory '/home/opc/ruby/build/master' I, [2024-05-11T08:12:26.092054 #796041] INFO -- : generating makefile exts.mk I, [2024-05-11T08:12:26.098552 #796041] INFO -- : make[1]: Entering directory '/home/opc/ruby/build/master' I, [2024-05-11T08:12:26.098598 #796041] INFO -- : make[1]: Nothing to be done for 'encs'. I, [2024-05-11T08:12:26.098610 #796041] INFO -- : make[1]: Leaving directory '/home/opc/ruby/build/master' I, [2024-05-11T08:12:26.150387 #796041] INFO -- : exts.mk unchanged I, [2024-05-11T08:12:26.155214 #796041] INFO -- : make[1]: Entering directory '/home/opc/ruby/build/master' I, [2024-05-11T08:12:26.258454 #796041] INFO -- : make[2]: Entering directory '/home/opc/ruby/build/master/ext/coverage' I, [2024-05-11T08:12:26.259750 #796041] INFO -- : make[2]: Entering directory '/home/opc/ruby/build/master/ext/digest' I, [2024-05-11T08:12:26.259824 #796041] INFO -- : make[2]: Entering directory '/home/opc/ruby/build/master/ext/date' I, [2024-05-11T08:12:26.262877 #796041] INFO -- : make[2]: Leaving directory '/home/opc/ruby/build/master/ext/coverage' I, [2024-05-11T08:12:26.265458 #796041] INFO -- : make[2]: Leaving directory '/home/opc/ruby/build/master/ext/date' I, [2024-05-11T08:12:26.268867 #796041] INFO -- : make[2]: Leaving directory '/home/opc/ruby/build/master/ext/digest' I, [2024-05-11T08:12:26.273837 #796041] INFO -- : make[2]: Entering directory '/home/opc/ruby/build/master/ext/io/console' I, [2024-05-11T08:12:26.276145 #796041] INFO -- : make[2]: Entering directory '/home/opc/ruby/build/master/ext/fiddle' I, [2024-05-11T08:12:26.278152 #796041] INFO -- : make[2]: Leaving directory '/home/opc/ruby/build/master/ext/io/console' I, [2024-05-11T08:12:26.280102 #796041] INFO -- : make[2]: Entering directory '/home/opc/ruby/build/master/ext/json' I, [2024-05-11T08:12:26.283539 #796041] INFO -- : make[2]: Entering directory '/home/opc/ruby/build/master/ext/monitor' I, [2024-05-11T08:12:26.286072 #796041] INFO -- : make[2]: Leaving directory '/home/opc/ruby/build/master/ext/monitor' I, [2024-05-11T08:12:26.286698 #796041] INFO -- : make[2]: Leaving directory '/home/opc/ruby/build/master/ext/fiddle' I, [2024-05-11T08:12:26.289883 #796041] INFO -- : make[2]: Leaving directory '/home/opc/ruby/build/master/ext/json' I, [2024-05-11T08:12:26.292252 #796041] INFO -- : make[2]: Entering directory '/home/opc/ruby/build/master/ext/objspace' I, [2024-05-11T08:12:26.293948 #796041] INFO -- : make[2]: Entering directory '/home/opc/ruby/build/master/ext/pathname' I, [2024-05-11T08:12:26.298037 #796041] INFO -- : make[2]: Leaving directory '/home/opc/ruby/build/master/ext/pathname' I, [2024-05-11T08:12:26.298947 #796041] INFO -- : make[2]: Leaving directory '/home/opc/ruby/build/master/ext/objspace' I, [2024-05-11T08:12:26.303192 #796041] INFO -- : make[2]: Entering directory '/home/opc/ruby/build/master/ext/pty' I, [2024-05-11T08:12:26.304331 #796041] INFO -- : make[2]: Entering directory '/home/opc/ruby/build/master/ext/psych' I, [2024-05-11T08:12:26.305619 #796041] INFO -- : make[2]: Entering directory '/home/opc/ruby/build/master/ext/openssl' I, [2024-05-11T08:12:26.309231 #796041] INFO -- : make[2]: Leaving directory '/home/opc/ruby/build/master/ext/pty' I, [2024-05-11T08:12:26.322502 #796041] INFO -- : make[2]: Entering directory '/home/opc/ruby/build/master/ext/ripper' I, [2024-05-11T08:12:26.325775 #796041] INFO -- : make[2]: Leaving directory '/home/opc/ruby/build/master/ext/psych' I, [2024-05-11T08:12:26.325947 #796041] INFO -- : make[2]: Leaving directory '/home/opc/ruby/build/master/ext/openssl' I, [2024-05-11T08:12:26.327628 #796041] INFO -- : make[2]: Entering directory '/home/opc/ruby/build/master/ext/rubyvm' I, [2024-05-11T08:12:26.330518 #796041] INFO -- : make[2]: Leaving directory '/home/opc/ruby/build/master/ext/ripper' I, [2024-05-11T08:12:26.331793 #796041] INFO -- : make[2]: Leaving directory '/home/opc/ruby/build/master/ext/rubyvm' I, [2024-05-11T08:12:26.338152 #796041] INFO -- : make[2]: Entering directory '/home/opc/ruby/build/master/ext/socket' I, [2024-05-11T08:12:26.338560 #796041] INFO -- : make[2]: Entering directory '/home/opc/ruby/build/master/.bundle/gems/bigdecimal-3.1.7/ext/bigdecimal' I, [2024-05-11T08:12:26.341770 #796041] INFO -- : make[2]: Entering directory '/home/opc/ruby/build/master/.bundle/gems/bigdecimal-3.1.8/ext/bigdecimal' I, [2024-05-11T08:12:26.351407 #796041] INFO -- : make[2]: Leaving directory '/home/opc/ruby/build/master/ext/socket' I, [2024-05-11T08:12:26.354300 #796041] INFO -- : make[2]: Entering directory '/home/opc/ruby/build/master/.bundle/gems/debug-1.9.2/ext/debug' I, [2024-05-11T08:12:26.369488 #796041] INFO -- : make[2]: Leaving directory '/home/opc/ruby/build/master/.bundle/gems/bigdecimal-3.1.7/ext/bigdecimal' I, [2024-05-11T08:12:26.373052 #796041] INFO -- : make[2]: Entering directory '/home/opc/ruby/build/master/.bundle/gems/nkf-0.2.0/ext/nkf' I, [2024-05-11T08:12:26.381311 #796041] INFO -- : make[2]: Leaving directory '/home/opc/ruby/build/master/.bundle/gems/bigdecimal-3.1.8/ext/bigdecimal' I, [2024-05-11T08:12:26.383581 #796041] INFO -- : make[2]: Entering directory '/home/opc/ruby/build/master/.bundle/gems/racc-1.7.3/ext/racc/cparse' I, [2024-05-11T08:12:26.390507 #796041] INFO -- : make[2]: Leaving directory '/home/opc/ruby/build/master/.bundle/gems/debug-1.9.2/ext/debug' I, [2024-05-11T08:12:26.393401 #796041] INFO -- : make[2]: Entering directory '/home/opc/ruby/build/master/.bundle/gems/rbs-3.4.4/ext/rbs_extension' I, [2024-05-11T08:12:26.404638 #796041] INFO -- : make[2]: Leaving directory '/home/opc/ruby/build/master/.bundle/gems/nkf-0.2.0/ext/nkf' I, [2024-05-11T08:12:26.407194 #796041] INFO -- : make[2]: Entering directory '/home/opc/ruby/build/master/.bundle/gems/syslog-0.1.2/ext/syslog' I, [2024-05-11T08:12:26.414906 #796041] INFO -- : make[2]: Leaving directory '/home/opc/ruby/build/master/.bundle/gems/racc-1.7.3/ext/racc/cparse' I, [2024-05-11T08:12:26.423956 #796041] INFO -- : make[2]: Leaving directory '/home/opc/ruby/build/master/.bundle/gems/rbs-3.4.4/ext/rbs_extension' I, [2024-05-11T08:12:26.434001 #796041] INFO -- : make[2]: Entering directory '/home/opc/ruby/build/master/ext/digest/sha2' I, [2024-05-11T08:12:26.438036 #796041] INFO -- : make[2]: Leaving directory '/home/opc/ruby/build/master/.bundle/gems/syslog-0.1.2/ext/syslog' I, [2024-05-11T08:12:26.438458 #796041] INFO -- : make[2]: Leaving directory '/home/opc/ruby/build/master/ext/digest/sha2' I, [2024-05-11T08:12:26.478085 #796041] INFO -- : make[2]: Entering directory '/home/opc/ruby/build/master' I, [2024-05-11T08:12:26.559880 #796041] INFO -- : make[2]: 'ruby' is up to date. I, [2024-05-11T08:12:26.559960 #796041] INFO -- : make[2]: Leaving directory '/home/opc/ruby/build/master' I, [2024-05-11T08:12:26.560081 #796041] INFO -- : make[1]: Leaving directory '/home/opc/ruby/build/master' I, [2024-05-11T08:12:26.564509 #796041] INFO -- : make[1]: Entering directory '/home/opc/ruby/build/master' I, [2024-05-11T08:12:26.564552 #796041] INFO -- : make[1]: Nothing to be done for 'note'. I, [2024-05-11T08:12:26.564563 #796041] INFO -- : make[1]: Leaving directory '/home/opc/ruby/build/master' I, [2024-05-11T08:12:26.564700 #796041] INFO -- : ./miniruby -I/home/opc/ruby/src/master/lib -I. -I.ext/common /home/opc/ruby/src/master/tool/runruby.rb --extout=.ext -- --disable-gems -r./aarch64-linux-fake /home/opc/ruby/src/master/tool/rbinstall.rb --make="make" --dest-dir="" --extout=".ext" --ext-build-dir="./ext" --mflags="-j3 --jobserver-auth=4,5" --make-flags=" -j3 --jobserver-auth=4,5" --data-mode=0644 --prog-mode=0755 --installed-list .installed.list --mantype="doc" --gnumake --install=all --exclude=doc I, [2024-05-11T08:12:26.712876 #796041] INFO -- : Installing to I, [2024-05-11T08:12:26.712948 #796041] INFO -- : installing binary commands: /home/opc/ruby/install/master/bin I, [2024-05-11T08:12:26.724551 #796041] INFO -- : installing base libraries: /home/opc/ruby/install/master/lib I, [2024-05-11T08:12:26.725041 #796041] INFO -- : installing arch files: /home/opc/ruby/install/master/lib/ruby/3.4.0+0/aarch64-linux I, [2024-05-11T08:12:26.725191 #796041] INFO -- : installing pkgconfig data: /home/opc/ruby/install/master/lib/pkgconfig I, [2024-05-11T08:12:26.725257 #796041] INFO -- : installing extension objects: /home/opc/ruby/install/master/lib/ruby/3.4.0+0/aarch64-linux I, [2024-05-11T08:12:26.737741 #796041] INFO -- : installing extension objects: /home/opc/ruby/install/master/lib/ruby/site_ruby/3.4.0+0/aarch64-linux I, [2024-05-11T08:12:26.737794 #796041] INFO -- : installing extension objects: /home/opc/ruby/install/master/lib/ruby/vendor_ruby/3.4.0+0/aarch64-linux I, [2024-05-11T08:12:26.737869 #796041] INFO -- : installing extension headers: /home/opc/ruby/install/master/include/ruby-3.4.0+0/aarch64-linux I, [2024-05-11T08:12:26.738149 #796041] INFO -- : installing extension scripts: /home/opc/ruby/install/master/lib/ruby/3.4.0+0 I, [2024-05-11T08:12:26.747268 #796041] INFO -- : installing extension scripts: /home/opc/ruby/install/master/lib/ruby/site_ruby/3.4.0+0 I, [2024-05-11T08:12:26.747312 #796041] INFO -- : installing extension scripts: /home/opc/ruby/install/master/lib/ruby/vendor_ruby/3.4.0+0 I, [2024-05-11T08:12:26.747334 #796041] INFO -- : installing extension headers: /home/opc/ruby/install/master/include/ruby-3.4.0+0/ruby I, [2024-05-11T08:12:26.747417 #796041] INFO -- : installing command scripts: /home/opc/ruby/install/master/bin I, [2024-05-11T08:12:26.747540 #796041] INFO -- : installing library scripts: /home/opc/ruby/install/master/lib/ruby/3.4.0+0 I, [2024-05-11T08:12:26.830769 #796041] INFO -- : installing common headers: /home/opc/ruby/install/master/include/ruby-3.4.0+0 I, [2024-05-11T08:12:26.846334 #796041] INFO -- : installing manpages: /home/opc/ruby/install/master/share/man/man1 I, [2024-05-11T08:12:26.846618 #796041] INFO -- : installing default gems from lib: /home/opc/ruby/install/master/lib/ruby/gems/3.4.0+0 I, [2024-05-11T08:12:26.886313 #796041] INFO -- : benchmark 0.3.0 I, [2024-05-11T08:12:26.899696 #796041] INFO -- : bundler 2.6.0.dev I, [2024-05-11T08:12:26.906495 #796041] INFO -- : cgi 0.4.1 I, [2024-05-11T08:12:26.907644 #796041] INFO -- : delegate 0.3.1 I, [2024-05-11T08:12:26.908752 #796041] INFO -- : did_you_mean 1.6.3 I, [2024-05-11T08:12:26.909922 #796041] INFO -- : english 0.8.0 I, [2024-05-11T08:12:26.911280 #796041] INFO -- : erb 4.0.4 I, [2024-05-11T08:12:26.913859 #796041] INFO -- : error_highlight 0.6.0 I, [2024-05-11T08:12:26.914958 #796041] INFO -- : fileutils 1.7.2 I, [2024-05-11T08:12:26.916061 #796041] INFO -- : find 0.2.0 I, [2024-05-11T08:12:26.917305 #796041] INFO -- : forwardable 1.3.3 I, [2024-05-11T08:12:26.918411 #796041] INFO -- : ipaddr 1.2.6 I, [2024-05-11T08:12:26.919492 #796041] INFO -- : irb 1.13.1 I, [2024-05-11T08:12:26.922187 #796041] INFO -- : logger 1.6.0 I, [2024-05-11T08:12:26.924726 #796041] INFO -- : net-http 0.4.1 I, [2024-05-11T08:12:26.926312 #796041] INFO -- : net-protocol 0.2.2 I, [2024-05-11T08:12:26.927460 #796041] INFO -- : open-uri 0.4.1 I, [2024-05-11T08:12:26.928654 #796041] INFO -- : open3 0.2.1 I, [2024-05-11T08:12:26.929820 #796041] INFO -- : optparse 0.5.0 I, [2024-05-11T08:12:26.930967 #796041] INFO -- : ostruct 0.6.0 I, [2024-05-11T08:12:26.932053 #796041] INFO -- : pp 0.5.0 I, [2024-05-11T08:12:26.933270 #796041] INFO -- : prettyprint 0.2.0 I, [2024-05-11T08:12:26.934397 #796041] INFO -- : prism 0.29.0 I, [2024-05-11T08:12:26.935597 #796041] INFO -- : pstore 0.1.3 I, [2024-05-11T08:12:26.936918 #796041] INFO -- : rdoc 6.6.3.1 I, [2024-05-11T08:12:26.940736 #796041] INFO -- : readline 0.0.4 I, [2024-05-11T08:12:26.941905 #796041] INFO -- : reline 0.5.6 I, [2024-05-11T08:12:26.943087 #796041] INFO -- : resolv 0.4.0 I, [2024-05-11T08:12:26.944204 #796041] INFO -- : ruby2_keywords 0.0.5 I, [2024-05-11T08:12:26.945382 #796041] INFO -- : securerandom 0.3.1 I, [2024-05-11T08:12:26.946507 #796041] INFO -- : set 1.1.0 I, [2024-05-11T08:12:26.947631 #796041] INFO -- : shellwords 0.2.0 I, [2024-05-11T08:12:26.948811 #796041] INFO -- : singleton 0.2.0 I, [2024-05-11T08:12:26.949965 #796041] INFO -- : syntax_suggest 2.0.0 I, [2024-05-11T08:12:26.954396 #796041] INFO -- : tempfile 0.2.1 I, [2024-05-11T08:12:26.955538 #796041] INFO -- : time 0.3.0 I, [2024-05-11T08:12:26.956707 #796041] INFO -- : timeout 0.4.1 I, [2024-05-11T08:12:26.957878 #796041] INFO -- : tmpdir 0.2.0 I, [2024-05-11T08:12:26.959027 #796041] INFO -- : tsort 0.2.0 I, [2024-05-11T08:12:26.960146 #796041] INFO -- : un 0.3.0 I, [2024-05-11T08:12:26.961340 #796041] INFO -- : uri 0.13.0 I, [2024-05-11T08:12:26.962485 #796041] INFO -- : weakref 0.1.3 I, [2024-05-11T08:12:26.963625 #796041] INFO -- : yaml 0.3.0 I, [2024-05-11T08:12:26.964750 #796041] INFO -- : installing default gems from ext: /home/opc/ruby/install/master/lib/ruby/gems/3.4.0+0 I, [2024-05-11T08:12:26.975748 #796041] INFO -- : date 3.3.4 I, [2024-05-11T08:12:26.976933 #796041] INFO -- : digest 3.1.1 I, [2024-05-11T08:12:26.978104 #796041] INFO -- : etc 1.4.3 I, [2024-05-11T08:12:26.979259 #796041] INFO -- : fcntl 1.1.0 I, [2024-05-11T08:12:26.980383 #796041] INFO -- : fiddle 1.1.3 I, [2024-05-11T08:12:26.981585 #796041] INFO -- : io-console 0.7.2 I, [2024-05-11T08:12:26.982690 #796041] INFO -- : io-nonblock 0.3.0 I, [2024-05-11T08:12:26.983796 #796041] INFO -- : io-wait 0.3.1 I, [2024-05-11T08:12:26.984984 #796041] INFO -- : json 2.7.2 I, [2024-05-11T08:12:26.986425 #796041] INFO -- : openssl 3.2.0 I, [2024-05-11T08:12:26.987978 #796041] INFO -- : pathname 0.3.0 I, [2024-05-11T08:12:26.989164 #796041] INFO -- : psych 5.1.2 I, [2024-05-11T08:12:26.990415 #796041] INFO -- : stringio 3.1.1 I, [2024-05-11T08:12:26.991594 #796041] INFO -- : strscan 3.1.1 I, [2024-05-11T08:12:26.992721 #796041] INFO -- : zlib 3.1.0 I, [2024-05-11T08:12:26.993696 #796041] INFO -- : installing bundled gems: /home/opc/ruby/install/master/lib/ruby/gems/3.4.0+0 I, [2024-05-11T08:12:26.994334 #796041] INFO -- : minitest 5.22.3 I, [2024-05-11T08:12:27.008380 #796041] INFO -- : rake 13.2.1 I, [2024-05-11T08:12:27.021758 #796041] INFO -- : test-unit 3.6.2 I, [2024-05-11T08:12:27.037815 #796041] INFO -- : rexml 3.2.6 I, [2024-05-11T08:12:27.051292 #796041] INFO -- : rss 0.3.0 I, [2024-05-11T08:12:27.060822 #796041] INFO -- : net-ftp 0.3.4 I, [2024-05-11T08:12:27.064448 #796041] INFO -- : net-imap 0.4.11 I, [2024-05-11T08:12:27.076024 #796041] INFO -- : net-pop 0.1.2 I, [2024-05-11T08:12:27.078915 #796041] INFO -- : net-smtp 0.5.0 I, [2024-05-11T08:12:27.082129 #796041] INFO -- : matrix 0.4.2 I, [2024-05-11T08:12:27.088015 #796041] INFO -- : prime 0.1.2 I, [2024-05-11T08:12:27.098635 #796041] INFO -- : rbs 3.4.4 I, [2024-05-11T08:12:27.203848 #796041] INFO -- : typeprof 0.21.11 I, [2024-05-11T08:12:27.211451 #796041] INFO -- : debug 1.9.2 I, [2024-05-11T08:12:27.220954 #796041] INFO -- : racc 1.7.3 I, [2024-05-11T08:12:27.230196 #796041] INFO -- : mutex_m 0.2.0 I, [2024-05-11T08:12:27.234031 #796041] INFO -- : getoptlong 0.2.1 I, [2024-05-11T08:12:27.238414 #796041] INFO -- : base64 0.2.0 I, [2024-05-11T08:12:27.241133 #796041] INFO -- : bigdecimal 3.1.8 I, [2024-05-11T08:12:27.246819 #796041] INFO -- : observer 0.1.2 I, [2024-05-11T08:12:27.249672 #796041] INFO -- : abbrev 0.1.2 I, [2024-05-11T08:12:27.252656 #796041] INFO -- : resolv-replace 0.1.1 I, [2024-05-11T08:12:27.255627 #796041] INFO -- : rinda 0.2.0 I, [2024-05-11T08:12:27.259008 #796041] INFO -- : drb 2.2.1 I, [2024-05-11T08:12:27.263487 #796041] INFO -- : nkf 0.2.0 I, [2024-05-11T08:12:27.270906 #796041] INFO -- : syslog 0.1.2 I, [2024-05-11T08:12:27.275249 #796041] INFO -- : csv 3.3.0 I, [2024-05-11T08:12:27.284037 #796041] INFO -- : installing bundled gem cache: /home/opc/ruby/install/master/lib/ruby/gems/3.4.0+0/cache I, [2024-05-11T08:12:27.286141 #796041] INFO -- : skipped bundled gems: I, [2024-05-11T08:12:27.286163 #796041] INFO -- : power_assert-2.0.4dev.gem not found in bundled_gems I, [2024-05-11T08:12:27.288846 #796041] INFO -- : $$$[end] "make install -j3" exit with 0. I, [2024-05-11T08:12:27.288988 #796041] INFO -- : $$$[beg] make yes-btest TESTOPTS='-q -j3' I, [2024-05-11T08:12:49.260269 #796041] INFO -- : PASS all 1936 tests E, [2024-05-11T08:12:49.262207 #796041] ERROR -- : I, [2024-05-11T08:12:49.262311 #796041] INFO -- : $$$[end] "make yes-btest TESTOPTS='-q -j3'" exit with 0. I, [2024-05-11T08:12:49.262443 #796041] INFO -- : $$$[beg] make yes-test-basic TESTS='-j3' I, [2024-05-11T08:12:49.355368 #796041] INFO -- : BASERUBY = /usr/local/bin/ruby --disable=gems I, [2024-05-11T08:12:49.355434 #796041] INFO -- : CC = gcc I, [2024-05-11T08:12:49.355445 #796041] INFO -- : LD = ld I, [2024-05-11T08:12:49.355454 #796041] INFO -- : LDSHARED = gcc -shared I, [2024-05-11T08:12:49.356934 #796041] INFO -- : CFLAGS = -O3 -fno-fast-math -ggdb3 -Wall -Wextra -Wdeprecated-declarations -Wdiv-by-zero -Wduplicated-cond -Wimplicit-function-declaration -Wimplicit-int -Wpointer-arith -Wwrite-strings -Wold-style-definition -Wimplicit-fallthrough=0 -Wmissing-noreturn -Wno-cast-function-type -Wno-constant-logical-operand -Wno-long-long -Wno-missing-field-initializers -Wno-overlength-strings -Wno-packed-bitfield-compat -Wno-parentheses-equality -Wno-self-assign -Wno-tautological-compare -Wno-unused-parameter -Wno-unused-value -Wsuggest-attribute=format -Wsuggest-attribute=noreturn -Wunused-variable -Wmisleading-indentation -Wundef I, [2024-05-11T08:12:49.356963 #796041] INFO -- : XCFLAGS = -U_FORTIFY_SOURCE -D_FORTIFY_SOURCE=2 -fstack-protector-strong -msign-return-address=all -fno-strict-overflow -fvisibility=hidden -fexcess-precision=standard -DRUBY_EXPORT -fPIE -I. -I.ext/include/aarch64-linux -I/home/opc/ruby/src/master/include -I/home/opc/ruby/src/master -I/home/opc/ruby/src/master/prism -I/home/opc/ruby/src/master/enc/unicode/15.0.0 I, [2024-05-11T08:12:49.356973 #796041] INFO -- : CPPFLAGS = I, [2024-05-11T08:12:49.356981 #796041] INFO -- : DLDFLAGS = -Wl,--compress-debug-sections=zlib -fstack-protector-strong -pie I, [2024-05-11T08:12:49.356989 #796041] INFO -- : SOLIBS = -lz -lrt -lrt -ldl -lcrypt -lm -lpthread I, [2024-05-11T08:12:49.356997 #796041] INFO -- : LANG = en_US.UTF-8 I, [2024-05-11T08:12:49.357004 #796041] INFO -- : LC_ALL = I, [2024-05-11T08:12:49.357012 #796041] INFO -- : LC_CTYPE = I, [2024-05-11T08:12:49.357020 #796041] INFO -- : MFLAGS = I, [2024-05-11T08:12:49.357027 #796041] INFO -- : RUSTC = rustc I, [2024-05-11T08:12:49.357035 #796041] INFO -- : YJIT_RUSTC_ARGS = --crate-name=yjit --crate-type=staticlib --edition=2021 -g -C lto=thin -C opt-level=3 -C overflow-checks=on '--out-dir=/home/opc/ruby/build/master/yjit/target/release/' /home/opc/ruby/src/master/yjit/src/lib.rs I, [2024-05-11T08:12:49.357043 #796041] INFO -- : gcc (GCC) 8.5.0 20210514 (Red Hat 8.5.0-10.1.0.1) I, [2024-05-11T08:12:49.357050 #796041] INFO -- : Copyright (C) 2018 Free Software Foundation, Inc. I, [2024-05-11T08:12:49.357058 #796041] INFO -- : This is free software; see the source for copying conditions. There is NO I, [2024-05-11T08:12:49.357066 #796041] INFO -- : warranty; not even for MERCHANTABILITY or FITNESS FOR A PARTICULAR PURPOSE. I, [2024-05-11T08:12:49.357108 #796041] INFO -- : I, [2024-05-11T08:12:49.512988 #796041] INFO -- : Checking leaked global symbols...none I, [2024-05-11T08:12:49.566438 #796041] INFO -- : /home/opc/ruby/src/master/basictest/test.rb:assignment ....................................................................................................................................................................................................................................................................................................................................................................................OK 372 I, [2024-05-11T08:12:49.566517 #796041] INFO -- : /home/opc/ruby/src/master/basictest/test.rb:condition ..OK 2 I, [2024-05-11T08:12:49.566529 #796041] INFO -- : /home/opc/ruby/src/master/basictest/test.rb:if/unless ...OK 3 I, [2024-05-11T08:12:49.566578 #796041] INFO -- : /home/opc/ruby/src/master/basictest/test.rb:case .....OK 5 I, [2024-05-11T08:12:49.567228 #796041] INFO -- : /home/opc/ruby/src/master/basictest/test.rb:while/until ........OK 8 I, [2024-05-11T08:12:49.567344 #796041] INFO -- : /home/opc/ruby/src/master/basictest/test.rb:exception ..........OK 10 I, [2024-05-11T08:12:49.567953 #796041] INFO -- : /home/opc/ruby/src/master/basictest/test.rb:array .......................................OK 39 I, [2024-05-11T08:12:49.568207 #796041] INFO -- : /home/opc/ruby/src/master/basictest/test.rb:hash ...........................OK 27 I, [2024-05-11T08:12:49.569858 #796041] INFO -- : /home/opc/ruby/src/master/basictest/test.rb:iterator ...........................................................................................................OK 107 I, [2024-05-11T08:12:49.570568 #796041] INFO -- : /home/opc/ruby/src/master/basictest/test.rb:float ................................................................................OK 80 I, [2024-05-11T08:12:49.574276 #796041] INFO -- : /home/opc/ruby/src/master/basictest/test.rb:bignum ...............................OK 31 I, [2024-05-11T08:12:49.575813 #796041] INFO -- : /home/opc/ruby/src/master/basictest/test.rb:string & char ..............................................................OK 62 I, [2024-05-11T08:12:49.575892 #796041] INFO -- : /home/opc/ruby/src/master/basictest/test.rb:assignment ..........OK 10 I, [2024-05-11T08:12:49.575963 #796041] INFO -- : /home/opc/ruby/src/master/basictest/test.rb:call ......OK 6 I, [2024-05-11T08:12:49.576090 #796041] INFO -- : /home/opc/ruby/src/master/basictest/test.rb:proc .........OK 9 I, [2024-05-11T08:12:49.676455 #796041] INFO -- : /home/opc/ruby/src/master/basictest/test.rb:signal ..OK 2 I, [2024-05-11T08:12:49.678216 #796041] INFO -- : /home/opc/ruby/src/master/basictest/test.rb:eval ...........................OK 27 I, [2024-05-11T08:12:49.812106 #796041] INFO -- : /home/opc/ruby/src/master/basictest/test.rb:system ........OK 8 I, [2024-05-11T08:12:49.812191 #796041] INFO -- : /home/opc/ruby/src/master/basictest/test.rb:const .....OK 5 I, [2024-05-11T08:12:49.812305 #796041] INFO -- : /home/opc/ruby/src/master/basictest/test.rb:clone .....OK 5 I, [2024-05-11T08:12:49.812569 #796041] INFO -- : /home/opc/ruby/src/master/basictest/test.rb:marshal ....OK 4 I, [2024-05-11T08:12:49.812645 #796041] INFO -- : /home/opc/ruby/src/master/basictest/test.rb:pack ....OK 4 I, [2024-05-11T08:12:49.812677 #796041] INFO -- : /home/opc/ruby/src/master/basictest/test.rb:math ..OK 2 I, [2024-05-11T08:12:49.812767 #796041] INFO -- : /home/opc/ruby/src/master/basictest/test.rb:struct ......OK 6 I, [2024-05-11T08:12:49.812931 #796041] INFO -- : /home/opc/ruby/src/master/basictest/test.rb:variable ............OK 12 I, [2024-05-11T08:12:49.812971 #796041] INFO -- : /home/opc/ruby/src/master/basictest/test.rb:trace ...OK 3 I, [2024-05-11T08:12:49.813130 #796041] INFO -- : /home/opc/ruby/src/master/basictest/test.rb:defined? ............OK 12 I, [2024-05-11T08:12:49.813217 #796041] INFO -- : /home/opc/ruby/src/master/basictest/test.rb:alias ......OK 6 I, [2024-05-11T08:12:49.813736 #796041] INFO -- : /home/opc/ruby/src/master/basictest/test.rb:path .......................OK 23 I, [2024-05-11T08:12:49.881625 #796041] INFO -- : /home/opc/ruby/src/master/basictest/test.rb:gc ....OK 4 I, [2024-05-11T08:12:49.883680 #796041] INFO -- : I, [2024-05-11T08:12:49.883708 #796041] INFO -- : test succeeded I, [2024-05-11T08:12:49.884470 #796041] INFO -- : $$$[end] "make yes-test-basic TESTS='-j3'" exit with 0. I, [2024-05-11T08:12:49.884710 #796041] INFO -- : $$$[beg] make yes-test-all TESTOPTS='--stderr-on-failure' TESTS='-j3' I, [2024-05-11T08:12:50.008161 #796041] INFO -- : BASERUBY = /usr/local/bin/ruby --disable=gems I, [2024-05-11T08:12:50.008238 #796041] INFO -- : CC = gcc I, [2024-05-11T08:12:50.008251 #796041] INFO -- : LD = ld I, [2024-05-11T08:12:50.008260 #796041] INFO -- : LDSHARED = gcc -shared I, [2024-05-11T08:12:50.008272 #796041] INFO -- : CFLAGS = -O3 -fno-fast-math -ggdb3 -Wall -Wextra -Wdeprecated-declarations -Wdiv-by-zero -Wduplicated-cond -Wimplicit-function-declaration -Wimplicit-int -Wpointer-arith -Wwrite-strings -Wold-style-definition -Wimplicit-fallthrough=0 -Wmissing-noreturn -Wno-cast-function-type -Wno-constant-logical-operand -Wno-long-long -Wno-missing-field-initializers -Wno-overlength-strings -Wno-packed-bitfield-compat -Wno-parentheses-equality -Wno-self-assign -Wno-tautological-compare -Wno-unused-parameter -Wno-unused-value -Wsuggest-attribute=format -Wsuggest-attribute=noreturn -Wunused-variable -Wmisleading-indentation -Wundef I, [2024-05-11T08:12:50.008281 #796041] INFO -- : XCFLAGS = -U_FORTIFY_SOURCE -D_FORTIFY_SOURCE=2 -fstack-protector-strong -msign-return-address=all -fno-strict-overflow -fvisibility=hidden -fexcess-precision=standard -DRUBY_EXPORT -fPIE -I. -I.ext/include/aarch64-linux -I/home/opc/ruby/src/master/include -I/home/opc/ruby/src/master -I/home/opc/ruby/src/master/prism -I/home/opc/ruby/src/master/enc/unicode/15.0.0 I, [2024-05-11T08:12:50.008290 #796041] INFO -- : CPPFLAGS = I, [2024-05-11T08:12:50.008299 #796041] INFO -- : DLDFLAGS = -Wl,--compress-debug-sections=zlib -fstack-protector-strong -pie I, [2024-05-11T08:12:50.008308 #796041] INFO -- : SOLIBS = -lz -lrt -lrt -ldl -lcrypt -lm -lpthread I, [2024-05-11T08:12:50.008318 #796041] INFO -- : LANG = en_US.UTF-8 I, [2024-05-11T08:12:50.008326 #796041] INFO -- : LC_ALL = I, [2024-05-11T08:12:50.008333 #796041] INFO -- : LC_CTYPE = I, [2024-05-11T08:12:50.008342 #796041] INFO -- : MFLAGS = I, [2024-05-11T08:12:50.008350 #796041] INFO -- : RUSTC = rustc I, [2024-05-11T08:12:50.008358 #796041] INFO -- : YJIT_RUSTC_ARGS = --crate-name=yjit --crate-type=staticlib --edition=2021 -g -C lto=thin -C opt-level=3 -C overflow-checks=on '--out-dir=/home/opc/ruby/build/master/yjit/target/release/' /home/opc/ruby/src/master/yjit/src/lib.rs I, [2024-05-11T08:12:50.009163 #796041] INFO -- : gcc (GCC) 8.5.0 20210514 (Red Hat 8.5.0-10.1.0.1) I, [2024-05-11T08:12:50.009207 #796041] INFO -- : Copyright (C) 2018 Free Software Foundation, Inc. I, [2024-05-11T08:12:50.009217 #796041] INFO -- : This is free software; see the source for copying conditions. There is NO I, [2024-05-11T08:12:50.009227 #796041] INFO -- : warranty; not even for MERCHANTABILITY or FITNESS FOR A PARTICULAR PURPOSE. I, [2024-05-11T08:12:50.009236 #796041] INFO -- : I, [2024-05-11T08:12:50.011249 #796041] INFO -- : generating enc.mk I, [2024-05-11T08:12:50.253824 #796041] INFO -- : generating encdb.h I, [2024-05-11T08:12:50.293662 #796041] INFO -- : encdb.h unchanged I, [2024-05-11T08:12:50.294913 #796041] INFO -- : making enc I, [2024-05-11T08:12:50.322384 #796041] INFO -- : make[1]: Entering directory '/home/opc/ruby/build/master' I, [2024-05-11T08:12:50.322438 #796041] INFO -- : make[1]: Nothing to be done for 'enc'. I, [2024-05-11T08:12:50.322449 #796041] INFO -- : make[1]: Leaving directory '/home/opc/ruby/build/master' I, [2024-05-11T08:12:50.323122 #796041] INFO -- : making srcs under enc I, [2024-05-11T08:12:50.364860 #796041] INFO -- : make[1]: Entering directory '/home/opc/ruby/build/master' I, [2024-05-11T08:12:50.364932 #796041] INFO -- : make[1]: Nothing to be done for 'srcs'. I, [2024-05-11T08:12:50.364944 #796041] INFO -- : make[1]: Leaving directory '/home/opc/ruby/build/master' I, [2024-05-11T08:12:50.366259 #796041] INFO -- : generating transdb.h I, [2024-05-11T08:12:50.510298 #796041] INFO -- : transdb.h unchanged I, [2024-05-11T08:12:50.511602 #796041] INFO -- : making trans I, [2024-05-11T08:12:50.559755 #796041] INFO -- : make[1]: Entering directory '/home/opc/ruby/build/master' I, [2024-05-11T08:12:50.559822 #796041] INFO -- : make[1]: Nothing to be done for 'trans'. I, [2024-05-11T08:12:50.559833 #796041] INFO -- : make[1]: Leaving directory '/home/opc/ruby/build/master' I, [2024-05-11T08:12:50.560566 #796041] INFO -- : making encs I, [2024-05-11T08:12:50.612943 #796041] INFO -- : make[1]: Entering directory '/home/opc/ruby/build/master' I, [2024-05-11T08:12:50.613009 #796041] INFO -- : make[1]: Nothing to be done for 'encs'. I, [2024-05-11T08:12:50.613021 #796041] INFO -- : make[1]: Leaving directory '/home/opc/ruby/build/master' I, [2024-05-11T08:12:50.615052 #796041] INFO -- : generating makefiles ext/configure-ext.mk I, [2024-05-11T08:12:50.654822 #796041] INFO -- : ext/configure-ext.mk updated I, [2024-05-11T08:12:50.657880 #796041] INFO -- : make[1]: Entering directory '/home/opc/ruby/build/master' I, [2024-05-11T08:12:52.704543 #796041] INFO -- : make[1]: Leaving directory '/home/opc/ruby/build/master' I, [2024-05-11T08:12:52.705319 #796041] INFO -- : generating makefile exts.mk I, [2024-05-11T08:12:52.763410 #796041] INFO -- : exts.mk unchanged I, [2024-05-11T08:12:52.768266 #796041] INFO -- : make[1]: Entering directory '/home/opc/ruby/build/master' I, [2024-05-11T08:12:53.063492 #796041] INFO -- : make[2]: Entering directory '/home/opc/ruby/build/master/ext/coverage' I, [2024-05-11T08:12:53.068235 #796041] INFO -- : make[2]: Leaving directory '/home/opc/ruby/build/master/ext/coverage' I, [2024-05-11T08:12:53.073841 #796041] INFO -- : make[2]: Entering directory '/home/opc/ruby/build/master/ext/date' I, [2024-05-11T08:12:53.079188 #796041] INFO -- : make[2]: Leaving directory '/home/opc/ruby/build/master/ext/date' I, [2024-05-11T08:12:53.082579 #796041] INFO -- : make[2]: Entering directory '/home/opc/ruby/build/master/ext/digest' I, [2024-05-11T08:12:53.091353 #796041] INFO -- : make[2]: Leaving directory '/home/opc/ruby/build/master/ext/digest' I, [2024-05-11T08:12:53.113921 #796041] INFO -- : make[2]: Entering directory '/home/opc/ruby/build/master/ext/digest/sha2' I, [2024-05-11T08:12:53.118813 #796041] INFO -- : make[2]: Leaving directory '/home/opc/ruby/build/master/ext/digest/sha2' I, [2024-05-11T08:12:53.136994 #796041] INFO -- : make[2]: Entering directory '/home/opc/ruby/build/master/ext/fiddle' I, [2024-05-11T08:12:53.147075 #796041] INFO -- : make[2]: Leaving directory '/home/opc/ruby/build/master/ext/fiddle' I, [2024-05-11T08:12:53.151410 #796041] INFO -- : make[2]: Entering directory '/home/opc/ruby/build/master/ext/io/console' I, [2024-05-11T08:12:53.155997 #796041] INFO -- : make[2]: Leaving directory '/home/opc/ruby/build/master/ext/io/console' I, [2024-05-11T08:12:53.166658 #796041] INFO -- : make[2]: Entering directory '/home/opc/ruby/build/master/ext/json' I, [2024-05-11T08:12:53.175974 #796041] INFO -- : make[2]: Leaving directory '/home/opc/ruby/build/master/ext/json' I, [2024-05-11T08:12:53.188813 #796041] INFO -- : make[2]: Entering directory '/home/opc/ruby/build/master/ext/monitor' I, [2024-05-11T08:12:53.192992 #796041] INFO -- : make[2]: Leaving directory '/home/opc/ruby/build/master/ext/monitor' I, [2024-05-11T08:12:53.199088 #796041] INFO -- : make[2]: Entering directory '/home/opc/ruby/build/master/ext/objspace' I, [2024-05-11T08:12:53.205153 #796041] INFO -- : make[2]: Leaving directory '/home/opc/ruby/build/master/ext/objspace' I, [2024-05-11T08:12:53.223937 #796041] INFO -- : make[2]: Entering directory '/home/opc/ruby/build/master/ext/openssl' I, [2024-05-11T08:12:53.245426 #796041] INFO -- : make[2]: Leaving directory '/home/opc/ruby/build/master/ext/openssl' I, [2024-05-11T08:12:53.249664 #796041] INFO -- : make[2]: Entering directory '/home/opc/ruby/build/master/ext/pathname' I, [2024-05-11T08:12:53.253854 #796041] INFO -- : make[2]: Leaving directory '/home/opc/ruby/build/master/ext/pathname' I, [2024-05-11T08:12:53.260099 #796041] INFO -- : make[2]: Entering directory '/home/opc/ruby/build/master/ext/psych' I, [2024-05-11T08:12:53.281612 #796041] INFO -- : make[2]: Leaving directory '/home/opc/ruby/build/master/ext/psych' I, [2024-05-11T08:12:53.286063 #796041] INFO -- : make[2]: Entering directory '/home/opc/ruby/build/master/ext/pty' I, [2024-05-11T08:12:53.290218 #796041] INFO -- : make[2]: Leaving directory '/home/opc/ruby/build/master/ext/pty' I, [2024-05-11T08:12:53.303418 #796041] INFO -- : make[2]: Entering directory '/home/opc/ruby/build/master/ext/ripper' I, [2024-05-11T08:12:53.310977 #796041] INFO -- : make[2]: Leaving directory '/home/opc/ruby/build/master/ext/ripper' I, [2024-05-11T08:12:53.312877 #796041] INFO -- : make[2]: Entering directory '/home/opc/ruby/build/master/ext/rubyvm' I, [2024-05-11T08:12:53.316257 #796041] INFO -- : make[2]: Leaving directory '/home/opc/ruby/build/master/ext/rubyvm' I, [2024-05-11T08:12:53.328137 #796041] INFO -- : make[2]: Entering directory '/home/opc/ruby/build/master/ext/socket' I, [2024-05-11T08:12:53.338820 #796041] INFO -- : make[2]: Leaving directory '/home/opc/ruby/build/master/ext/socket' I, [2024-05-11T08:12:53.354301 #796041] INFO -- : make[2]: Entering directory '/home/opc/ruby/build/master/.bundle/gems/bigdecimal-3.1.7/ext/bigdecimal' I, [2024-05-11T08:12:53.385311 #796041] INFO -- : make[2]: Leaving directory '/home/opc/ruby/build/master/.bundle/gems/bigdecimal-3.1.7/ext/bigdecimal' I, [2024-05-11T08:12:53.388210 #796041] INFO -- : make[2]: Entering directory '/home/opc/ruby/build/master/.bundle/gems/bigdecimal-3.1.8/ext/bigdecimal' I, [2024-05-11T08:12:53.418310 #796041] INFO -- : make[2]: Leaving directory '/home/opc/ruby/build/master/.bundle/gems/bigdecimal-3.1.8/ext/bigdecimal' I, [2024-05-11T08:12:53.420952 #796041] INFO -- : make[2]: Entering directory '/home/opc/ruby/build/master/.bundle/gems/debug-1.9.2/ext/debug' I, [2024-05-11T08:12:53.451241 #796041] INFO -- : make[2]: Leaving directory '/home/opc/ruby/build/master/.bundle/gems/debug-1.9.2/ext/debug' I, [2024-05-11T08:12:53.453779 #796041] INFO -- : make[2]: Entering directory '/home/opc/ruby/build/master/.bundle/gems/nkf-0.2.0/ext/nkf' I, [2024-05-11T08:12:53.484278 #796041] INFO -- : make[2]: Leaving directory '/home/opc/ruby/build/master/.bundle/gems/nkf-0.2.0/ext/nkf' I, [2024-05-11T08:12:53.486895 #796041] INFO -- : make[2]: Entering directory '/home/opc/ruby/build/master/.bundle/gems/racc-1.7.3/ext/racc/cparse' I, [2024-05-11T08:12:53.517071 #796041] INFO -- : make[2]: Leaving directory '/home/opc/ruby/build/master/.bundle/gems/racc-1.7.3/ext/racc/cparse' I, [2024-05-11T08:12:53.520072 #796041] INFO -- : make[2]: Entering directory '/home/opc/ruby/build/master/.bundle/gems/rbs-3.4.4/ext/rbs_extension' I, [2024-05-11T08:12:53.550671 #796041] INFO -- : make[2]: Leaving directory '/home/opc/ruby/build/master/.bundle/gems/rbs-3.4.4/ext/rbs_extension' I, [2024-05-11T08:12:53.553268 #796041] INFO -- : make[2]: Entering directory '/home/opc/ruby/build/master/.bundle/gems/syslog-0.1.2/ext/syslog' I, [2024-05-11T08:12:53.583707 #796041] INFO -- : make[2]: Leaving directory '/home/opc/ruby/build/master/.bundle/gems/syslog-0.1.2/ext/syslog' I, [2024-05-11T08:12:53.621835 #796041] INFO -- : make[2]: Entering directory '/home/opc/ruby/build/master' I, [2024-05-11T08:12:53.704858 #796041] INFO -- : make[2]: 'ruby' is up to date. I, [2024-05-11T08:12:53.704934 #796041] INFO -- : make[2]: Leaving directory '/home/opc/ruby/build/master' I, [2024-05-11T08:12:53.705070 #796041] INFO -- : make[1]: Leaving directory '/home/opc/ruby/build/master' I, [2024-05-11T08:12:53.709429 #796041] INFO -- : make[1]: Entering directory '/home/opc/ruby/build/master' I, [2024-05-11T08:12:53.709465 #796041] INFO -- : make[1]: Nothing to be done for 'note'. I, [2024-05-11T08:12:53.709476 #796041] INFO -- : make[1]: Leaving directory '/home/opc/ruby/build/master' I, [2024-05-11T08:12:53.820458 #796041] INFO -- : Run options: I, [2024-05-11T08:12:53.820552 #796041] INFO -- : --seed=27528 I, [2024-05-11T08:12:53.820564 #796041] INFO -- : "--ruby=./miniruby -I/home/opc/ruby/src/master/lib -I. -I.ext/common /home/opc/ruby/src/master/tool/runruby.rb --extout=.ext -- --disable-gems" I, [2024-05-11T08:12:53.820574 #796041] INFO -- : --excludes-dir=/home/opc/ruby/src/master/test/.excludes I, [2024-05-11T08:12:53.820582 #796041] INFO -- : --name=!/memory_leak/ I, [2024-05-11T08:12:53.820591 #796041] INFO -- : --stderr-on-failure I, [2024-05-11T08:12:53.820599 #796041] INFO -- : -j3 I, [2024-05-11T08:12:53.820607 #796041] INFO -- : I, [2024-05-11T08:12:53.820616 #796041] INFO -- : # Running tests: I, [2024-05-11T08:12:53.820624 #796041] INFO -- : I, [2024-05-11T08:12:53.949103 #796041] INFO -- : [ 1/885] 836924=test_lambda I, [2024-05-11T08:12:53.952822 #796041] INFO -- : [ 2/885] 836922=test_rb_str_dup I, [2024-05-11T08:12:53.954682 #796041] INFO -- : [ 3/885] 836922=test_scalar_scanner I, [2024-05-11T08:12:53.957202 #796041] INFO -- : [ 4/885] 836923=test_trace I, [2024-05-11T08:12:53.962391 #796041] INFO -- : [ 5/885] 836923=test_keyword I, [2024-05-11T08:12:53.988324 #796041] INFO -- : [ 6/885] 836922=test_win32ole_type_event I, [2024-05-11T08:12:53.995054 #796041] INFO -- : [ 7/885] 836922=test_arity I, [2024-05-11T08:12:54.004403 #796041] INFO -- : [ 8/885] 836922=test_gem_path_support I, [2024-05-11T08:12:54.019662 #796041] INFO -- : [ 9/885] 836924=test_append I, [2024-05-11T08:12:54.163681 #796041] INFO -- : [ 10/885] 836924=test_gem_resolver_installer_set I, [2024-05-11T08:12:54.240535 #796041] INFO -- : [ 11/885] 836922=test_rdoc_markup_to_html I, [2024-05-11T08:12:54.459402 #796041] INFO -- : [ 12/885] 836924=test_foreach I, [2024-05-11T08:12:54.461115 #796041] INFO -- : [ 13/885] 836923=test_x509ext I, [2024-05-11T08:12:54.469982 #796041] INFO -- : [ 14/885] 836922=test_emitter I, [2024-05-11T08:12:54.480946 #796041] INFO -- : [ 15/885] 836924=bom_test I, [2024-05-11T08:12:54.496559 #796041] INFO -- : [ 16/885] 836922=test_file I, [2024-05-11T08:12:54.516629 #796041] INFO -- : [ 17/885] 836923=test_config I, [2024-05-11T08:12:54.563278 #796041] INFO -- : [ 18/885] 836924=test_summary I, [2024-05-11T08:12:54.671083 #796041] INFO -- : [ 19/885] 836924=test_helper_method I, [2024-05-11T08:12:54.769910 #796041] INFO -- : [ 20/885] 836924=test_member I, [2024-05-11T08:12:54.776876 #796041] INFO -- : [ 21/885] 836924=test_object I, [2024-05-11T08:12:54.806206 #796041] INFO -- : [ 22/885] 836924=test_addr I, [2024-05-11T08:12:54.824614 #796041] INFO -- : [ 23/885] 836924=test_mailto I, [2024-05-11T08:12:54.840102 #796041] INFO -- : [ 24/885] 836924=test_kill_ring I, [2024-05-11T08:12:54.843446 #796041] INFO -- : [ 25/885] 836924=test_case_options I, [2024-05-11T08:12:54.846007 #796041] INFO -- : [ 26/885] 836924=format_errors_test I, [2024-05-11T08:12:54.861618 #796041] INFO -- : [ 27/885] 836924=test_cgi_header I, [2024-05-11T08:12:54.866592 #796041] INFO -- : [ 28/885] 836924=test_duplicate I, [2024-05-11T08:12:54.873160 #796041] INFO -- : [ 29/885] 836924=test_gem_resolver_api_set I, [2024-05-11T08:12:54.903110 #796041] INFO -- : [ 30/885] 836923=test_helper I, [2024-05-11T08:12:54.909425 #796041] INFO -- : [ 31/885] 836923=test_buffered_io I, [2024-05-11T08:12:55.007730 #796041] INFO -- : [ 32/885] 836924=test_ossl I, [2024-05-11T08:12:55.008372 #796041] INFO -- : [ 33/885] 836923=test_gem_installer I, [2024-05-11T08:12:59.758706 #796041] INFO -- : [ 34/885] 836923=test_bug_reporter I, [2024-05-11T08:12:59.801029 #796041] INFO -- : [ 35/885] 836923=test_gem_source_subpath_problem I, [2024-05-11T08:12:59.888670 #796041] INFO -- : [ 36/885] 836923=test_object_references I, [2024-05-11T08:12:59.985273 #796041] INFO -- : [ 37/885] 836923=test_ruby_lex I, [2024-05-11T08:13:00.161524 #796041] INFO -- : [ 38/885] 836923=test_arith_seq_extract I, [2024-05-11T08:13:00.328410 #796041] INFO -- : [ 39/885] 836923=compiler_test I, [2024-05-11T08:13:00.333607 #796041] INFO -- : [ 40/885] 836923=test_eval I, [2024-05-11T08:13:00.603590 #796041] INFO -- : [ 41/885] 836923=test_beginendblock I, [2024-05-11T08:13:00.671910 #796041] INFO -- : [ 42/885] 836922=test_monitor I, [2024-05-11T08:13:00.926741 #796041] INFO -- : [ 43/885] 836922=test_pointer I, [2024-05-11T08:13:00.948016 #796041] INFO -- : [ 44/885] 836923=test_rdoc_normal_class I, [2024-05-11T08:13:01.169283 #796041] INFO -- : [ 45/885] 836923=test_within_pipe I, [2024-05-11T08:13:01.192655 #796041] INFO -- : [ 46/885] 836923=test_nofree I, [2024-05-11T08:13:01.194001 #796041] INFO -- : [ 47/885] 836923=test_whileuntil I, [2024-05-11T08:13:01.202264 #796041] INFO -- : [ 48/885] 836923=test_regexp I, [2024-05-11T08:13:01.218426 #796041] INFO -- : [ 49/885] 836922=test_convertible I, [2024-05-11T08:13:02.308626 #796041] INFO -- : [ 50/885] 836924=errors_test I, [2024-05-11T08:13:02.409412 #796041] INFO -- : [ 51/885] 836924=test_modify_expand I, [2024-05-11T08:13:02.440061 #796041] INFO -- : [ 52/885] 836924=test_pkg_config I, [2024-05-11T08:13:02.452434 #796041] INFO -- : [ 53/885] 836924=test_gem_available_set I, [2024-05-11T08:13:02.555887 #796041] INFO -- : [ 54/885] 836924=json_encoding_test I, [2024-05-11T08:13:02.558551 #796041] INFO -- : [ 55/885] 836924=test_vm_dump I, [2024-05-11T08:13:02.583293 #796041] INFO -- : [ 56/885] 836924=test_func I, [2024-05-11T08:13:04.231420 #796041] INFO -- : [ 57/885] 836924=test_config I, [2024-05-11T08:13:04.270185 #796041] INFO -- : [ 58/885] 836924=test_object I, [2024-05-11T08:13:04.613781 #796041] INFO -- : [ 59/885] 836924=test_dln I, [2024-05-11T08:13:04.652622 #796041] INFO -- : [ 60/885] 836924=test_gem_resolver I, [2024-05-11T08:13:04.953259 #796041] INFO -- : [ 61/885] 836924=test_gem_source_vendor I, [2024-05-11T08:13:04.963002 #796041] INFO -- : [ 62/885] 836924=test_color_printer I, [2024-05-11T08:13:04.972451 #796041] INFO -- : [ 63/885] 836924=test_super I, [2024-05-11T08:13:05.040623 #796041] INFO -- : [ 64/885] 836922=test_gem_commands_exec_command I, [2024-05-11T08:13:05.708953 #796041] INFO -- : [ 65/885] 836924=unescape_test I, [2024-05-11T08:13:06.411759 #796041] INFO -- : [ 66/885] 836922=test_httpresponse I, [2024-05-11T08:13:06.483187 #796041] INFO -- : [ 67/885] 836922=test_rdoc_parser_ruby I, [2024-05-11T08:13:06.931209 #796041] INFO -- : [ 68/885] 836924=test_readpartial I, [2024-05-11T08:13:06.977217 #796041] INFO -- : [ 69/885] 836922=test_x509req I, [2024-05-11T08:13:06.995664 #796041] INFO -- : [ 70/885] 836922=test_gem_console_ui I, [2024-05-11T08:13:06.998589 #796041] INFO -- : [ 71/885] 836922=test_ifunless I, [2024-05-11T08:13:07.136003 #796041] INFO -- : [ 72/885] 836922=test_allocation I, [2024-05-11T08:13:07.340554 #796041] INFO -- : [ 73/885] 836924=test_insns_leaf I, [2024-05-11T08:13:07.352286 #796041] INFO -- : [ 74/885] 836924=test_x509crl I, [2024-05-11T08:13:07.457062 #796041] INFO -- : [ 75/885] 836924=test_dns I, [2024-05-11T08:13:07.926304 #796041] INFO -- : [ 76/885] 836924=test_c_union_entity I, [2024-05-11T08:13:07.983799 #796041] INFO -- : [ 77/885] 836924=test_cgi_session I, [2024-05-11T08:13:07.991796 #796041] INFO -- : [ 78/885] 836924=test_notimplement I, [2024-05-11T08:13:08.001027 #796041] INFO -- : [ 79/885] 836924=test_flip I, [2024-05-11T08:13:08.056222 #796041] INFO -- : [ 80/885] 836924=test_io_console I, [2024-05-11T08:13:08.132615 #796041] INFO -- : .Leaked file descriptor: TestIO_Console#test_oflush: 10 # I, [2024-05-11T08:13:08.159972 #796041] INFO -- : COMMAND PID USER FD TYPE DEVICE SIZE/OFF NODE NAME I, [2024-05-11T08:13:08.160044 #796041] INFO -- : ruby 836924 opc 10r REG 252,0 6940392 13705429 /var/lib/sss/mc/group I, [2024-05-11T08:13:09.254389 #796041] INFO -- : [ 81/885] 836922=test_rdoc_markup_heading I, [2024-05-11T08:13:09.361994 #796041] INFO -- : [ 82/885] 836922=test_profile_frames I, [2024-05-11T08:13:09.432747 #796041] INFO -- : [ 83/885] 836922=test_pattern_key_name_check I, [2024-05-11T08:13:09.438389 #796041] INFO -- : [ 84/885] 836922=test_class2name I, [2024-05-11T08:13:09.461194 #796041] INFO -- : [ 85/885] 836922=test_gem_commands_cleanup_command I, [2024-05-11T08:13:10.015270 #796041] INFO -- : [ 86/885] 836922=test_debug I, [2024-05-11T08:13:10.052112 #796041] INFO -- : [ 87/885] 836922=test_refinement I, [2024-05-11T08:13:10.756739 #796041] INFO -- : [ 88/885] 836924=test_transcode I, [2024-05-11T08:13:11.351380 #796041] INFO -- : [ 89/885] 836924=test_last_thread I, [2024-05-11T08:13:12.021443 #796041] INFO -- : [ 90/885] 836924=test_thread_fd_close I, [2024-05-11T08:13:12.045277 #796041] INFO -- : [ 91/885] 836924=test_gem_ext_cmake_builder I, [2024-05-11T08:13:12.057159 #796041] INFO -- : [ 92/885] 836924=test_digest_extend I, [2024-05-11T08:13:12.067527 #796041] INFO -- : [ 93/885] 836924=test_emitter I, [2024-05-11T08:13:12.080703 #796041] INFO -- : [ 94/885] 836924=test_fips I, [2024-05-11T08:13:12.355991 #796041] INFO -- : [ 95/885] 836924=test_alias I, [2024-05-11T08:13:12.496200 #796041] INFO -- : [ 96/885] 836924=test_getopts I, [2024-05-11T08:13:12.496746 #796041] INFO -- : [ 97/885] 836924=test_helper I, [2024-05-11T08:13:12.512232 #796041] INFO -- : [ 98/885] 836924=test_compile_prism I, [2024-05-11T08:13:12.850225 #796041] INFO -- : [ 99/885] 836924=test_gem_commands_uninstall_command I, [2024-05-11T08:13:13.561035 #796041] INFO -- : [100/885] 836922=test_rdoc_markup_formatter I, [2024-05-11T08:13:13.567043 #796041] INFO -- : [101/885] 836922=test_win32ole_event I, [2024-05-11T08:13:13.578283 #796041] INFO -- : [102/885] 836922=test_formatter I, [2024-05-11T08:13:13.591398 #796041] INFO -- : [103/885] 836922=test_gem_commands_contents_command I, [2024-05-11T08:13:13.713723 #796041] INFO -- : [104/885] 836922=test_context I, [2024-05-11T08:13:13.746535 #796041] INFO -- : [105/885] 836924=test_udp I, [2024-05-11T08:13:13.819036 #796041] INFO -- : [106/885] 836924=test_symbol I, [2024-05-11T08:13:13.919332 #796041] INFO -- : [107/885] 836922=test_gem_commands_search_command I, [2024-05-11T08:13:13.967025 #796041] INFO -- : [108/885] 836922=test_rdoc_servlet I, [2024-05-11T08:13:14.064908 #796041] INFO -- : [109/885] 836922=test_coder I, [2024-05-11T08:13:14.083537 #796041] INFO -- : [110/885] 836922=test_unix I, [2024-05-11T08:13:14.152883 #796041] INFO -- : [111/885] 836922=test_integer I, [2024-05-11T08:13:16.038876 #796041] INFO -- : [112/885] 836923=test_date_marshal I, [2024-05-11T08:13:16.278085 #796041] INFO -- : [113/885] 836923=test_have_func I, [2024-05-11T08:13:16.381700 #796041] INFO -- : [114/885] 836924=test_gem_resolver_local_specification I, [2024-05-11T08:13:16.483703 #796041] INFO -- : [115/885] 836924=test_configuration I, [2024-05-11T08:13:16.492110 #796041] INFO -- : [116/885] 836924=test_date_new I, [2024-05-11T08:13:16.508591 #796041] INFO -- : [117/885] 836924=test_gem_commands_list_command I, [2024-05-11T08:13:16.638879 #796041] INFO -- : [118/885] 836924=test_rdoc_attr I, [2024-05-11T08:13:16.650174 #796041] INFO -- : [119/885] 836922=test_address_resolve I, [2024-05-11T08:13:16.663433 #796041] INFO -- : [120/885] 836924=test_stream I, [2024-05-11T08:13:16.667067 #796041] INFO -- : [121/885] 836924=test_trick I, [2024-05-11T08:13:16.679408 #796041] INFO -- : [122/885] 836922=test_ractor I, [2024-05-11T08:13:16.750727 #796041] INFO -- : [123/885] 836922=test_ts I, [2024-05-11T08:13:17.027778 #796041] INFO -- : [124/885] 836922=test_locale I, [2024-05-11T08:13:17.081561 #796041] INFO -- : [125/885] 836922=test_num2int I, [2024-05-11T08:13:17.087573 #796041] INFO -- : [126/885] 836922=test_rbconfig I, [2024-05-11T08:13:17.092170 #796041] INFO -- : [127/885] 836922=test_recursion I, [2024-05-11T08:13:17.191957 #796041] INFO -- : [128/885] 836922=test_require I, [2024-05-11T08:13:17.384633 #796041] INFO -- : [129/885] 836923=test_rdoc_markup_include I, [2024-05-11T08:13:17.388852 #796041] INFO -- : [130/885] 836923=test_enum I, [2024-05-11T08:13:18.243895 #796041] INFO -- : [131/885] 836923=test_extlibs I, [2024-05-11T08:13:18.377656 #796041] INFO -- : [132/885] 836922=test_iter_break I, [2024-05-11T08:13:18.406465 #796041] INFO -- : [133/885] 836922=test_range I, [2024-05-11T08:13:19.064613 #796041] INFO -- : [134/885] 836924=test_gem_commands_signin_command I, [2024-05-11T08:13:19.084738 #796041] INFO -- : [135/885] 836922=test_rdoc_markup_to_label I, [2024-05-11T08:13:19.119463 #796041] INFO -- : [136/885] 836922=test_parser I, [2024-05-11T08:13:19.144876 #796041] INFO -- : [137/885] 836922=test_cgi_core I, [2024-05-11T08:13:19.158342 #796041] INFO -- : [138/885] 836922=test_gem_resolver_best_set I, [2024-05-11T08:13:19.234667 #796041] INFO -- : [139/885] 836924=test_registry I, [2024-05-11T08:13:19.239436 #796041] INFO -- : [140/885] 836924=test_gem I, [2024-05-11T08:13:19.261981 #796041] INFO -- : [141/885] 836922=test_ractor I, [2024-05-11T08:13:19.284718 #796041] INFO -- : [142/885] 836922=json_generator_test I, [2024-05-11T08:13:19.393676 #796041] INFO -- : [143/885] 836922=test_ansi_without_terminfo I, [2024-05-11T08:13:19.400919 #796041] INFO -- : [144/885] 836922=test_ractor I, [2024-05-11T08:13:19.732604 #796041] INFO -- : [145/885] 836922=test_gem_resolver_conflict I, [2024-05-11T08:13:19.751790 #796041] INFO -- : [146/885] 836922=test_gem_commands_help_command I, [2024-05-11T08:13:19.819704 #796041] INFO -- : [147/885] 836923=test_scheduler I, [2024-05-11T08:13:19.825615 #796041] INFO -- : [148/885] 836922=test_ssl I, [2024-05-11T08:13:19.989509 #796041] INFO -- : [149/885] 836923=test_bignum I, [2024-05-11T08:13:20.000863 #796041] INFO -- : [150/885] 836922=newline_test I, [2024-05-11T08:13:20.190457 #796041] INFO -- : [151/885] 836922=test_enc_str_buf_cat I, [2024-05-11T08:13:20.194791 #796041] INFO -- : [152/885] 836922=test_marshal I, [2024-05-11T08:13:20.988646 #796041] INFO -- : [153/885] 836922=test_ancdata I, [2024-05-11T08:13:21.045788 #796041] INFO -- : [154/885] 836922=ractor_test I, [2024-05-11T08:13:21.052857 #796041] INFO -- : [155/885] 836922=test_nesting_parser I, [2024-05-11T08:13:21.065212 #796041] INFO -- : [156/885] 836922=test_rdoc_markup_hard_break I, [2024-05-11T08:13:21.084906 #796041] INFO -- : [157/885] 836922=test_time_tz I, [2024-05-11T08:13:21.132674 #796041] INFO -- : [158/885] 836922=test_to_ruby I, [2024-05-11T08:13:21.146603 #796041] INFO -- : [159/885] 836922=test_addrinfo I, [2024-05-11T08:13:21.168995 #796041] INFO -- : Leaked file descriptor: TestSocketAddrinfo#test_addrinfo_timeout: 9 # I, [2024-05-11T08:13:21.194221 #796041] INFO -- : COMMAND PID USER FD TYPE DEVICE SIZE/OFF NODE NAME I, [2024-05-11T08:13:21.194289 #796041] INFO -- : ruby 836922 opc 9u unix 0x0000000000000000 0t0 2932097415 type=STREAM I, [2024-05-11T08:13:21.313753 #796041] INFO -- : [160/885] 836922=test_bug-14834 I, [2024-05-11T08:13:21.318595 #796041] INFO -- : [161/885] 836922=test_data I, [2024-05-11T08:13:21.330548 #796041] INFO -- : [162/885] 836922=test_thread I, [2024-05-11T08:13:21.417426 #796041] INFO -- : [163/885] 836924=test_inlinecache I, [2024-05-11T08:13:21.481436 #796041] INFO -- : [164/885] 836924=test_socket I, [2024-05-11T08:13:22.484137 #796041] INFO -- : [165/885] 836924=test_terminfo I, [2024-05-11T08:13:22.493444 #796041] INFO -- : [166/885] 836924=test_reline I, [2024-05-11T08:13:22.731603 #796041] INFO -- : [167/885] 836924=test_ellipsize I, [2024-05-11T08:13:22.745204 #796041] INFO -- : [168/885] 836924=test_call I, [2024-05-11T08:13:22.902066 #796041] INFO -- : [169/885] 836924=test_gem_commands_build_command I, [2024-05-11T08:13:23.180015 #796041] INFO -- : [170/885] 836924=test_windows_1251 I, [2024-05-11T08:13:23.214233 #796041] INFO -- : [171/885] 836924=test_to_ary_concat I, [2024-05-11T08:13:23.626003 #796041] INFO -- : [172/885] 836923=test_history I, [2024-05-11T08:13:23.643397 #796041] INFO -- : [173/885] 836923=test_gem_ext_builder I, [2024-05-11T08:13:24.644208 #796041] INFO -- : [174/885] 836923=test_euc_jp I, [2024-05-11T08:13:24.655330 #796041] INFO -- : [175/885] 836923=test_rdoc_markup I, [2024-05-11T08:13:24.664348 #796041] INFO -- : [176/885] 836923=test_key_stroke I, [2024-05-11T08:13:24.686091 #796041] INFO -- : [177/885] 836923=test_ensured I, [2024-05-11T08:13:24.734401 #796041] INFO -- : [178/885] 836923=test_time I, [2024-05-11T08:13:24.892761 #796041] INFO -- : [179/885] 836923=test_popen_deadlock I, [2024-05-11T08:13:24.944788 #796041] INFO -- : [180/885] 836924=test_alias_and_anchor I, [2024-05-11T08:13:24.955268 #796041] INFO -- : [181/885] 836924=test_project_sanity I, [2024-05-11T08:13:25.006478 #796041] INFO -- : [182/885] 836924=test_symbol I, [2024-05-11T08:13:25.018535 #796041] INFO -- : [183/885] 836924=test_chilled I, [2024-05-11T08:13:25.030443 #796041] INFO -- : [184/885] 836924=test_delegate I, [2024-05-11T08:13:25.047390 #796041] INFO -- : [185/885] 836924=location_test I, [2024-05-11T08:13:25.103121 #796041] INFO -- : [186/885] 836924=test_pattern_matching I, [2024-05-11T08:13:25.127654 #796041] INFO -- : [187/885] 836924=test_set_len I, [2024-05-11T08:13:25.132039 #796041] INFO -- : [188/885] 836924=constant_path_node_test I, [2024-05-11T08:13:25.135571 #796041] INFO -- : [189/885] 836924=test_interned_str I, [2024-05-11T08:13:25.140304 #796041] INFO -- : [190/885] 836924=test_folderitem2_invokeverb I, [2024-05-11T08:13:25.151056 #796041] INFO -- : [191/885] 836924=test_gem_bundler_version_finder I, [2024-05-11T08:13:25.212232 #796041] INFO -- : [192/885] 836924=test_gem_request_set I, [2024-05-11T08:13:25.455414 #796041] INFO -- : [193/885] 836923=test_gc I, [2024-05-11T08:13:25.775712 #796041] INFO -- : [194/885] 836924=test_gem_resolver_index_set I, [2024-05-11T08:13:25.811365 #796041] INFO -- : [195/885] 836924=ruby_api_test I, [2024-05-11T08:13:25.991452 #796041] INFO -- : [196/885] 836924=test_sleep I, [2024-05-11T08:13:30.142983 #796041] INFO -- : [197/885] 836922=test_webauthn_listener_response I, [2024-05-11T08:13:30.166013 #796041] INFO -- : [198/885] 836922=heredoc_dedent_test I, [2024-05-11T08:13:30.172872 #796041] INFO -- : [199/885] 836922=test_type I, [2024-05-11T08:13:30.177721 #796041] INFO -- : [200/885] 836922=test_rdoc_token_stream I, [2024-05-11T08:13:30.185659 #796041] INFO -- : [201/885] 836922=test_mutex I, [2024-05-11T08:13:30.976876 #796041] INFO -- : [202/885] 836924=test_struct I, [2024-05-11T08:13:31.312217 #796041] INFO -- : [203/885] 836922=test_tmpdir I, [2024-05-11T08:13:31.401403 #796041] INFO -- : [204/885] 836922=test_acceptable I, [2024-05-11T08:13:31.561499 #796041] INFO -- : [205/885] 836922=test_rdoc_single_class I, [2024-05-11T08:13:31.569150 #796041] INFO -- : [206/885] 836924=test_dup I, [2024-05-11T08:13:31.574389 #796041] INFO -- : [207/885] 836922=test_gem_local_remote_options I, [2024-05-11T08:13:31.636733 #796041] INFO -- : [208/885] 836922=test_gem_ext_cargo_builder_link_flag_converter I, [2024-05-11T08:13:31.719313 #796041] INFO -- : [209/885] 836922=test_rdoc_ri_driver I, [2024-05-11T08:13:31.749233 #796041] INFO -- : [210/885] 836924=test_sexp I, [2024-05-11T08:13:31.770808 #796041] INFO -- : [211/885] 836924=test_httpheader I, [2024-05-11T08:13:31.816688 #796041] INFO -- : [212/885] 836924=test_ractor I, [2024-05-11T08:13:31.888109 #796041] INFO -- : [213/885] 836924=test_gem_safe_marshal I, [2024-05-11T08:13:32.142565 #796041] INFO -- : [214/885] 836922=test_digest I, [2024-05-11T08:13:32.724745 #796041] INFO -- : [215/885] 836924=test_gem_commands_check_command I, [2024-05-11T08:13:32.813337 #796041] INFO -- : [216/885] 836924=test_gem_resolver_git_set I, [2024-05-11T08:13:33.036052 #796041] INFO -- : [217/885] 836922=test_signedness I, [2024-05-11T08:13:33.357242 #796041] INFO -- : [218/885] 836924=test_stringscanner I, [2024-05-11T08:13:33.400175 #796041] INFO -- : [219/885] 836924=test_ractor I, [2024-05-11T08:13:33.520421 #796041] INFO -- : [220/885] 836924=test_exception_at_throwing I, [2024-05-11T08:13:33.534372 #796041] INFO -- : [221/885] 836924=test_gem_resolver_installed_specification I, [2024-05-11T08:13:33.591935 #796041] INFO -- : [222/885] 836924=test_date_arith I, [2024-05-11T08:13:33.611386 #796041] INFO -- : [223/885] 836924=test_gem_resolver_vendor_specification I, [2024-05-11T08:13:33.648014 #796041] INFO -- : [224/885] 836923=test_fiddle I, [2024-05-11T08:13:33.657002 #796041] INFO -- : [225/885] 836924=json_generic_object_test I, [2024-05-11T08:13:33.716161 #796041] INFO -- : [226/885] 836924=test_require_path_check I, [2024-05-11T08:13:33.744003 #796041] INFO -- : [227/885] 836924=test_bn I, [2024-05-11T08:13:33.757981 #796041] INFO -- : [228/885] 836924=test_variable_name_check I, [2024-05-11T08:13:33.794537 #796041] INFO -- : [229/885] 836924=test_irb I, [2024-05-11T08:13:33.841701 #796041] INFO -- : [230/885] 836923=test_x509cert I, [2024-05-11T08:13:33.917921 #796041] INFO -- : [231/885] 836923=test_rdoc_markup_paragraph I, [2024-05-11T08:13:33.935270 #796041] INFO -- : [232/885] 836923=test_ast I, [2024-05-11T08:13:34.069778 #796041] INFO -- : [233/885] 836924=test_logdevice I, [2024-05-11T08:13:34.907993 #796041] INFO -- : [234/885] 836924=test_https I, [2024-05-11T08:13:34.918702 #796041] INFO -- : [235/885] 836922=test_gem_commands_info_command I, [2024-05-11T08:13:34.951202 #796041] INFO -- : [236/885] 836922=test_object_create_start I, [2024-05-11T08:13:34.958152 #796041] INFO -- : [237/885] 836922=test_rdoc_markup_to_ansi I, [2024-05-11T08:13:34.999302 #796041] INFO -- : [238/885] 836922=test_weakkeymap I, [2024-05-11T08:13:35.208613 #796041] INFO -- : [239/885] 836924=test_files_test I, [2024-05-11T08:13:35.286220 #796041] INFO -- : [240/885] 836924=test_protocol I, [2024-05-11T08:13:35.453041 #796041] INFO -- : [241/885] 836922=test_evaluation I, [2024-05-11T08:13:35.458834 #796041] INFO -- : [242/885] 836922=test_name_error_extension I, [2024-05-11T08:13:35.466745 #796041] INFO -- : [243/885] 836922=test_gem_request_set_gem_dependency_api I, [2024-05-11T08:13:35.518980 #796041] INFO -- : [244/885] 836924=test_handle I, [2024-05-11T08:13:35.773668 #796041] INFO -- : [245/885] 836922=parse_stream_test I, [2024-05-11T08:13:35.785214 #796041] INFO -- : [246/885] 836922=test_delete I, [2024-05-11T08:13:35.786659 #796041] INFO -- : [247/885] 836922=test_rdoc_markup_document I, [2024-05-11T08:13:35.798310 #796041] INFO -- : [248/885] 836922=test_gem_security_policy I, [2024-05-11T08:13:36.108033 #796041] INFO -- : [249/885] 836924=test_file_exhaustive I, [2024-05-11T08:13:36.203368 #796041] INFO -- : [250/885] 836922=test_completion I, [2024-05-11T08:13:36.617645 #796041] INFO -- : Leaked file descriptor: TestFileExhaustive#test_expand_path_home_dir_string: 9 # I, [2024-05-11T08:13:36.617715 #796041] INFO -- : Leaked file descriptor: TestFileExhaustive#test_expand_path_home_dir_string: 11 # I, [2024-05-11T08:13:36.641700 #796041] INFO -- : COMMAND PID USER FD TYPE DEVICE SIZE/OFF NODE NAME I, [2024-05-11T08:13:36.641778 #796041] INFO -- : ruby 836924 opc 9r REG 252,0 9253600 13705411 /var/lib/sss/mc/passwd I, [2024-05-11T08:13:36.641789 #796041] INFO -- : ruby 836924 opc 10r REG 252,0 6940392 13705429 /var/lib/sss/mc/group I, [2024-05-11T08:13:36.641798 #796041] INFO -- : ruby 836924 opc 11u unix 0x0000000000000000 0t0 2932099951 type=STREAM I, [2024-05-11T08:13:36.867984 #796041] INFO -- : [251/885] 836922=test_gem_ci_detector I, [2024-05-11T08:13:36.870113 #796041] INFO -- : [252/885] 836922=test_signal I, [2024-05-11T08:13:38.828829 #796041] INFO -- : [253/885] 836922=test_gem_silent_ui I, [2024-05-11T08:13:38.872743 #796041] INFO -- : [254/885] 836922=test_fixnum I, [2024-05-11T08:13:38.885001 #796041] INFO -- : [255/885] 836922=test_continuation I, [2024-05-11T08:13:38.888742 #796041] INFO -- : [256/885] 836922=test_io_wait_uncommon I, [2024-05-11T08:13:38.956813 #796041] INFO -- : [257/885] 836922=test_ssl_session I, [2024-05-11T08:13:39.744399 #796041] INFO -- : [258/885] 836922=test_gem_package_tar_header I, [2024-05-11T08:13:39.844848 #796041] INFO -- : [259/885] 836922=test_placearg I, [2024-05-11T08:13:39.906954 #796041] INFO -- : [260/885] 836922=test_rational2 I, [2024-05-11T08:13:39.916895 #796041] INFO -- : [261/885] 836922=test_case_comprehensive I, [2024-05-11T08:13:44.192143 #796041] INFO -- : [262/885] 836924=test_logperiod I, [2024-05-11T08:13:44.214655 #796041] INFO -- : [263/885] 836924=test_debugger_integration I, [2024-05-11T08:13:44.223437 #796041] INFO -- : [264/885] 836924=test_gem_resolver_composed_set I, [2024-05-11T08:13:44.239991 #796041] INFO -- : [265/885] 836924=test_my_integer I, [2024-05-11T08:13:44.302127 #796041] INFO -- : [266/885] 836924=test_require I, [2024-05-11T08:13:46.811965 #796041] INFO -- : [267/885] 836924=test_objectspace I, [2024-05-11T08:13:47.764869 #796041] INFO -- : [268/885] 836924=test_option I, [2024-05-11T08:13:47.829787 #796041] INFO -- : [269/885] 836924=test_wss I, [2024-05-11T08:13:47.840165 #796041] INFO -- : [270/885] 836924=test_rdoc_markup_attribute_manager I, [2024-05-11T08:13:47.878245 #796041] INFO -- : [271/885] 836924=test_tracer I, [2024-05-11T08:13:47.887566 #796041] INFO -- : [272/885] 836924=test_cgi_cookie I, [2024-05-11T08:13:47.891587 #796041] INFO -- : [273/885] 836924=test_not I, [2024-05-11T08:13:47.891965 #796041] INFO -- : [274/885] 836924=test_rdoc_rd I, [2024-05-11T08:13:47.919461 #796041] INFO -- : [275/885] 836924=test_rdoc_markup_to_markdown I, [2024-05-11T08:13:48.004164 #796041] INFO -- : [276/885] 836924=test_rdoc_markup_to_joined_paragraph I, [2024-05-11T08:13:48.004844 #796041] INFO -- : [277/885] 836924=test_rdoc_generator_pot I, [2024-05-11T08:13:48.015230 #796041] INFO -- : [278/885] 836924=test_rdoc_rd_block_parser I, [2024-05-11T08:13:48.099703 #796041] INFO -- : [279/885] 836924=test_x509store I, [2024-05-11T08:13:48.575329 #796041] INFO -- : [280/885] 836924=test_metaclass I, [2024-05-11T08:13:48.645350 #796041] INFO -- : [281/885] 836924=test_require_lib I, [2024-05-11T08:13:51.649347 #796041] INFO -- : [282/885] 836924=test_gem_gem_runner I, [2024-05-11T08:13:51.746744 #796041] INFO -- : [283/885] 836924=test_win32ole_type I, [2024-05-11T08:13:51.755747 #796041] INFO -- : [284/885] 836924=test_rdoc_rd_inline_parser I, [2024-05-11T08:13:51.777916 #796041] INFO -- : [285/885] 836924=test_load I, [2024-05-11T08:13:51.787273 #796041] INFO -- : [286/885] 836924=test_gem_source_lock I, [2024-05-11T08:13:51.855974 #796041] INFO -- : [287/885] 836924=test_new I, [2024-05-11T08:13:51.868663 #796041] INFO -- : [288/885] 836924=test_cipher I, [2024-05-11T08:13:51.892693 #796041] INFO -- : [289/885] 836924=test_update I, [2024-05-11T08:13:51.903711 #796041] INFO -- : [290/885] 836924=test_ostruct I, [2024-05-11T08:13:52.035379 #796041] INFO -- : [291/885] 836924=test_config I, [2024-05-11T08:13:52.072933 #796041] INFO -- : [292/885] 836924=test_change_word I, [2024-05-11T08:13:52.077328 #796041] INFO -- : [293/885] 836924=test_depth_first I, [2024-05-11T08:13:52.085762 #796041] INFO -- : [294/885] 836924=test_rdoc_parser_markdown I, [2024-05-11T08:13:52.094822 #796041] INFO -- : [295/885] 836924=test_custom_command I, [2024-05-11T08:13:52.100356 #796041] INFO -- : [296/885] 836924=static_inspect_test I, [2024-05-11T08:13:52.105029 #796041] INFO -- : [297/885] 836924=test_struct I, [2024-05-11T08:13:52.108333 #796041] INFO -- : [298/885] 836924=test_c_struct_entry I, [2024-05-11T08:13:52.695934 #796041] INFO -- : [299/885] 836924=test_rubyvm I, [2024-05-11T08:13:52.708774 #796041] INFO -- : [300/885] 836924=fuzzer_test I, [2024-05-11T08:13:52.737035 #796041] INFO -- : [301/885] 836924=test_cparser I, [2024-05-11T08:13:54.189542 #796041] INFO -- : [302/885] 836924=test_resize I, [2024-05-11T08:13:54.201326 #796041] INFO -- : [303/885] 836924=test_gem_package_task I, [2024-05-11T08:13:54.217820 #796041] INFO -- : [304/885] 836924=test_lock_native_thread I, [2024-05-11T08:13:54.450902 #796041] INFO -- : [305/885] 836924=test_engine I, [2024-05-11T08:13:54.928947 #796041] INFO -- : [306/885] 836924=test_gem_commands_mirror I, [2024-05-11T08:13:54.945938 #796041] INFO -- : [307/885] 836924=test_fiber I, [2024-05-11T08:13:59.010998 #796041] INFO -- : [308/885] 836922=test_key_error I, [2024-05-11T08:13:59.015119 #796041] INFO -- : [309/885] 836922=test_win32ole_param I, [2024-05-11T08:13:59.021394 #796041] INFO -- : [310/885] 836922=test_usrmarshal I, [2024-05-11T08:13:59.218135 #796041] INFO -- : [311/885] 836922=test_gem_source_installed I, [2024-05-11T08:13:59.234028 #796041] INFO -- : [312/885] 836922=test_gem_validator I, [2024-05-11T08:13:59.250869 #796041] INFO -- : [313/885] 836922=test_gem_security_trust_dir I, [2024-05-11T08:13:59.314945 #796041] INFO -- : [314/885] 836922=test_module I, [2024-05-11T08:14:01.065776 #796041] INFO -- : [315/885] 836924=test_erb_command I, [2024-05-11T08:14:01.111260 #796041] INFO -- : [316/885] 836924=test_ssl I, [2024-05-11T08:14:02.574922 #796041] INFO -- : [317/885] 836922=test_abi I, [2024-05-11T08:14:02.736922 #796041] INFO -- : [318/885] 836922=test_load.Leaked file descriptor: TestOptionParserLoad#test_load_xdg_config_dirs: 11 # I, [2024-05-11T08:14:02.768392 #796041] INFO -- : COMMAND PID USER FD TYPE DEVICE SIZE/OFF NODE NAME I, [2024-05-11T08:14:02.768462 #796041] INFO -- : ruby 836922 opc 11r REG 252,0 9253600 13705411 /var/lib/sss/mc/passwd I, [2024-05-11T08:14:02.820754 #796041] INFO -- : I, [2024-05-11T08:14:02.880813 #796041] INFO -- : [319/885] 836922=test_bundled_ca I, [2024-05-11T08:14:05.658664 #796041] INFO -- : [320/885] 836922=test_integer_comb I, [2024-05-11T08:14:07.965841 #796041] INFO -- : [321/885] 836922=test_gem_commands_lock_command I, [2024-05-11T08:14:07.990172 #796041] INFO -- : [322/885] 836922=test_reline_key I, [2024-05-11T08:14:08.001005 #796041] INFO -- : [323/885] 836922=test_propertyputref I, [2024-05-11T08:14:08.010818 #796041] INFO -- : [324/885] 836922=test_gb18030 I, [2024-05-11T08:14:08.013895 #796041] INFO -- : [325/885] 836922=test_gem_stream_ui I, [2024-05-11T08:14:08.134438 #796041] INFO -- : [326/885] 836922=test_rdoc_generator_ri I, [2024-05-11T08:14:08.175734 #796041] INFO -- : [327/885] 836922=test_unicode_normalize I, [2024-05-11T08:14:11.530079 #796041] INFO -- : [328/885] 836924=test_cmethod I, [2024-05-11T08:14:11.536971 #796041] INFO -- : [329/885] 836924=test_gem_stub_specification I, [2024-05-11T08:14:11.704729 #796041] INFO -- : [330/885] 836922=test_float I, [2024-05-11T08:14:11.767396 #796041] INFO -- : [331/885] 836924=test_rdoc_top_level I, [2024-05-11T08:14:12.094433 #796041] INFO -- : [332/885] 836924=test_io_m17n I, [2024-05-11T08:14:13.203934 #796041] INFO -- : [333/885] 836924=test_color I, [2024-05-11T08:14:13.317990 #796041] INFO -- : [334/885] 836924=json_ext_parser_test I, [2024-05-11T08:14:13.322956 #796041] INFO -- : [335/885] 836924=test_gem_ext_configure_builder I, [2024-05-11T08:14:13.375438 #796041] INFO -- : [336/885] 836924=test_rdoc_parser_simple I, [2024-05-11T08:14:13.391871 #796041] INFO -- : [337/885] 836924=test_nonblock I, [2024-05-11T08:14:13.413054 #796041] INFO -- : [338/885] 836924=test_date_strptime I, [2024-05-11T08:14:13.530973 #796041] INFO -- : [339/885] 836924=test_omap I, [2024-05-11T08:14:13.536369 #796041] INFO -- : [340/885] 836924=test_ocsp I, [2024-05-11T08:14:13.644791 #796041] INFO -- : [341/885] 836924=test_scanner_events I, [2024-05-11T08:14:13.687321 #796041] INFO -- : [342/885] 836924=test_ipaddr I, [2024-05-11T08:14:13.711214 #796041] INFO -- : [343/885] 836924=test_rdoc_generator_pot_po I, [2024-05-11T08:14:13.719461 #796041] INFO -- : [344/885] 836924=test_mul I, [2024-05-11T08:14:13.729468 #796041] INFO -- : [345/885] 836924=test_shellwords I, [2024-05-11T08:14:13.733639 #796041] INFO -- : [346/885] 836924=test_https_proxy I, [2024-05-11T08:14:13.737744 #796041] INFO -- : [347/885] 836924=test_rdoc_parser I, [2024-05-11T08:14:13.770727 #796041] INFO -- : [348/885] 836924=test_win32ole_param_event I, [2024-05-11T08:14:13.772347 #796041] INFO -- : [349/885] 836924=test_stat I, [2024-05-11T08:14:13.784598 #796041] INFO -- : [350/885] 836924=test_nomethod_error I, [2024-05-11T08:14:13.785175 #796041] INFO -- : [351/885] 836924=test_gem_commands_rebuild_command I, [2024-05-11T08:14:13.864610 #796041] INFO -- : [352/885] 836924=test_etc I, [2024-05-11T08:14:13.944302 #796041] INFO -- : [353/885] 836924=test_workspace I, [2024-05-11T08:14:13.980903 #796041] INFO -- : [354/885] 836922=test_x509attr I, [2024-05-11T08:14:13.989012 #796041] INFO -- : [355/885] 836922=test_printf I, [2024-05-11T08:14:14.016646 #796041] INFO -- : [356/885] 836922=test_win32ole_variant I, [2024-05-11T08:14:14.024965 #796041] INFO -- : [357/885] 836922=magic_comment_test I, [2024-05-11T08:14:14.037457 #796041] INFO -- : [358/885] 836922=test_cgi_modruby I, [2024-05-11T08:14:14.045351 #796041] INFO -- : [359/885] 836922=test_uncorrectable_name_check I, [2024-05-11T08:14:14.062888 #796041] INFO -- : [360/885] 836922=test_io I, [2024-05-11T08:14:14.084089 #796041] INFO -- : [361/885] 836924=test_closure I, [2024-05-11T08:14:16.454652 #796041] INFO -- : [362/885] 836924=test_resolve_symbol I, [2024-05-11T08:14:16.515710 #796041] INFO -- : [363/885] 836924=test_rubygems I, [2024-05-11T08:14:16.645881 #796041] INFO -- : [364/885] 836924=test_dir I, [2024-05-11T08:14:16.960928 #796041] INFO -- : [365/885] 836924=test_files_test_1 I, [2024-05-11T08:14:16.969057 #796041] INFO -- : [366/885] 836924=test_rdoc_rd_inline I, [2024-05-11T08:14:16.976809 #796041] INFO -- : [367/885] 836924=test_path I, [2024-05-11T08:14:16.983843 #796041] INFO -- : [368/885] 836924=test_digest I, [2024-05-11T08:14:17.077705 #796041] INFO -- : [369/885] 836924=test_iseq I, [2024-05-11T08:14:17.619729 #796041] INFO -- : [370/885] 836924=test_parser I, [2024-05-11T08:14:17.641027 #796041] INFO -- : [371/885] 836924=test_rdoc_ri_paths I, [2024-05-11T08:14:17.668375 #796041] INFO -- : [372/885] 836924=test_primitive I, [2024-05-11T08:14:17.686070 #796041] INFO -- : [373/885] 836924=test_pair I, [2024-05-11T08:14:17.904109 #796041] INFO -- : [374/885] 836923=test_win32ole_variant_m I, [2024-05-11T08:14:17.927989 #796041] INFO -- : [375/885] 836923=test_env I, [2024-05-11T08:14:20.334550 #796041] INFO -- : [376/885] 836923=test_gem_commands_signout_command I, [2024-05-11T08:14:20.344426 #796041] INFO -- : [377/885] 836923=test_gem_package_tar_reader I, [2024-05-11T08:14:20.420900 #796041] INFO -- : [378/885] 836923=command_line_test I, [2024-05-11T08:14:20.424461 #796041] INFO -- : [379/885] 836923=test_singleton_function I, [2024-05-11T08:14:20.441186 #796041] INFO -- : [380/885] 836923=test_gem_safe_yaml I, [2024-05-11T08:14:20.453084 #796041] INFO -- : [381/885] 836923=test_eval I, [2024-05-11T08:14:20.461649 #796041] INFO -- : [382/885] 836923=test_document I, [2024-05-11T08:14:20.474306 #796041] INFO -- : [383/885] 836923=test_history I, [2024-05-11T08:14:20.576963 #796041] INFO -- : [384/885] 836923=test_gem_commands_setup_command I, [2024-05-11T08:14:21.301172 #796041] INFO -- : [385/885] 836923=test_sockopt I, [2024-05-11T08:14:21.314318 #796041] INFO -- : [386/885] 836923=test_ftp I, [2024-05-11T08:14:21.326173 #796041] INFO -- : [387/885] 836923=test_encoding I, [2024-05-11T08:14:21.379673 #796041] INFO -- : [388/885] 836923=test_install I, [2024-05-11T08:14:21.536811 #796041] INFO -- : [389/885] 836923=test_rdoc_comment I, [2024-05-11T08:14:21.602938 #796041] INFO -- : [390/885] 836923=test_gem_source_fetch_problem I, [2024-05-11T08:14:21.635090 #796041] INFO -- : [391/885] 836923=test_cgi_multipart I, [2024-05-11T08:14:21.789890 #796041] INFO -- : [392/885] 836923=test_lazy_enumerator I, [2024-05-11T08:14:22.226288 #796041] INFO -- : [393/885] 836923=test_gem_request_set_lockfile_tokenizer I, [2024-05-11T08:14:22.302433 #796041] INFO -- : [394/885] 836923=test_find_executable I, [2024-05-11T08:14:22.316710 #796041] INFO -- : [395/885] 836923=test_arithmetic_sequence I, [2024-05-11T08:14:22.393385 #796041] INFO -- : [396/885] 836923=test_ractor_compatibility I, [2024-05-11T08:14:22.684177 #796041] INFO -- : [397/885] 836923=integer_parse_test I, [2024-05-11T08:14:22.700646 #796041] INFO -- : [398/885] 836923=test_autoconf I, [2024-05-11T08:14:22.739651 #796041] INFO -- : [399/885] 836923=test_benchmark I, [2024-05-11T08:14:23.106905 #796041] INFO -- : [400/885] 836924=test_at_exit I, [2024-05-11T08:14:23.113349 #796041] INFO -- : [401/885] 836924=test_class I, [2024-05-11T08:14:23.120780 #796041] INFO -- : [402/885] 836924=test_mkmf I, [2024-05-11T08:14:23.156588 #796041] INFO -- : [403/885] 836924=test_gem_source I, [2024-05-11T08:14:23.639091 #796041] INFO -- : [404/885] 836924=test_have_macro I, [2024-05-11T08:14:23.859256 #796041] INFO -- : [405/885] 836924=test_autoload I, [2024-05-11T08:14:24.253530 #796041] INFO -- : [406/885] 836923=test_array I, [2024-05-11T08:14:27.314395 #796041] INFO -- : [407/885] 836922=test_gem_package I, [2024-05-11T08:14:28.121248 #796041] INFO -- : [408/885] 836922=test_unicode I, [2024-05-11T08:14:28.138988 #796041] INFO -- : [409/885] 836922=dispatcher_test I, [2024-05-11T08:14:28.149347 #796041] INFO -- : [410/885] 836922=test_eval_history I, [2024-05-11T08:14:28.162802 #796041] INFO -- : [411/885] 836922=test_ripper I, [2024-05-11T08:14:28.383640 #796041] INFO -- : [412/885] 836924=test_gem_source_git I, [2024-05-11T08:14:28.478632 #796041] INFO -- : [413/885] 836922=test_regex_casefold I, [2024-05-11T08:14:28.928687 #796041] INFO -- : [414/885] 836922=test_lexer I, [2024-05-11T08:14:28.936871 #796041] INFO -- : [415/885] 836922=test_win32ole_method I, [2024-05-11T08:14:28.949001 #796041] INFO -- : [416/885] 836922=test_random I, [2024-05-11T08:14:29.044652 #796041] INFO -- : [417/885] 836922=test_files_ext I, [2024-05-11T08:14:29.048066 #796041] INFO -- : [418/885] 836922=test_assembler I, [2024-05-11T08:14:29.068638 #796041] INFO -- : [419/885] 836922=test_stringio I, [2024-05-11T08:14:29.163997 #796041] INFO -- : [420/885] 836922=test_thread_cv I, [2024-05-11T08:14:29.420930 #796041] INFO -- : [421/885] 836924=test_safe_load I, [2024-05-11T08:14:29.459522 #796041] INFO -- : [422/885] 836924=ripper_test I, [2024-05-11T08:14:29.804559 #796041] INFO -- : [423/885] 836922=test_iso_8859 I, [2024-05-11T08:14:29.867639 #796041] INFO -- : [424/885] 836922=test_libs I, [2024-05-11T08:14:29.895059 #796041] INFO -- : [425/885] 836922=test_math I, [2024-05-11T08:14:29.913398 #796041] INFO -- : [426/885] 836924=test_gc I, [2024-05-11T08:14:29.914305 #796041] INFO -- : [427/885] 836924=comments_test I, [2024-05-11T08:14:29.920588 #796041] INFO -- : [428/885] 836924=test_qsort I, [2024-05-11T08:14:29.931798 #796041] INFO -- : [429/885] 836922=test_exit I, [2024-05-11T08:14:29.944727 #796041] INFO -- : [430/885] 836924=test_class I, [2024-05-11T08:14:30.016692 #796041] INFO -- : [431/885] 836922=test_rdoc_parser_rd I, [2024-05-11T08:14:30.054033 #796041] INFO -- : [432/885] 836922=index_write_test I, [2024-05-11T08:14:30.060186 #796041] INFO -- : [433/885] 836922=test_const I, [2024-05-11T08:14:30.069992 #796041] INFO -- : [434/885] 836922=test_recorder I, [2024-05-11T08:14:30.083986 #796041] INFO -- : [435/885] 836922=test_yaml_special_cases I, [2024-05-11T08:14:30.117058 #796041] INFO -- : [436/885] 836922=test_gem_commands_sources_command I, [2024-05-11T08:14:30.338565 #796041] INFO -- : [437/885] 836922=json_addition_test I, [2024-05-11T08:14:30.354795 #796041] INFO -- : [438/885] 836922=test_gem_source_list I, [2024-05-11T08:14:30.436353 #796041] INFO -- : [439/885] 836922=test_name_error I, [2024-05-11T08:14:30.619770 #796041] INFO -- : [440/885] 836922=test_sprintf I, [2024-05-11T08:14:30.792313 #796041] INFO -- : [441/885] 836922=test_enc_associate I, [2024-05-11T08:14:31.230236 #796041] INFO -- : [442/885] 836922=test_enumerator I, [2024-05-11T08:14:34.227455 #796041] INFO -- : [443/885] 836924=test_case I, [2024-05-11T08:14:34.266681 #796041] INFO -- : [444/885] 836924=test_open-uri I, [2024-05-11T08:14:34.584687 #796041] INFO -- : [445/885] 836923=test_array I, [2024-05-11T08:14:34.611887 #796041] INFO -- : [446/885] 836923=test_gem_command_manager I, [2024-05-11T08:14:34.698216 #796041] INFO -- : [447/885] 836924=test_rdoc_context I, [2024-05-11T08:14:34.766434 #796041] INFO -- : [448/885] 836923=test_rdoc_generator_json_index I, [2024-05-11T08:14:34.810814 #796041] INFO -- : [449/885] 836923=test_date_time I, [2024-05-11T08:14:34.827975 #796041] INFO -- : [450/885] 836923=test_nil2vtempty I, [2024-05-11T08:14:34.832882 #796041] INFO -- : [451/885] 836923=test_weakmap I, [2024-05-11T08:14:35.581924 #796041] INFO -- : [452/885] 836924=test_coderange I, [2024-05-11T08:14:35.586433 #796041] INFO -- : [453/885] 836924=test_ansi_with_terminfo I, [2024-05-11T08:14:35.598273 #796041] INFO -- : [454/885] 836924=test_inadvertent_creation I, [2024-05-11T08:14:35.689894 #796041] INFO -- : [455/885] 836924=test_framework I, [2024-05-11T08:14:35.742384 #796041] INFO -- : [456/885] 836924=test_pinned I, [2024-05-11T08:14:35.800696 #796041] INFO -- : [457/885] 836924=test_cgi_tag_helper I, [2024-05-11T08:14:35.852766 #796041] INFO -- : [458/885] 836924=test_pack I, [2024-05-11T08:14:35.919366 #796041] INFO -- : [459/885] 836924=test_stringchar I, [2024-05-11T08:14:35.931941 #796041] INFO -- : [460/885] 836924=warnings_test I, [2024-05-11T08:14:35.950904 #796041] INFO -- : [461/885] 836924=test_face I, [2024-05-11T08:14:35.978814 #796041] INFO -- : [462/885] 836924=test_gem_request_set_lockfile_parser I, [2024-05-11T08:14:36.984672 #796041] INFO -- : [463/885] 836924=test_sizeof I, [2024-05-11T08:14:38.575391 #796041] INFO -- : [464/885] 836924=test_date_attr I, [2024-05-11T08:14:38.589680 #796041] INFO -- : [465/885] 836924=test_gem_install_update_options I, [2024-05-11T08:14:38.820895 #796041] INFO -- : [466/885] 836924=test_econv I, [2024-05-11T08:14:39.743597 #796041] INFO -- : [467/885] 836924=test_gem_dependency_resolution_error I, [2024-05-11T08:14:39.775250 #796041] INFO -- : [468/885] 836924=test_fileutils I, [2024-05-11T08:14:40.324245 #796041] INFO -- : [469/885] 836924=test_sleep I, [2024-05-11T08:14:42.333287 #796041] INFO -- : [470/885] 836924=test_mixed_unicode_escapes I, [2024-05-11T08:14:42.341983 #796041] INFO -- : [471/885] 836924=test_jaro_winkler I, [2024-05-11T08:14:42.347349 #796041] INFO -- : [472/885] 836924=test_cp949 I, [2024-05-11T08:14:42.357867 #796041] INFO -- : [473/885] 836924=test_gem_resolver_vendor_set I, [2024-05-11T08:14:42.437785 #796041] INFO -- : [474/885] 836924=test_condition I, [2024-05-11T08:14:42.447414 #796041] INFO -- : [475/885] 836924=test_emoji I, [2024-05-11T08:14:42.544424 #796041] INFO -- : [476/885] 836924=test_sorted_set I, [2024-05-11T08:14:42.974233 #796041] INFO -- : [477/885] 836924=test_stack I, [2024-05-11T08:14:43.322809 #796041] INFO -- : [478/885] 836923=test_windows_1252 I, [2024-05-11T08:14:43.325556 #796041] INFO -- : [479/885] 836923=test_win32ole_variable I, [2024-05-11T08:14:43.326914 #796041] INFO -- : [480/885] 836923=test_method_cache I, [2024-05-11T08:14:43.342305 #796041] INFO -- : [481/885] 836923=test_parse I, [2024-05-11T08:14:43.798817 #796041] INFO -- : [482/885] 836924=test_rdoc_cross_reference I, [2024-05-11T08:14:43.820895 #796041] INFO -- : [483/885] 836923=test_rdoc_class_module I, [2024-05-11T08:14:44.209824 #796041] INFO -- : [484/885] 836924=test_gem_specification I, [2024-05-11T08:14:44.409979 #796041] INFO -- : [485/885] 836923=test_system I, [2024-05-11T08:14:45.273187 #796041] INFO -- : [486/885] 836923=test_numhash I, [2024-05-11T08:14:45.280028 #796041] INFO -- : [487/885] 836923=test_flush I, [2024-05-11T08:14:45.292264 #796041] INFO -- : [488/885] 836923=test_pkey_rsa I, [2024-05-11T08:14:45.585380 #796041] INFO -- : [489/885] 836923=test_parser_events I, [2024-05-11T08:14:45.686587 #796041] INFO -- : [490/885] 836923=test_filter I, [2024-05-11T08:14:45.720661 #796041] INFO -- : [491/885] 836923=test_json_tree I, [2024-05-11T08:14:45.735299 #796041] INFO -- : [492/885] 836923=test_koi8 I, [2024-05-11T08:14:45.759586 #796041] INFO -- : [493/885] 836923=test_gem_remote_fetcher I, [2024-05-11T08:14:47.068734 #796041] INFO -- : [494/885] 836924=test_pkcs12 I, [2024-05-11T08:14:47.684919 #796041] INFO -- : [495/885] 836923=test_yaml I, [2024-05-11T08:14:47.693737 #796041] INFO -- : [496/885] 836924=test_x509name I, [2024-05-11T08:14:47.697448 #796041] INFO -- : [497/885] 836924=test_argf I, [2024-05-11T08:14:47.778506 #796041] INFO -- : [498/885] 836923=test_method I, [2024-05-11T08:14:51.487408 #796041] INFO -- : [499/885] 836924=test_m17n I, [2024-05-11T08:14:51.618399 #796041] INFO -- : [500/885] 836924=test_gem_dependency I, [2024-05-11T08:14:51.854676 #796041] INFO -- : [501/885] 836924=test_yjit I, [2024-05-11T08:14:51.889310 #796041] INFO -- : [502/885] 836924=test_gem_uninstaller I, [2024-05-11T08:14:53.203798 #796041] INFO -- : [503/885] 836924=test_cclass I, [2024-05-11T08:14:53.271934 #796041] INFO -- : [504/885] 836924=test_rdoc_markup_to_rdoc I, [2024-05-11T08:14:53.322807 #796041] INFO -- : [505/885] 836924=test_str2big I, [2024-05-11T08:14:53.342091 #796041] INFO -- : [506/885] 836924=test_gem_package_tar_writer I, [2024-05-11T08:14:53.550393 #796041] INFO -- : [507/885] 836924=test_ractor I, [2024-05-11T08:14:53.551078 #796041] INFO -- : [508/885] 836924=test_case I, [2024-05-11T08:14:53.556531 #796041] INFO -- : [509/885] 836924=test_severity I, [2024-05-11T08:14:53.563205 #796041] INFO -- : [510/885] 836924=attribute_write_test I, [2024-05-11T08:14:53.574550 #796041] INFO -- : [511/885] 836924=test_utf16 I, [2024-05-11T08:14:53.595320 #796041] INFO -- : [512/885] 836924=test_http I, [2024-05-11T08:14:58.059998 #796041] INFO -- : [513/885] 836923=test_set I, [2024-05-11T08:14:58.080254 #796041] INFO -- : [514/885] 836923=test_gem_gemcutter_utilities I, [2024-05-11T08:14:58.523019 #796041] INFO -- : [515/885] 836923=desugar_compiler_test I, [2024-05-11T08:14:58.550305 #796041] INFO -- : [516/885] 836923=test_gem_source_local I, [2024-05-11T08:14:58.779907 #796041] INFO -- : [517/885] 836923=test_internal_ivar I, [2024-05-11T08:14:58.787106 #796041] INFO -- : [518/885] 836923=test_win32ole I, [2024-05-11T08:14:58.794725 #796041] INFO -- : [519/885] 836923=test_rendering I, [2024-05-11T08:14:58.819698 #796041] INFO -- : [520/885] 836923=test_settracefunc I, [2024-05-11T08:14:59.851242 #796041] INFO -- : [521/885] 836923=test_gem_text I, [2024-05-11T08:14:59.917189 #796041] INFO -- : [522/885] 836923=test_tracepoint I, [2024-05-11T08:15:00.242313 #796041] INFO -- : [523/885] 836923=test_backtrace I, [2024-05-11T08:15:01.583032 #796041] INFO -- : [524/885] 836923=test_rdoc_task I, [2024-05-11T08:15:01.606658 #796041] INFO -- : [525/885] 836923=locals_test I, [2024-05-11T08:15:02.079379 #796041] INFO -- : [526/885] 836923=test_gem_commands_push_command I, [2024-05-11T08:15:02.192332 #796041] INFO -- : [527/885] 836924=test_sprintf_comb I, [2024-05-11T08:15:02.344926 #796041] INFO -- : [528/885] 836924=test_method_cache I, [2024-05-11T08:15:02.364554 #796041] INFO -- : [529/885] 836924=test_too_many_dummy_encodings I, [2024-05-11T08:15:02.415092 #796041] INFO -- : [530/885] 836924=test_scan_args I, [2024-05-11T08:15:02.432630 #796041] INFO -- : [531/885] 836924=test_gem_commands_specification_command I, [2024-05-11T08:15:02.594344 #796041] INFO -- : [532/885] 836924=encoding_test I, [2024-05-11T08:15:02.669678 #796041] INFO -- : [533/885] 836924=test_gem_package_old I, [2024-05-11T08:15:02.704315 #796041] INFO -- : [534/885] 836923=test_gem_commands_which_command I, [2024-05-11T08:15:02.725042 #796041] INFO -- : [535/885] 836924=test_gem_request I, [2024-05-11T08:15:02.761542 #796041] INFO -- : [536/885] 836923=test_gem_dependency_installer I, [2024-05-11T08:15:03.105238 #796041] INFO -- : [537/885] 836924=test_pty I, [2024-05-11T08:15:03.500311 #796041] INFO -- : [538/885] 836924=parser_test I, [2024-05-11T08:15:03.521346 #796041] INFO -- : [539/885] 836924=test_hash I, [2024-05-11T08:15:05.493034 #796041] INFO -- : [540/885] 836923=test_http I, [2024-05-11T08:15:05.503949 #796041] INFO -- : [541/885] 836923=test_mdns I, [2024-05-11T08:15:05.575740 #796041] INFO -- : [542/885] 836923=test_open3 I, [2024-05-11T08:15:07.344000 #796041] INFO -- : [543/885] 836924=test_date_parse I, [2024-05-11T08:15:07.407502 #796041] INFO -- : [544/885] 836924=test_key_event_record I, [2024-05-11T08:15:07.415948 #796041] INFO -- : [545/885] 836924=test_pkey_ec I, [2024-05-11T08:15:07.441781 #796041] INFO -- : [546/885] 836924=test_svcb_https I, [2024-05-11T08:15:07.449319 #796041] INFO -- : [547/885] 836924=test_buffering I, [2024-05-11T08:15:07.480221 #796041] INFO -- : [548/885] 836924=test_arity I, [2024-05-11T08:15:07.486279 #796041] INFO -- : [549/885] 836924=test_thread I, [2024-05-11T08:15:07.514390 #796041] INFO -- : [550/885] 836924=test_rational I, [2024-05-11T08:15:07.575362 #796041] INFO -- : [551/885] 836924=test_case_mapping I, [2024-05-11T08:15:07.616566 #796041] INFO -- : [552/885] 836924=test_gem_ext_cargo_builder_unit I, [2024-05-11T08:15:07.664271 #796041] INFO -- : [553/885] 836924=test_webauthn_listener I, [2024-05-11T08:15:07.666932 #796041] INFO -- : Leaked file descriptor: WebauthnListenerTest#test_wait_for_otp_code_get_follows_options: 14 : # I, [2024-05-11T08:15:07.697935 #796041] INFO -- : COMMAND PID USER FD TYPE DEVICE SIZE/OFF NODE NAME I, [2024-05-11T08:15:07.698007 #796041] INFO -- : ruby 836924 opc 14u IPv4 2932112075 0t0 TCP localhost:46347->localhost:38138 (CLOSE_WAIT) I, [2024-05-11T08:15:07.820665 #796041] INFO -- : Closed file descriptor: WebauthnListenerTest#test_wait_for_otp_code_invalid_post_req_method: 14 I, [2024-05-11T08:15:07.841251 #796041] INFO -- : [554/885] 836924=test_ractor I, [2024-05-11T08:15:07.851434 #796041] INFO -- : [555/885] 836924=test_rdoc_rubygems_hook I, [2024-05-11T08:15:07.949222 #796041] INFO -- : [556/885] 836924=test_gem_resolver_api_specification I, [2024-05-11T08:15:08.054119 #796041] INFO -- : [557/885] 836924=test_tree_spell_checker I, [2024-05-11T08:15:08.102189 #796041] INFO -- : [558/885] 836924=static_literals_test I, [2024-05-11T08:15:08.108531 #796041] INFO -- : [559/885] 836924=test_enumerable I, [2024-05-11T08:15:08.124611 #796041] INFO -- : [560/885] 836924=test_rdoc_method_attr I, [2024-05-11T08:15:08.242860 #796041] INFO -- : [561/885] 836924=test_set I, [2024-05-11T08:15:08.262369 #796041] INFO -- : [562/885] 836924=test_grapheme_breaks I, [2024-05-11T08:15:08.264456 #796041] INFO -- : [563/885] 836923=test_hash_create I, [2024-05-11T08:15:08.282775 #796041] INFO -- : [564/885] 836923=test_unicode_escape I, [2024-05-11T08:15:08.342419 #796041] INFO -- : [565/885] 836924=test_default_gems I, [2024-05-11T08:15:08.349482 #796041] INFO -- : [566/885] 836923=test_switch_hitter I, [2024-05-11T08:15:08.356207 #796041] INFO -- : [567/885] 836924=test_yamldbm I, [2024-05-11T08:15:08.358367 #796041] INFO -- : [568/885] 836924=test_gem_spec_fetcher I, [2024-05-11T08:15:08.378643 #796041] INFO -- : [569/885] 836923=test_gem_commands_dependency_command I, [2024-05-11T08:15:08.489064 #796041] INFO -- : [570/885] 836923=test_backtrace I, [2024-05-11T08:15:08.547017 #796041] INFO -- : [571/885] 836923=test_gbk I, [2024-05-11T08:15:08.552059 #796041] INFO -- : [572/885] 836923=test_ole_methods I, [2024-05-11T08:15:08.555818 #796041] INFO -- : [573/885] 836923=test_cgi_util I, [2024-05-11T08:15:08.613945 #796041] INFO -- : [574/885] 836924=test_gem_uri_formatter I, [2024-05-11T08:15:08.643631 #796041] INFO -- : [575/885] 836924=test_prettyprint I, [2024-05-11T08:15:08.695402 #796041] INFO -- : [576/885] 836924=test_enc_raise I, [2024-05-11T08:15:08.705788 #796041] INFO -- : [577/885] 836924=test_clone I, [2024-05-11T08:15:08.810339 #796041] INFO -- : [578/885] 836923=test_gem_resolver_lock_specification I, [2024-05-11T08:15:08.853296 #796041] INFO -- : [579/885] 836923=test_boolean I, [2024-05-11T08:15:08.868701 #796041] INFO -- : [580/885] 836923=test_queue I, [2024-05-11T08:15:08.872813 #796041] INFO -- : [581/885] 836923=test_gc_compact I, [2024-05-11T08:15:08.883626 #796041] INFO -- : [582/885] 836924=test_rdoc_i18n_locale I, [2024-05-11T08:15:08.895923 #796041] INFO -- : [583/885] 836924=test_dryrun I, [2024-05-11T08:15:08.934678 #796041] INFO -- : [584/885] 836924=test_yield I, [2024-05-11T08:15:11.970735 #796041] INFO -- : [585/885] 836924=test_remote_fetch_error I, [2024-05-11T08:15:12.008817 #796041] INFO -- : [586/885] 836924=test_show_source I, [2024-05-11T08:15:12.022376 #796041] INFO -- : [587/885] 836924=regexp_test I, [2024-05-11T08:15:12.110386 #796041] INFO -- : [588/885] 836924=test_optimization I, [2024-05-11T08:15:12.492359 #796041] INFO -- : [589/885] 836922=test_force_exit I, [2024-05-11T08:15:12.494015 #796041] INFO -- : [590/885] 836922=test_files_sample I, [2024-05-11T08:15:12.505901 #796041] INFO -- : [591/885] 836922=test_rdoc_stats I, [2024-05-11T08:15:12.541678 #796041] INFO -- : [592/885] 836922=test_data_error I, [2024-05-11T08:15:12.590935 #796041] INFO -- : [593/885] 836923=test_rubyoptions I, [2024-05-11T08:15:12.612082 #796041] INFO -- : [594/885] 836922=test_shift_jis I, [2024-05-11T08:15:12.640431 #796041] INFO -- : [595/885] 836922=test_rdoc_store I, [2024-05-11T08:15:13.251007 #796041] INFO -- : [596/885] 836922=test_gem_update_suggestion I, [2024-05-11T08:15:13.355740 #796041] INFO -- : [597/885] 836922=test_assignment I, [2024-05-11T08:15:14.624989 #796041] INFO -- : [598/885] 836922=test_gem_commands_open_command I, [2024-05-11T08:15:14.730464 #796041] INFO -- : [599/885] 836922=test_verbose I, [2024-05-11T08:15:14.756839 #796041] INFO -- : [600/885] 836922=test_emoji_breaks I, [2024-05-11T08:15:14.759228 #796041] INFO -- : [601/885] 836922=test_normalize I, [2024-05-11T08:15:14.769399 #796041] INFO -- : [602/885] 836922=test_undef I, [2024-05-11T08:15:14.778505 #796041] INFO -- : [603/885] 836922=test_random I, [2024-05-11T08:15:14.791469 #796041] INFO -- : [604/885] 836922=test_gem_resolver_lock_set I, [2024-05-11T08:15:14.823702 #796041] INFO -- : [605/885] 836922=test_rdoc_generator_darkfish I, [2024-05-11T08:15:15.255414 #796041] INFO -- : [606/885] 836922=test_asn1 I, [2024-05-11T08:15:15.290863 #796041] INFO -- : [607/885] 836922=test_gem_command I, [2024-05-11T08:15:15.430801 #796041] INFO -- : [608/885] 836922=memsize_test I, [2024-05-11T08:15:15.447454 #796041] INFO -- : [609/885] 836922=test_gem_resolver_requirement_list I, [2024-05-11T08:15:15.449410 #796041] INFO -- : [610/885] 836922=test_noarg I, [2024-05-11T08:15:15.586212 #796041] INFO -- : [611/885] 836922=test_exception I, [2024-05-11T08:15:15.609558 #796041] INFO -- : [612/885] 836922=test_arith_seq_beg_len_step I, [2024-05-11T08:15:15.672417 #796041] INFO -- : [613/885] 836922=test_raise_exception I, [2024-05-11T08:15:16.274650 #796041] INFO -- : [614/885] 836922=test_gem_impossible_dependencies_error I, [2024-05-11T08:15:16.290251 #796041] INFO -- : [615/885] 836922=test_pp I, [2024-05-11T08:15:16.391437 #796041] INFO -- : [616/885] 836922=test_gem_security I, [2024-05-11T08:15:18.605497 #796041] INFO -- : [617/885] 836924=test_key_actor_emacs I, [2024-05-11T08:15:18.767353 #796041] INFO -- : [618/885] 836924=test_date_ractor I, [2024-05-11T08:15:18.781820 #796041] INFO -- : [619/885] 836923=test_erb I, [2024-05-11T08:15:18.841946 #796041] INFO -- : [620/885] 836923=test_basicinstructions I, [2024-05-11T08:15:18.925572 #796041] INFO -- : [621/885] 836923=test_gem_resolver_git_specification I, [2024-05-11T08:15:18.980164 #796041] INFO -- : [622/885] 836924=test_utf32 I, [2024-05-11T08:15:18.991949 #796041] INFO -- : [623/885] 836924=test_rdoc_tom_doc I, [2024-05-11T08:15:19.022304 #796041] INFO -- : [624/885] 836924=test_optarg I, [2024-05-11T08:15:19.194968 #796041] INFO -- : [625/885] 836924=test_gem_commands_pristine_command I, [2024-05-11T08:15:19.261376 #796041] INFO -- : [626/885] 836923=test_variable I, [2024-05-11T08:15:19.366161 #796041] INFO -- : [627/885] 836923=test_hash I, [2024-05-11T08:15:19.397645 #796041] INFO -- : [628/885] 836923=test_gem_commands_install_command I, [2024-05-11T08:15:20.494391 #796041] INFO -- : [629/885] 836924=test_string I, [2024-05-11T08:15:20.498448 #796041] INFO -- : [630/885] 836924=test_iterator I, [2024-05-11T08:15:20.605228 #796041] INFO -- : [631/885] 836924=pattern_test I, [2024-05-11T08:15:20.627355 #796041] INFO -- : [632/885] 836924=test_dot_dot I, [2024-05-11T08:15:20.633039 #796041] INFO -- : [633/885] 836924=test_gem_rdoc I, [2024-05-11T08:15:20.830840 #796041] INFO -- : [634/885] 836924=test_rendering I, [2024-05-11T08:15:20.860731 #796041] INFO -- : [635/885] 836924=test_kernel I, [2024-05-11T08:15:21.246368 #796041] INFO -- : [636/885] 836923=test_cesu8 I, [2024-05-11T08:15:21.264928 #796041] INFO -- : [637/885] 836923=test_rdoc_extend I, [2024-05-11T08:15:21.285246 #796041] INFO -- : [638/885] 836923=test_did_you_mean I, [2024-05-11T08:15:21.398557 #796041] INFO -- : [639/885] 836923=test_shapes I, [2024-05-11T08:15:21.408344 #796041] INFO -- : [640/885] 836923=test_merge_keys I, [2024-05-11T08:15:21.418259 #796041] INFO -- : [641/885] 836923=test_storage I, [2024-05-11T08:15:21.427217 #796041] INFO -- : [642/885] 836923=test_err_in_callback I, [2024-05-11T08:15:21.443382 #796041] INFO -- : [643/885] 836923=test_method_name_check I, [2024-05-11T08:15:21.456636 #796041] INFO -- : [644/885] 836924=test_threadgroup I, [2024-05-11T08:15:21.492787 #796041] INFO -- : [645/885] 836923=test_complex I, [2024-05-11T08:15:21.565161 #796041] INFO -- : [646/885] 836923=test_array_create I, [2024-05-11T08:15:21.627127 #796041] INFO -- : [647/885] 836923=test_memory_view I, [2024-05-11T08:15:22.061021 #796041] INFO -- : [648/885] 836923=test_dir_m17n I, [2024-05-11T08:15:22.470074 #796041] INFO -- : [649/885] 836924=!Nothing_to_test I, [2024-05-11T08:15:22.471706 #796041] INFO -- : [650/885] 836924=test_fd_setsize I, [2024-05-11T08:15:22.482319 #796041] INFO -- : [651/885] 836924=test_forwardable I, [2024-05-11T08:15:22.526085 #796041] INFO -- : [652/885] 836924=test_process I, [2024-05-11T08:15:22.544007 #796041] INFO -- : [653/885] 836924=test_securerandom I, [2024-05-11T08:15:22.582634 #796041] INFO -- : [654/885] 836924=test_tsort I, [2024-05-11T08:15:22.609814 #796041] INFO -- : [655/885] 836924=test_gem_commands_fetch_command I, [2024-05-11T08:15:22.805356 #796041] INFO -- : [656/885] 836924=test_typeddata I, [2024-05-11T08:15:23.048726 #796041] INFO -- : [657/885] 836924=parameters_signature_test I, [2024-05-11T08:15:23.081280 #796041] INFO -- : [658/885] 836924=test_rdoc_parser_changelog I, [2024-05-11T08:15:23.168371 #796041] INFO -- : [659/885] 836924=test_gem_commands_outdated_command I, [2024-05-11T08:15:23.203262 #796041] INFO -- : [660/885] 836923=test_gem_dependency_list I, [2024-05-11T08:15:23.208595 #796041] INFO -- : [661/885] 836924=test_len I, [2024-05-11T08:15:23.217949 #796041] INFO -- : [662/885] 836924=test_gem_doctor I, [2024-05-11T08:15:23.295050 #796041] INFO -- : [663/885] 836923=json_fixtures_test I, [2024-05-11T08:15:23.298152 #796041] INFO -- : [664/885] 836923=parse_test I, [2024-05-11T08:15:23.307439 #796041] INFO -- : [665/885] 836924=test_kwargs I, [2024-05-11T08:15:23.322950 #796041] INFO -- : [666/885] 836924=test_rdoc_parser_c I, [2024-05-11T08:15:23.688727 #796041] INFO -- : [667/885] 836924=test_pack I, [2024-05-11T08:15:23.942397 #796041] INFO -- : [668/885] 836924=test_io_wait I, [2024-05-11T08:15:24.282874 #796041] INFO -- : [669/885] 836924=test_process I, [2024-05-11T08:15:26.362269 #796041] INFO -- : [670/885] 836922=test_rdoc_code_object I, [2024-05-11T08:15:26.402881 #796041] INFO -- : [671/885] 836923=test_bmethod I, [2024-05-11T08:15:26.410816 #796041] INFO -- : [672/885] 836923=test_gem_source_specific_file I, [2024-05-11T08:15:26.579806 #796041] INFO -- : [673/885] 836923=test_provider I, [2024-05-11T08:15:26.588266 #796041] INFO -- : [674/885] 836923=test_euc_kr I, [2024-05-11T08:15:26.597061 #796041] INFO -- : [675/885] 836923=test_rand I, [2024-05-11T08:15:26.740849 #796041] INFO -- : [676/885] 836922=test_random_formatter I, [2024-05-11T08:15:26.764246 #796041] INFO -- : [677/885] 836922=test_string_processing I, [2024-05-11T08:15:26.776774 #796041] INFO -- : [678/885] 836922=redundant_return_test I, [2024-05-11T08:15:26.786230 #796041] INFO -- : [679/885] 836922=test_rdoc_markup_attributes I, [2024-05-11T08:15:26.802042 #796041] INFO -- : [680/885] 836922=test_deprecate I, [2024-05-11T08:15:26.855521 #796041] INFO -- : [681/885] 836922=test_rdoc_constant I, [2024-05-11T08:15:26.943686 #796041] INFO -- : [682/885] 836922=test_httpresponses I, [2024-05-11T08:15:26.961006 #796041] INFO -- : [683/885] 836922=test_common I, [2024-05-11T08:15:27.046621 #796041] INFO -- : [684/885] 836923=test_rdoc_markup_to_html_snippet I, [2024-05-11T08:15:27.117835 #796041] INFO -- : [685/885] 836922=test_generic I, [2024-05-11T08:15:27.132154 #796041] INFO -- : [686/885] 836923=test_rdoc_encoding I, [2024-05-11T08:15:27.148743 #796041] INFO -- : [687/885] 836922=test_win32ole_variant_outarg I, [2024-05-11T08:15:27.152336 #796041] INFO -- : [688/885] 836922=test_gem_request_set_lockfile I, [2024-05-11T08:15:27.200107 #796041] INFO -- : [689/885] 836923=test_rdoc_markdown I, [2024-05-11T08:15:27.514097 #796041] INFO -- : [690/885] 836923=test_key_actor_vi I, [2024-05-11T08:15:27.627463 #796041] INFO -- : [691/885] 836923=test_postponed_job I, [2024-05-11T08:15:27.697911 #796041] INFO -- : [692/885] 836922=test_rdoc_markup_indented_paragraph I, [2024-05-11T08:15:27.712952 #796041] INFO -- : [693/885] 836922=test_rdoc_markup_parser I, [2024-05-11T08:15:27.771843 #796041] INFO -- : [694/885] 836922=test_iseq_load I, [2024-05-11T08:15:27.925574 #796041] INFO -- : [695/885] 836923=test_ns_spki I, [2024-05-11T08:15:27.935022 #796041] INFO -- : [696/885] 836923=test_stream I, [2024-05-11T08:15:28.210875 #796041] INFO -- : [697/885] 836923=test_have_library I, [2024-05-11T08:15:28.861015 #796041] INFO -- : [698/885] 836923=test_objspace I, [2024-05-11T08:15:28.890540 #796041] INFO -- : [699/885] 836922=test_require I, [2024-05-11T08:15:28.900288 #796041] INFO -- : [700/885] 836922=test_stringify_symbols I, [2024-05-11T08:15:28.914308 #796041] INFO -- : [701/885] 836922=library_symbols_test I, [2024-05-11T08:15:28.924975 #796041] INFO -- : [702/885] 836922=test_rdoc_text I, [2024-05-11T08:15:28.954649 #796041] INFO -- : [703/885] 836922=test_zsh_completion I, [2024-05-11T08:15:28.968686 #796041] INFO -- : [704/885] 836922=test_basicsocket I, [2024-05-11T08:15:28.985509 #796041] INFO -- : [705/885] 836922=test_class_name_check I, [2024-05-11T08:15:29.052797 #796041] INFO -- : [706/885] 836922=test_syntax I, [2024-05-11T08:15:39.759084 #796041] INFO -- : [707/885] 836922=test_scalar I, [2024-05-11T08:15:39.772880 #796041] INFO -- : [708/885] 836922=test_pack I, [2024-05-11T08:15:39.949722 #796041] INFO -- : [709/885] 836922=test_gem_commands_environment_command I, [2024-05-11T08:15:40.035050 #796041] INFO -- : [710/885] 836922=test_pkcs7 I, [2024-05-11T08:15:40.186618 #796041] INFO -- : [711/885] 836922=test_optparse I, [2024-05-11T08:15:40.194933 #796041] INFO -- : [712/885] 836922=test_rdoc_context_section I, [2024-05-11T08:15:40.212688 #796041] INFO -- : [713/885] 836922=test_io_buffer I, [2024-05-11T08:15:40.332084 #796041] INFO -- : [714/885] 836922=test_deprecated I, [2024-05-11T08:15:40.349800 #796041] INFO -- : [715/885] 836922=test_rdoc_markup_to_html_crossref I, [2024-05-11T08:15:40.705050 #796041] INFO -- : [716/885] 836922=test_files_test_2 I, [2024-05-11T08:15:40.716863 #796041] INFO -- : [717/885] 836922=test_div I, [2024-05-11T08:15:40.726106 #796041] INFO -- : [718/885] 836922=test_bash_completion I, [2024-05-11T08:15:40.744582 #796041] INFO -- : [719/885] 836922=test_exception I, [2024-05-11T08:15:41.537075 #796041] INFO -- : [720/885] 836924=test_gem_ext_rake_builder I, [2024-05-11T08:15:42.041270 #796041] INFO -- : [721/885] 836924=test_rdoc_require I, [2024-05-11T08:15:42.047394 #796041] INFO -- : [722/885] 836924=test_word I, [2024-05-11T08:15:42.056668 #796041] INFO -- : [723/885] 836924=test_singleton I, [2024-05-11T08:15:42.068644 #796041] INFO -- : [724/885] 836924=test_fstring I, [2024-05-11T08:15:42.186550 #796041] INFO -- : [725/885] 836924=test_numeric I, [2024-05-11T08:15:42.390072 #796041] INFO -- : [726/885] 836924=test_weakref I, [2024-05-11T08:15:45.582959 #796041] INFO -- : [727/885] 836924=test_instrumentation_api I, [2024-05-11T08:15:45.598799 #796041] INFO -- : [728/885] 836924=test_rdoc_alias I, [2024-05-11T08:15:45.616830 #796041] INFO -- : [729/885] 836924=test_timeout I, [2024-05-11T08:15:46.433268 #796041] INFO -- : [730/885] 836924=test_rdoc_markup_to_bs I, [2024-05-11T08:15:46.480645 #796041] INFO -- : [731/885] 836924=test_key_name_check I, [2024-05-11T08:15:46.488151 #796041] INFO -- : [732/885] 836924=test_rdoc_markup_raw I, [2024-05-11T08:15:46.497495 #796041] INFO -- : [733/885] 836924=test_rdoc_markup_to_tt_only I, [2024-05-11T08:15:46.530507 #796041] INFO -- : [734/885] 836924=test_ws I, [2024-05-11T08:15:46.544917 #796041] INFO -- : [735/885] 836924=test_date_strftime I, [2024-05-11T08:15:46.918967 #796041] INFO -- : [736/885] 836922=json_parser_test I, [2024-05-11T08:15:46.964643 #796041] INFO -- : [737/885] 836922=test_gem_commands_stale_command I, [2024-05-11T08:15:46.970376 #796041] INFO -- : [738/885] 836922=ruby_parser_test I, [2024-05-11T08:15:46.976763 #796041] INFO -- : [739/885] 836922=test_gem_commands_cert_command I, [2024-05-11T08:15:46.990602 #796041] INFO -- : [740/885] 836924=test_pkey I, [2024-05-11T08:15:46.998379 #796041] INFO -- : [741/885] 836924=test_external_new I, [2024-05-11T08:15:47.005287 #796041] INFO -- : [742/885] 836924=test_win32ole_typelib I, [2024-05-11T08:15:47.006394 #796041] INFO -- : [743/885] 836924=test_gem_commands_query_command I, [2024-05-11T08:15:47.763888 #796041] INFO -- : [744/885] 836924=test_gem_platform I, [2024-05-11T08:15:47.947951 #796041] INFO -- : [745/885] 836924=test_bigzero I, [2024-05-11T08:15:47.957822 #796041] INFO -- : [746/885] 836924=test_data I, [2024-05-11T08:15:47.972119 #796041] INFO -- : [747/885] 836924=test_memory_view I, [2024-05-11T08:15:47.986068 #796041] INFO -- : [748/885] 836924=test_null I, [2024-05-11T08:15:48.048156 #796041] INFO -- : [749/885] 836924=test_ractor I, [2024-05-11T08:15:48.099187 #796041] INFO -- : [750/885] 836924=test_m17n_comb I, [2024-05-11T08:15:48.722350 #796041] INFO -- : [751/885] 836922=test_multi_irb_commands I, [2024-05-11T08:15:48.733837 #796041] INFO -- : [752/885] 836922=test_pkey_dh I, [2024-05-11T08:15:50.076221 #796041] INFO -- : [753/885] 836922=test_input_method I, [2024-05-11T08:15:50.126421 #796041] INFO -- : [754/885] 836922=test_rdoc_i18n_text I, [2024-05-11T08:15:50.220797 #796041] INFO -- : [755/885] 836922=test_io I, [2024-05-11T08:15:50.417299 #796041] INFO -- : [756/885] 836922=test_gem_unsatisfiable_dependency_error I, [2024-05-11T08:15:50.452628 #796041] INFO -- : [757/885] 836922=test_literal I, [2024-05-11T08:15:51.058127 #796041] INFO -- : [758/885] 836922=test_gem_security_signer I, [2024-05-11T08:15:51.069678 #796041] INFO -- : [759/885] 836924=test_config I, [2024-05-11T08:15:51.132454 #796041] INFO -- : [760/885] 836924=test_complex2 I, [2024-05-11T08:15:51.141222 #796041] INFO -- : [761/885] 836924=test_gem_util I, [2024-05-11T08:15:51.179855 #796041] INFO -- : [762/885] 836922=test_thread I, [2024-05-11T08:15:51.327320 #796041] INFO -- : [763/885] 836924=test_timeout I, [2024-05-11T08:15:51.335698 #796041] INFO -- : [764/885] 836924=test_erb_m17n I, [2024-05-11T08:15:51.341538 #796041] INFO -- : [765/885] 836924=test_rdoc_generator_pot_po_entry I, [2024-05-11T08:15:51.352844 #796041] INFO -- : [766/885] 836924=test_serialize_subclasses I, [2024-05-11T08:15:51.370824 #796041] INFO -- : [767/885] 836924=test_gem_resolver_index_specification I, [2024-05-11T08:15:51.414582 #796041] INFO -- : [768/885] 836922=test_frozen I, [2024-05-11T08:15:51.465968 #796041] INFO -- : [769/885] 836922=test_egrep_cpp I, [2024-05-11T08:15:51.504900 #796041] INFO -- : [770/885] 836924=test_webauthn_poller I, [2024-05-11T08:15:51.551848 #796041] INFO -- : [771/885] 836922=test_rdoc_markup_verbatim I, [2024-05-11T08:15:51.560612 #796041] INFO -- : [772/885] 836922=test_date_conv I, [2024-05-11T08:15:51.571305 #796041] INFO -- : [773/885] 836922=test_protect I, [2024-05-11T08:15:51.578962 #796041] INFO -- : [774/885] 836922=test_big5 I, [2024-05-11T08:15:51.588400 #796041] INFO -- : [775/885] 836922=test_date I, [2024-05-11T08:15:51.628201 #796041] INFO -- : [776/885] 836922=test_gem_commands_update_command I, [2024-05-11T08:15:51.681933 #796041] INFO -- : [777/885] 836924=test_tree_builder I, [2024-05-11T08:15:51.700817 #796041] INFO -- : [778/885] 836924=test_store I, [2024-05-11T08:15:52.058848 #796041] INFO -- : [779/885] 836924=test_rdoc_markup_pre_process I, [2024-05-11T08:15:52.220434 #796041] INFO -- : [780/885] 836924=test_tempfile I, [2024-05-11T08:15:52.457467 #796041] INFO -- : [781/885] 836924=test_http_request I, [2024-05-11T08:15:52.468942 #796041] INFO -- : [782/885] 836924=test_coverage I, [2024-05-11T08:15:53.188712 #796041] INFO -- : [783/885] 836924=test_pathname I, [2024-05-11T08:15:53.465443 #796041] INFO -- : [784/885] 836922=test_fnmatch I, [2024-05-11T08:15:53.478501 #796041] INFO -- : [785/885] 836924=test_rdoc_any_method I, [2024-05-11T08:15:53.520420 #796041] INFO -- : [786/885] 836922=test_error_highlight I, [2024-05-11T08:15:53.916423 #796041] INFO -- : [787/885] 836924=test_function_entry I, [2024-05-11T08:15:53.916572 #796041] INFO -- : [788/885] 836924=test_string I, [2024-05-11T08:15:53.936946 #796041] INFO -- : [789/885] 836924=json_common_interface_test I, [2024-05-11T08:15:53.958800 #796041] INFO -- : [790/885] 836924=version_test I, [2024-05-11T08:15:53.970947 #796041] INFO -- : [791/885] 836924=test_complexrational I, [2024-05-11T08:15:53.974294 #796041] INFO -- : [792/885] 836924=test_raise I, [2024-05-11T08:15:53.977550 #796041] INFO -- : [793/885] 836924=test_string_memory I, [2024-05-11T08:15:54.092316 #796041] INFO -- : [794/885] 836922=test_help I, [2024-05-11T08:15:54.094568 #796041] INFO -- : [795/885] 836922=test_files_lib I, [2024-05-11T08:15:54.103337 #796041] INFO -- : [796/885] 836922=test_marshalable I, [2024-05-11T08:15:54.113282 #796041] INFO -- : [797/885] 836922=test_line_editor I, [2024-05-11T08:15:54.125547 #796041] INFO -- : [798/885] 836922=reflection_test I, [2024-05-11T08:15:54.138671 #796041] INFO -- : [799/885] 836922=test_enumerator_kw I, [2024-05-11T08:15:54.160138 #796041] INFO -- : [800/885] 836922=test_cstr I, [2024-05-11T08:15:54.251026 #796041] INFO -- : [801/885] 836924=test_gem_resolver_dependency_request I, [2024-05-11T08:15:54.311422 #796041] INFO -- : [802/885] 836924=test_command I, [2024-05-11T08:15:54.574407 #796041] INFO -- : [803/885] 836924=test_euc_tw I, [2024-05-11T08:15:54.593418 #796041] INFO -- : [804/885] 836924=test_gem_commands_yank_command I, [2024-05-11T08:15:55.162461 #796041] INFO -- : [805/885] 836924=test_yaml_tree I, [2024-05-11T08:15:55.197690 #796041] INFO -- : [806/885] 836924=test_pkey_dsa I, [2024-05-11T08:15:57.472655 #796041] INFO -- : [807/885] 836922=test_logger I, [2024-05-11T08:15:57.495600 #796041] INFO -- : [808/885] 836922=test_big2str I, [2024-05-11T08:15:57.520118 #796041] INFO -- : [809/885] 836922=test_gem_resolver_specification I, [2024-05-11T08:15:57.541838 #796041] INFO -- : [810/885] 836922=test_wait I, [2024-05-11T08:15:57.692770 #796041] INFO -- : [811/885] 836922=test_import I, [2024-05-11T08:16:02.090719 #796041] INFO -- : [812/885] 836922=test_human_typo I, [2024-05-11T08:16:02.101924 #796041] INFO -- : [813/885] 836922=test_psych I, [2024-05-11T08:16:02.134091 #796041] INFO -- : [814/885] 836922=test_nil I, [2024-05-11T08:16:02.145630 #796041] INFO -- : [815/885] 836922=test_io_buffer I, [2024-05-11T08:16:02.248737 #796041] INFO -- : [816/885] 836922=test_thread_queue I, [2024-05-11T08:16:02.789693 #796041] INFO -- : [817/885] 836924=test_nowrite I, [2024-05-11T08:16:02.814248 #796041] INFO -- : [818/885] 836924=test_passing_block I, [2024-05-11T08:16:02.832331 #796041] INFO -- : [819/885] 836924=test_defined I, [2024-05-11T08:16:02.912157 #796041] INFO -- : [820/885] 836924=test_ldap I, [2024-05-11T08:16:02.961454 #796041] INFO -- : [821/885] 836924=test_kdf I, [2024-05-11T08:16:02.987947 #796041] INFO -- : [822/885] 836924=test_comparable I, [2024-05-11T08:16:02.994095 #796041] INFO -- : [823/885] 836924=json_string_matching_test I, [2024-05-11T08:16:03.011890 #796041] INFO -- : [824/885] 836924=test_gem_config_file I, [2024-05-11T08:16:03.407501 #796041] INFO -- : [825/885] 836924=test_rdoc_markdown_test I, [2024-05-11T08:16:04.732309 #796041] INFO -- : [826/885] 836924=test_io_timeout I, [2024-05-11T08:16:04.739420 #796041] INFO -- : [827/885] 836924=test_type_completor I, [2024-05-11T08:16:04.754905 #796041] INFO -- : [828/885] 836924=test_rdoc_normal_module I, [2024-05-11T08:16:04.791819 #796041] INFO -- : [829/885] 836924=test_rdoc_rdoc I, [2024-05-11T08:16:04.876631 #796041] INFO -- : [830/885] 836924=test_yjit_exit_locations I, [2024-05-11T08:16:04.889570 #796041] INFO -- : [831/885] 836924=test_gem_uri I, [2024-05-11T08:16:04.960450 #796041] INFO -- : [832/885] 836924=test_gem_package_tar_reader_entry I, [2024-05-11T08:16:05.388515 #796041] INFO -- : [833/885] 836924=test_resource I, [2024-05-11T08:16:05.468461 #796041] INFO -- : [834/885] 836924=test_c_struct_builder I, [2024-05-11T08:16:05.801746 #796041] INFO -- : [835/885] 836924=test_bug-5832 I, [2024-05-11T08:16:05.808307 #796041] INFO -- : [836/885] 836924=test_yield_block I, [2024-05-11T08:16:05.814874 #796041] INFO -- : [837/885] 836924=test_enumerator I, [2024-05-11T08:16:05.821284 #796041] INFO -- : [838/885] 836924=test_path_to_class I, [2024-05-11T08:16:05.827116 #796041] INFO -- : [839/885] 836924=test_frozen_error I, [2024-05-11T08:16:06.159455 #796041] INFO -- : [840/885] 836924=test_gem_ext_ext_conf_builder I, [2024-05-11T08:16:06.908954 #796041] INFO -- : [841/885] 836924=test_gem_version I, [2024-05-11T08:16:07.072415 #796041] INFO -- : [842/885] 836924=test_spell_checker I, [2024-05-11T08:16:07.088803 #796041] INFO -- : [843/885] 836924=test_reqarg I, [2024-05-11T08:16:07.457048 #796041] INFO -- : [844/885] 836924=test_gem_commands_unpack_command I, [2024-05-11T08:16:07.832816 #796041] INFO -- : [845/885] 836924=test_gem_ext_cargo_builder I, [2024-05-11T08:16:07.834812 #796041] INFO -- : [846/885] 836924=test_console_attr I, [2024-05-11T08:16:07.915434 #796041] INFO -- : [847/885] 836924=test_proc I, [2024-05-11T08:16:08.702446 #796041] INFO -- : [848/885] 836924=test_zlib I, [2024-05-11T08:16:08.874402 #796041] INFO -- : [849/885] 836922=test_rdoc_options I, [2024-05-11T08:16:09.253715 #796041] INFO -- : [850/885] 836922=test_ubf_async_safe I, [2024-05-11T08:16:09.265952 #796041] INFO -- : [851/885] 836922=test_pstore I, [2024-05-11T08:16:09.476870 #796041] INFO -- : [852/885] 836922=test_date_compat I, [2024-05-11T08:16:09.494653 #796041] INFO -- : [853/885] 836922=test_rdoc_include I, [2024-05-11T08:16:09.517554 #796041] INFO -- : [854/885] 836922=test_win32ole_record I, [2024-05-11T08:16:09.533193 #796041] INFO -- : [855/885] 836922=test_gem_version_option I, [2024-05-11T08:16:09.599290 #796041] INFO -- : [856/885] 836922=test_hmac I, [2024-05-11T08:16:09.612433 #796041] INFO -- : [857/885] 836922=test_encoding I, [2024-05-11T08:16:09.811269 #796041] INFO -- : [858/885] 836922=test_constant I, [2024-05-11T08:16:11.699938 #796041] INFO -- : [859/885] 836922=test_find I, [2024-05-11T08:16:11.730818 #796041] INFO -- : [860/885] 836922=test_rdoc_generator_markup I, [2024-05-11T08:16:11.943854 #796041] INFO -- : [861/885] 836922=test_flags I, [2024-05-11T08:16:12.338359 #796041] INFO -- : [862/885] 836922=test_numeric I, [2024-05-11T08:16:12.412093 #796041] INFO -- : [863/885] 836922=test_yamlstore I, [2024-05-11T08:16:12.437930 #796041] INFO -- : [864/885] 836922=test_bug-3571 I, [2024-05-11T08:16:12.447212 #796041] INFO -- : [865/885] 836922=test_rat I, [2024-05-11T08:16:12.475174 #796041] INFO -- : [866/885] 836922=test_init I, [2024-05-11T08:16:12.821635 #796041] INFO -- : [867/885] 836922=test_gem_request_connection_pools I, [2024-05-11T08:16:13.882390 #796041] INFO -- : [868/885] 836922=test_capacity I, [2024-05-11T08:16:13.901425 #796041] INFO -- : [869/885] 836922=test_nextafter I, [2024-05-11T08:16:14.049468 #796041] INFO -- : [870/885] 836922=test_gem_commands_owner_command I, [2024-05-11T08:16:14.739611 #796041] INFO -- : [871/885] 836922=test_time I, [2024-05-11T08:16:14.858799 #796041] INFO -- : [872/885] 836922=test_file I, [2024-05-11T08:16:14.869275 #796041] INFO -- : [873/885] 836922=test_rdoc_markup_to_table_of_contents I, [2024-05-11T08:16:14.922000 #796041] INFO -- : [874/885] 836922=test_gem_name_tuple I, [2024-05-11T08:16:15.006494 #796041] INFO -- : [875/885] 836922=test_integer I, [2024-05-11T08:16:15.011815 #796041] INFO -- : [876/885] 836922=test_win32ole_method_event I, [2024-05-11T08:16:15.021987 #796041] INFO -- : [877/885] 836922=test_tcp I, [2024-05-11T08:16:15.163280 #796041] INFO -- : [878/885] 836922=parse_comments_test I, [2024-05-11T08:16:15.180113 #796041] INFO -- : [879/885] 836922=test_gem_requirement I, [2024-05-11T08:16:15.388933 #796041] INFO -- : [880/885] 836922=test_string I, [2024-05-11T08:16:20.284921 #796041] INFO -- : [881/885] 836923=test_macro I, [2024-05-11T08:16:20.290940 #796041] INFO -- : [882/885] 836923=test_pipe I, [2024-05-11T08:16:20.430713 #796041] INFO -- : [883/885] 836923=test_gem_resolver_activation_request I, [2024-05-11T08:16:20.456372 #796041] INFO -- : [884/885] 836923=test_function I, [2024-05-11T08:16:20.716753 #796041] INFO -- : [885/885] 836923=test_gem_commands_server_command I, [2024-05-11T08:17:06.215590 #796041] INFO -- : Finished tests in 252.408127s, 104.1329 tests/s, 37053.0146 assertions/s. E, [2024-05-11T08:17:06.215734 #796041] ERROR -- : Children under /tmp/rubytest.7eixjn: E, [2024-05-11T08:17:06.215915 #796041] ERROR -- : * drwx------ 4 28 2024-05-11 08:14:13 +0000 gem_rebuild20240511-836924-cuhaql/ E, [2024-05-11T08:17:06.215934 #796041] ERROR -- : * drwxrwxr-x 2 40 2024-05-11 08:14:13 +0000 old/ E, [2024-05-11T08:17:06.216058 #796041] ERROR -- : * -rw-rw-r-- 1 4096 2024-05-11 08:14:13 +0000 rebuild_test_gem-1.0.0.gem E, [2024-05-11T08:17:06.216186 #796041] ERROR -- : * drwxrwxr-x 2 40 2024-05-11 08:14:13 +0000 new/ E, [2024-05-11T08:17:06.216202 #796041] ERROR -- : * -rw-rw-r-- 1 4096 2024-05-11 08:14:13 +0000 rebuild_test_gem-1.0.0.gem E, [2024-05-11T08:17:06.216310 #796041] ERROR -- : * drwx------ 2 6 2024-05-11 08:16:12 +0000 d20240511-836922-sfvdmn/ E, [2024-05-11T08:17:06.216351 #796041] ERROR -- : * drwx------ 2 6 2024-05-11 08:16:12 +0000 d20240511-836922-4x1jjo/ E, [2024-05-11T08:17:06.216394 #796041] ERROR -- : * drwx------ 2 6 2024-05-11 08:16:12 +0000 d20240511-836922-3i38xt/ E, [2024-05-11T08:17:06.216439 #796041] ERROR -- : * drwx------ 2 6 2024-05-11 08:16:12 +0000 d20240511-836922-mpb0jf/ E, [2024-05-11T08:17:06.216479 #796041] ERROR -- : * drwx------ 2 6 2024-05-11 08:16:12 +0000 d20240511-836922-yt24v/ I, [2024-05-11T08:17:06.222254 #796041] INFO -- : 26284 tests, 9352482 assertions, 0 failures, 0 errors, 320 skips I, [2024-05-11T08:17:06.222291 #796041] INFO -- : I, [2024-05-11T08:17:06.222303 #796041] INFO -- : ruby -v: ruby 3.4.0dev (2024-05-10T17:19:42Z master 68b6fe7048) [aarch64-linux] I, [2024-05-11T08:17:06.223090 #796041] INFO -- : $$$[end] "make yes-test-all TESTOPTS='--stderr-on-failure' TESTS='-j3'" exit with 0. I, [2024-05-11T08:17:06.223225 #796041] INFO -- : $$$[beg] make yes-test-rubyspec MSPECOPT='--error-output stderr --debug -j' TESTS='-j3' I, [2024-05-11T08:17:06.348290 #796041] INFO -- : BASERUBY = /usr/local/bin/ruby --disable=gems I, [2024-05-11T08:17:06.348385 #796041] INFO -- : CC = gcc I, [2024-05-11T08:17:06.348406 #796041] INFO -- : LD = ld I, [2024-05-11T08:17:06.348422 #796041] INFO -- : LDSHARED = gcc -shared I, [2024-05-11T08:17:06.348444 #796041] INFO -- : CFLAGS = -O3 -fno-fast-math -ggdb3 -Wall -Wextra -Wdeprecated-declarations -Wdiv-by-zero -Wduplicated-cond -Wimplicit-function-declaration -Wimplicit-int -Wpointer-arith -Wwrite-strings -Wold-style-definition -Wimplicit-fallthrough=0 -Wmissing-noreturn -Wno-cast-function-type -Wno-constant-logical-operand -Wno-long-long -Wno-missing-field-initializers -Wno-overlength-strings -Wno-packed-bitfield-compat -Wno-parentheses-equality -Wno-self-assign -Wno-tautological-compare -Wno-unused-parameter -Wno-unused-value -Wsuggest-attribute=format -Wsuggest-attribute=noreturn -Wunused-variable -Wmisleading-indentation -Wundef I, [2024-05-11T08:17:06.348462 #796041] INFO -- : XCFLAGS = -U_FORTIFY_SOURCE -D_FORTIFY_SOURCE=2 -fstack-protector-strong -msign-return-address=all -fno-strict-overflow -fvisibility=hidden -fexcess-precision=standard -DRUBY_EXPORT -fPIE -I. -I.ext/include/aarch64-linux -I/home/opc/ruby/src/master/include -I/home/opc/ruby/src/master -I/home/opc/ruby/src/master/prism -I/home/opc/ruby/src/master/enc/unicode/15.0.0 I, [2024-05-11T08:17:06.348480 #796041] INFO -- : CPPFLAGS = I, [2024-05-11T08:17:06.348530 #796041] INFO -- : DLDFLAGS = -Wl,--compress-debug-sections=zlib -fstack-protector-strong -pie I, [2024-05-11T08:17:06.348543 #796041] INFO -- : SOLIBS = -lz -lrt -lrt -ldl -lcrypt -lm -lpthread I, [2024-05-11T08:17:06.348552 #796041] INFO -- : LANG = en_US.UTF-8 I, [2024-05-11T08:17:06.348560 #796041] INFO -- : LC_ALL = I, [2024-05-11T08:17:06.348568 #796041] INFO -- : LC_CTYPE = I, [2024-05-11T08:17:06.348577 #796041] INFO -- : MFLAGS = I, [2024-05-11T08:17:06.348585 #796041] INFO -- : RUSTC = rustc I, [2024-05-11T08:17:06.348593 #796041] INFO -- : YJIT_RUSTC_ARGS = --crate-name=yjit --crate-type=staticlib --edition=2021 -g -C lto=thin -C opt-level=3 -C overflow-checks=on '--out-dir=/home/opc/ruby/build/master/yjit/target/release/' /home/opc/ruby/src/master/yjit/src/lib.rs I, [2024-05-11T08:17:06.349168 #796041] INFO -- : gcc (GCC) 8.5.0 20210514 (Red Hat 8.5.0-10.1.0.1) I, [2024-05-11T08:17:06.349185 #796041] INFO -- : Copyright (C) 2018 Free Software Foundation, Inc. I, [2024-05-11T08:17:06.349194 #796041] INFO -- : This is free software; see the source for copying conditions. There is NO I, [2024-05-11T08:17:06.349203 #796041] INFO -- : warranty; not even for MERCHANTABILITY or FITNESS FOR A PARTICULAR PURPOSE. I, [2024-05-11T08:17:06.349211 #796041] INFO -- : I, [2024-05-11T08:17:06.351223 #796041] INFO -- : generating enc.mk I, [2024-05-11T08:17:06.580729 #796041] INFO -- : generating encdb.h I, [2024-05-11T08:17:06.617082 #796041] INFO -- : encdb.h unchanged I, [2024-05-11T08:17:06.618394 #796041] INFO -- : making enc I, [2024-05-11T08:17:06.645435 #796041] INFO -- : make[1]: Entering directory '/home/opc/ruby/build/master' I, [2024-05-11T08:17:06.645493 #796041] INFO -- : make[1]: Nothing to be done for 'enc'. I, [2024-05-11T08:17:06.645504 #796041] INFO -- : make[1]: Leaving directory '/home/opc/ruby/build/master' I, [2024-05-11T08:17:06.646223 #796041] INFO -- : making srcs under enc I, [2024-05-11T08:17:06.687797 #796041] INFO -- : make[1]: Entering directory '/home/opc/ruby/build/master' I, [2024-05-11T08:17:06.687867 #796041] INFO -- : make[1]: Nothing to be done for 'srcs'. I, [2024-05-11T08:17:06.687877 #796041] INFO -- : make[1]: Leaving directory '/home/opc/ruby/build/master' I, [2024-05-11T08:17:06.689075 #796041] INFO -- : generating transdb.h I, [2024-05-11T08:17:06.831651 #796041] INFO -- : transdb.h unchanged I, [2024-05-11T08:17:06.833019 #796041] INFO -- : making trans I, [2024-05-11T08:17:06.881298 #796041] INFO -- : make[1]: Entering directory '/home/opc/ruby/build/master' I, [2024-05-11T08:17:06.881373 #796041] INFO -- : make[1]: Nothing to be done for 'trans'. I, [2024-05-11T08:17:06.881383 #796041] INFO -- : make[1]: Leaving directory '/home/opc/ruby/build/master' I, [2024-05-11T08:17:06.882329 #796041] INFO -- : making encs I, [2024-05-11T08:17:06.934539 #796041] INFO -- : make[1]: Entering directory '/home/opc/ruby/build/master' I, [2024-05-11T08:17:06.934612 #796041] INFO -- : make[1]: Nothing to be done for 'encs'. I, [2024-05-11T08:17:06.934623 #796041] INFO -- : make[1]: Leaving directory '/home/opc/ruby/build/master' I, [2024-05-11T08:17:06.936667 #796041] INFO -- : generating makefiles ext/configure-ext.mk I, [2024-05-11T08:17:06.975781 #796041] INFO -- : ext/configure-ext.mk updated I, [2024-05-11T08:17:06.979169 #796041] INFO -- : make[1]: Entering directory '/home/opc/ruby/build/master' I, [2024-05-11T08:17:09.025424 #796041] INFO -- : make[1]: Leaving directory '/home/opc/ruby/build/master' I, [2024-05-11T08:17:09.026164 #796041] INFO -- : generating makefile exts.mk I, [2024-05-11T08:17:09.084259 #796041] INFO -- : exts.mk unchanged I, [2024-05-11T08:17:09.089098 #796041] INFO -- : make[1]: Entering directory '/home/opc/ruby/build/master' I, [2024-05-11T08:17:09.385783 #796041] INFO -- : make[2]: Entering directory '/home/opc/ruby/build/master/ext/coverage' I, [2024-05-11T08:17:09.390446 #796041] INFO -- : make[2]: Leaving directory '/home/opc/ruby/build/master/ext/coverage' I, [2024-05-11T08:17:09.396002 #796041] INFO -- : make[2]: Entering directory '/home/opc/ruby/build/master/ext/date' I, [2024-05-11T08:17:09.401130 #796041] INFO -- : make[2]: Leaving directory '/home/opc/ruby/build/master/ext/date' I, [2024-05-11T08:17:09.404552 #796041] INFO -- : make[2]: Entering directory '/home/opc/ruby/build/master/ext/digest' I, [2024-05-11T08:17:09.413120 #796041] INFO -- : make[2]: Leaving directory '/home/opc/ruby/build/master/ext/digest' I, [2024-05-11T08:17:09.435573 #796041] INFO -- : make[2]: Entering directory '/home/opc/ruby/build/master/ext/digest/sha2' I, [2024-05-11T08:17:09.440353 #796041] INFO -- : make[2]: Leaving directory '/home/opc/ruby/build/master/ext/digest/sha2' I, [2024-05-11T08:17:09.458407 #796041] INFO -- : make[2]: Entering directory '/home/opc/ruby/build/master/ext/fiddle' I, [2024-05-11T08:17:09.468450 #796041] INFO -- : make[2]: Leaving directory '/home/opc/ruby/build/master/ext/fiddle' I, [2024-05-11T08:17:09.472724 #796041] INFO -- : make[2]: Entering directory '/home/opc/ruby/build/master/ext/io/console' I, [2024-05-11T08:17:09.476960 #796041] INFO -- : make[2]: Leaving directory '/home/opc/ruby/build/master/ext/io/console' I, [2024-05-11T08:17:09.487417 #796041] INFO -- : make[2]: Entering directory '/home/opc/ruby/build/master/ext/json' I, [2024-05-11T08:17:09.496537 #796041] INFO -- : make[2]: Leaving directory '/home/opc/ruby/build/master/ext/json' I, [2024-05-11T08:17:09.509566 #796041] INFO -- : make[2]: Entering directory '/home/opc/ruby/build/master/ext/monitor' I, [2024-05-11T08:17:09.513878 #796041] INFO -- : make[2]: Leaving directory '/home/opc/ruby/build/master/ext/monitor' I, [2024-05-11T08:17:09.519844 #796041] INFO -- : make[2]: Entering directory '/home/opc/ruby/build/master/ext/objspace' I, [2024-05-11T08:17:09.525653 #796041] INFO -- : make[2]: Leaving directory '/home/opc/ruby/build/master/ext/objspace' I, [2024-05-11T08:17:09.544402 #796041] INFO -- : make[2]: Entering directory '/home/opc/ruby/build/master/ext/openssl' I, [2024-05-11T08:17:09.566045 #796041] INFO -- : make[2]: Leaving directory '/home/opc/ruby/build/master/ext/openssl' I, [2024-05-11T08:17:09.570113 #796041] INFO -- : make[2]: Entering directory '/home/opc/ruby/build/master/ext/pathname' I, [2024-05-11T08:17:09.574206 #796041] INFO -- : make[2]: Leaving directory '/home/opc/ruby/build/master/ext/pathname' I, [2024-05-11T08:17:09.580348 #796041] INFO -- : make[2]: Entering directory '/home/opc/ruby/build/master/ext/psych' I, [2024-05-11T08:17:09.601480 #796041] INFO -- : make[2]: Leaving directory '/home/opc/ruby/build/master/ext/psych' I, [2024-05-11T08:17:09.605724 #796041] INFO -- : make[2]: Entering directory '/home/opc/ruby/build/master/ext/pty' I, [2024-05-11T08:17:09.609799 #796041] INFO -- : make[2]: Leaving directory '/home/opc/ruby/build/master/ext/pty' I, [2024-05-11T08:17:09.623019 #796041] INFO -- : make[2]: Entering directory '/home/opc/ruby/build/master/ext/ripper' I, [2024-05-11T08:17:09.630664 #796041] INFO -- : make[2]: Leaving directory '/home/opc/ruby/build/master/ext/ripper' I, [2024-05-11T08:17:09.632569 #796041] INFO -- : make[2]: Entering directory '/home/opc/ruby/build/master/ext/rubyvm' I, [2024-05-11T08:17:09.635984 #796041] INFO -- : make[2]: Leaving directory '/home/opc/ruby/build/master/ext/rubyvm' I, [2024-05-11T08:17:09.647846 #796041] INFO -- : make[2]: Entering directory '/home/opc/ruby/build/master/ext/socket' I, [2024-05-11T08:17:09.658688 #796041] INFO -- : make[2]: Leaving directory '/home/opc/ruby/build/master/ext/socket' I, [2024-05-11T08:17:09.673921 #796041] INFO -- : make[2]: Entering directory '/home/opc/ruby/build/master/.bundle/gems/bigdecimal-3.1.7/ext/bigdecimal' I, [2024-05-11T08:17:09.704080 #796041] INFO -- : make[2]: Leaving directory '/home/opc/ruby/build/master/.bundle/gems/bigdecimal-3.1.7/ext/bigdecimal' I, [2024-05-11T08:17:09.706753 #796041] INFO -- : make[2]: Entering directory '/home/opc/ruby/build/master/.bundle/gems/bigdecimal-3.1.8/ext/bigdecimal' I, [2024-05-11T08:17:09.736642 #796041] INFO -- : make[2]: Leaving directory '/home/opc/ruby/build/master/.bundle/gems/bigdecimal-3.1.8/ext/bigdecimal' I, [2024-05-11T08:17:09.739198 #796041] INFO -- : make[2]: Entering directory '/home/opc/ruby/build/master/.bundle/gems/debug-1.9.2/ext/debug' I, [2024-05-11T08:17:09.769052 #796041] INFO -- : make[2]: Leaving directory '/home/opc/ruby/build/master/.bundle/gems/debug-1.9.2/ext/debug' I, [2024-05-11T08:17:09.771983 #796041] INFO -- : make[2]: Entering directory '/home/opc/ruby/build/master/.bundle/gems/nkf-0.2.0/ext/nkf' I, [2024-05-11T08:17:09.802459 #796041] INFO -- : make[2]: Leaving directory '/home/opc/ruby/build/master/.bundle/gems/nkf-0.2.0/ext/nkf' I, [2024-05-11T08:17:09.804860 #796041] INFO -- : make[2]: Entering directory '/home/opc/ruby/build/master/.bundle/gems/racc-1.7.3/ext/racc/cparse' I, [2024-05-11T08:17:09.834571 #796041] INFO -- : make[2]: Leaving directory '/home/opc/ruby/build/master/.bundle/gems/racc-1.7.3/ext/racc/cparse' I, [2024-05-11T08:17:09.837447 #796041] INFO -- : make[2]: Entering directory '/home/opc/ruby/build/master/.bundle/gems/rbs-3.4.4/ext/rbs_extension' I, [2024-05-11T08:17:09.867242 #796041] INFO -- : make[2]: Leaving directory '/home/opc/ruby/build/master/.bundle/gems/rbs-3.4.4/ext/rbs_extension' I, [2024-05-11T08:17:09.869820 #796041] INFO -- : make[2]: Entering directory '/home/opc/ruby/build/master/.bundle/gems/syslog-0.1.2/ext/syslog' I, [2024-05-11T08:17:09.899856 #796041] INFO -- : make[2]: Leaving directory '/home/opc/ruby/build/master/.bundle/gems/syslog-0.1.2/ext/syslog' I, [2024-05-11T08:17:09.937849 #796041] INFO -- : make[2]: Entering directory '/home/opc/ruby/build/master' I, [2024-05-11T08:17:10.021188 #796041] INFO -- : make[2]: 'ruby' is up to date. I, [2024-05-11T08:17:10.021263 #796041] INFO -- : make[2]: Leaving directory '/home/opc/ruby/build/master' I, [2024-05-11T08:17:10.021520 #796041] INFO -- : make[1]: Leaving directory '/home/opc/ruby/build/master' I, [2024-05-11T08:17:10.025807 #796041] INFO -- : make[1]: Entering directory '/home/opc/ruby/build/master' I, [2024-05-11T08:17:10.025852 #796041] INFO -- : make[1]: Nothing to be done for 'note'. I, [2024-05-11T08:17:10.025863 #796041] INFO -- : make[1]: Leaving directory '/home/opc/ruby/build/master' E, [2024-05-11T08:17:10.099874 #796041] ERROR -- : $ /home/opc/ruby/build/master/miniruby -I/home/opc/ruby/src/master/lib /home/opc/ruby/src/master/tool/runruby.rb --archdir=/home/opc/ruby/build/master --extout=.ext -- /home/opc/ruby/src/master/spec/mspec/bin/mspec-run -B /home/opc/ruby/src/master/spec/default.mspec --error-output stderr --debug -fy -o /tmp/rubytest.6oojs3/1-mspec-multi-0 E, [2024-05-11T08:17:10.100241 #796041] ERROR -- : $ /home/opc/ruby/build/master/miniruby -I/home/opc/ruby/src/master/lib /home/opc/ruby/src/master/tool/runruby.rb --archdir=/home/opc/ruby/build/master --extout=.ext -- /home/opc/ruby/src/master/spec/mspec/bin/mspec-run -B /home/opc/ruby/src/master/spec/default.mspec --error-output stderr --debug -fy -o /tmp/rubytest.6oojs3/2-mspec-multi-1 E, [2024-05-11T08:17:10.100523 #796041] ERROR -- : $ /home/opc/ruby/build/master/miniruby -I/home/opc/ruby/src/master/lib /home/opc/ruby/src/master/tool/runruby.rb --archdir=/home/opc/ruby/build/master --extout=.ext -- /home/opc/ruby/src/master/spec/mspec/bin/mspec-run -B /home/opc/ruby/src/master/spec/default.mspec --error-output stderr --debug -fy -o /tmp/rubytest.6oojs3/3-mspec-multi-2 I, [2024-05-11T08:17:10.236506 #796041] INFO -- : ruby 3.4.0dev (2024-05-10T17:19:42Z master 68b6fe7048) [aarch64-linux] I, [2024-05-11T08:17:15.549293 #796041] INFO -- : 0 ......................................................................... I, [2024-05-11T08:17:17.958248 #796041] INFO -- : 73 ......................................................................... I, [2024-05-11T08:17:18.143828 #796041] INFO -- : 146 ......................................................................... I, [2024-05-11T08:17:18.448821 #796041] INFO -- : 219 ......................................................................... I, [2024-05-11T08:17:18.611563 #796041] INFO -- : 292 ......................................................................... I, [2024-05-11T08:17:18.856309 #796041] INFO -- : 365 ......................................................................... I, [2024-05-11T08:17:18.975467 #796041] INFO -- : 438 ......................................................................... I, [2024-05-11T08:17:19.033872 #796041] INFO -- : 511 ......................................................................... I, [2024-05-11T08:17:19.096781 #796041] INFO -- : 584 ......................................................................... I, [2024-05-11T08:17:19.703629 #796041] INFO -- : 657 ......................................................................... I, [2024-05-11T08:17:19.817199 #796041] INFO -- : 730 ......................................................................... I, [2024-05-11T08:17:19.870426 #796041] INFO -- : 803 ......................................................................... I, [2024-05-11T08:17:20.060167 #796041] INFO -- : 876 ......................................................................... I, [2024-05-11T08:17:20.166224 #796041] INFO -- : 949 ......................................................................... I, [2024-05-11T08:17:20.743085 #796041] INFO -- : 1022 ......................................................................... I, [2024-05-11T08:17:23.043693 #796041] INFO -- : 1095 ......................................................................... I, [2024-05-11T08:17:23.890397 #796041] INFO -- : 1168 ......................................................................... I, [2024-05-11T08:17:24.033518 #796041] INFO -- : 1241 ......................................................................... I, [2024-05-11T08:17:24.218566 #796041] INFO -- : 1314 ......................................................................... I, [2024-05-11T08:17:24.312903 #796041] INFO -- : 1387 ......................................................................... I, [2024-05-11T08:17:26.354140 #796041] INFO -- : 1460 ......................................................................... I, [2024-05-11T08:17:29.763937 #796041] INFO -- : 1533 ......................................................................... I, [2024-05-11T08:17:29.925547 #796041] INFO -- : 1606 ......................................................................... I, [2024-05-11T08:17:30.728121 #796041] INFO -- : 1679 ......................................................................... I, [2024-05-11T08:17:30.999106 #796041] INFO -- : 1752 ......................................................................... I, [2024-05-11T08:17:31.267335 #796041] INFO -- : 1825 ......................................................................... I, [2024-05-11T08:17:31.597209 #796041] INFO -- : 1898 ......................................................................... I, [2024-05-11T08:17:32.006320 #796041] INFO -- : 1971 ......................................................................... I, [2024-05-11T08:17:32.531186 #796041] INFO -- : 2044 ......................................................................... I, [2024-05-11T08:17:32.605940 #796041] INFO -- : 2117 ......................................................................... I, [2024-05-11T08:17:32.664974 #796041] INFO -- : 2190 ......................................................................... I, [2024-05-11T08:17:32.715716 #796041] INFO -- : 2263 ......................................................................... I, [2024-05-11T08:17:32.765653 #796041] INFO -- : 2336 ......................................................................... I, [2024-05-11T08:17:32.859543 #796041] INFO -- : 2409 ......................................................................... I, [2024-05-11T08:17:33.143058 #796041] INFO -- : 2482 ......................................................................... I, [2024-05-11T08:17:33.289383 #796041] INFO -- : 2555 ......................................................................... I, [2024-05-11T08:17:34.563270 #796041] INFO -- : 2628 ......................................................................... I, [2024-05-11T08:17:34.796286 #796041] INFO -- : 2701 ......................................................................... I, [2024-05-11T08:17:34.928274 #796041] INFO -- : 2774 ......................................................................... I, [2024-05-11T08:17:35.253430 #796041] INFO -- : 2847 ......................................................................... I, [2024-05-11T08:17:35.516902 #796041] INFO -- : 2920 ......................................................................... I, [2024-05-11T08:17:35.643768 #796041] INFO -- : 2993 ......................................................................... I, [2024-05-11T08:17:35.712877 #796041] INFO -- : 3066 ......................................................................... I, [2024-05-11T08:17:35.770900 #796041] INFO -- : 3139 ......................................................................... I, [2024-05-11T08:17:35.831635 #796041] INFO -- : 3212 ......................................................................... I, [2024-05-11T08:17:35.903881 #796041] INFO -- : 3285 ......................................................................... I, [2024-05-11T08:17:39.737055 #796041] INFO -- : 3358 ........................................................................ I, [2024-05-11T08:17:39.737128 #796041] INFO -- : I, [2024-05-11T08:17:39.737140 #796041] INFO -- : Finished in 29.637030 seconds I, [2024-05-11T08:17:39.737175 #796041] INFO -- : I, [2024-05-11T08:17:39.737186 #796041] INFO -- : 3429 files, 32607 examples, 194139 expectations, 0 failures, 0 errors, 0 tagged I, [2024-05-11T08:17:39.738459 #796041] INFO -- : $$$[end] "make yes-test-rubyspec MSPECOPT='--error-output stderr --debug -j' TESTS='-j3'" exit with 0.