# Logfile created on 2024-05-10 14:35:27 +0000 by logger.rb/v1.5.3 I, [2024-05-10T14:35:27.896338 #504881] INFO -- : #, @formatter=nil, @logdev=#, @binmode=false, @mon_data=#, @mon_data_owner_object_id=860>>> I, [2024-05-10T14:35:27.896674 #504881] INFO -- : $$$[beg] make update-unicode -j3 I, [2024-05-10T14:35:27.986829 #504881] INFO -- : Downloading Unicode emoji 15.0 files... I, [2024-05-10T14:35:27.987006 #504881] INFO -- : Downloading Unicode emoji 15.0 files... I, [2024-05-10T14:35:27.987232 #504881] INFO -- : Downloading Unicode emoji 15.0 files... I, [2024-05-10T14:35:28.065366 #504881] INFO -- : made symlink emoji/15.0/emoji-sequences.txt to /home/opc/ruby/src/master/.downloaded-cache/emoji/15.0/emoji-sequences.txt I, [2024-05-10T14:35:28.065573 #504881] INFO -- : downloading emoji/15.0/emoji-test.txt ... /home/opc/ruby/src/master/enc/unicode/data/emoji/15.0/emoji-sequences.txt already exists I, [2024-05-10T14:35:28.067878 #504881] INFO -- : downloading emoji/15.0/emoji-test.txt ... /home/opc/ruby/src/master/enc/unicode/data/emoji/15.0/emoji-sequences.txt already exists E, [2024-05-10T14:35:28.517310 #504881] ERROR -- : /home/opc/ruby/src/master/tool/downloader.rb:302:in `rescue in download': failed to download emoji/15.0/emoji-test.txt (RuntimeError) E, [2024-05-10T14:35:28.517379 #504881] ERROR -- : OpenURI::HTTPError: 403 Forbidden: https://www.unicode.org/Public/emoji/15.0/emoji-test.txt E, [2024-05-10T14:35:28.517390 #504881] ERROR -- : from /home/opc/ruby/src/master/tool/downloader.rb:201:in `download' E, [2024-05-10T14:35:28.517400 #504881] ERROR -- : from /home/opc/ruby/src/master/tool/downloader.rb:136:in `download' E, [2024-05-10T14:35:28.517408 #504881] ERROR -- : from /home/opc/ruby/src/master/tool/downloader.rb:482:in `block in
' E, [2024-05-10T14:35:28.517417 #504881] ERROR -- : from /home/opc/ruby/src/master/tool/downloader.rb:465:in `each' E, [2024-05-10T14:35:28.517425 #504881] ERROR -- : from /home/opc/ruby/src/master/tool/downloader.rb:465:in `
' E, [2024-05-10T14:35:28.517433 #504881] ERROR -- : /usr/local/lib/ruby/3.2.0/open-uri.rb:369:in `open_http': 403 Forbidden (OpenURI::HTTPError) E, [2024-05-10T14:35:28.517441 #504881] ERROR -- : from /usr/local/lib/ruby/3.2.0/open-uri.rb:760:in `buffer_open' E, [2024-05-10T14:35:28.517449 #504881] ERROR -- : from /usr/local/lib/ruby/3.2.0/open-uri.rb:214:in `block in open_loop' E, [2024-05-10T14:35:28.517457 #504881] ERROR -- : from /usr/local/lib/ruby/3.2.0/open-uri.rb:212:in `catch' E, [2024-05-10T14:35:28.517465 #504881] ERROR -- : from /usr/local/lib/ruby/3.2.0/open-uri.rb:212:in `open_loop' E, [2024-05-10T14:35:28.517473 #504881] ERROR -- : from /usr/local/lib/ruby/3.2.0/open-uri.rb:153:in `open_uri' E, [2024-05-10T14:35:28.517481 #504881] ERROR -- : from /usr/local/lib/ruby/3.2.0/open-uri.rb:740:in `open' E, [2024-05-10T14:35:28.517492 #504881] ERROR -- : from /usr/local/lib/ruby/3.2.0/open-uri.rb:748:in `read' E, [2024-05-10T14:35:28.517500 #504881] ERROR -- : from /home/opc/ruby/src/master/tool/downloader.rb:247:in `block in download' E, [2024-05-10T14:35:28.517508 #504881] ERROR -- : from /home/opc/ruby/src/master/tool/downloader.rb:378:in `with_retry' E, [2024-05-10T14:35:28.517516 #504881] ERROR -- : from /home/opc/ruby/src/master/tool/downloader.rb:246:in `download' E, [2024-05-10T14:35:28.517524 #504881] ERROR -- : from /home/opc/ruby/src/master/tool/downloader.rb:136:in `download' E, [2024-05-10T14:35:28.517532 #504881] ERROR -- : from /home/opc/ruby/src/master/tool/downloader.rb:482:in `block in
' E, [2024-05-10T14:35:28.517540 #504881] ERROR -- : from /home/opc/ruby/src/master/tool/downloader.rb:465:in `each' E, [2024-05-10T14:35:28.517548 #504881] ERROR -- : from /home/opc/ruby/src/master/tool/downloader.rb:465:in `
' E, [2024-05-10T14:35:28.520332 #504881] ERROR -- : make: *** [uncommon.mk:1765: /home/opc/ruby/src/master/enc/unicode/data/emoji/15.0/emoji-zwj-sequences.txt] Error 1 E, [2024-05-10T14:35:28.520362 #504881] ERROR -- : make: *** Waiting for unfinished jobs.... E, [2024-05-10T14:35:28.549492 #504881] ERROR -- : /home/opc/ruby/src/master/tool/downloader.rb:302:in `rescue in download': failed to download emoji/15.0/emoji-test.txt (RuntimeError) E, [2024-05-10T14:35:28.549540 #504881] ERROR -- : OpenURI::HTTPError: 403 Forbidden: https://www.unicode.org/Public/emoji/15.0/emoji-test.txt E, [2024-05-10T14:35:28.549551 #504881] ERROR -- : from /home/opc/ruby/src/master/tool/downloader.rb:201:in `download' E, [2024-05-10T14:35:28.549561 #504881] ERROR -- : from /home/opc/ruby/src/master/tool/downloader.rb:136:in `download' E, [2024-05-10T14:35:28.549569 #504881] ERROR -- : from /home/opc/ruby/src/master/tool/downloader.rb:482:in `block in
' E, [2024-05-10T14:35:28.549578 #504881] ERROR -- : from /home/opc/ruby/src/master/tool/downloader.rb:465:in `each' E, [2024-05-10T14:35:28.549586 #504881] ERROR -- : from /home/opc/ruby/src/master/tool/downloader.rb:465:in `
' E, [2024-05-10T14:35:28.549593 #504881] ERROR -- : /usr/local/lib/ruby/3.2.0/open-uri.rb:369:in `open_http': 403 Forbidden (OpenURI::HTTPError) E, [2024-05-10T14:35:28.549602 #504881] ERROR -- : from /usr/local/lib/ruby/3.2.0/open-uri.rb:760:in `buffer_open' E, [2024-05-10T14:35:28.549610 #504881] ERROR -- : from /usr/local/lib/ruby/3.2.0/open-uri.rb:214:in `block in open_loop' E, [2024-05-10T14:35:28.549618 #504881] ERROR -- : from /usr/local/lib/ruby/3.2.0/open-uri.rb:212:in `catch' E, [2024-05-10T14:35:28.549626 #504881] ERROR -- : from /usr/local/lib/ruby/3.2.0/open-uri.rb:212:in `open_loop' E, [2024-05-10T14:35:28.549634 #504881] ERROR -- : from /usr/local/lib/ruby/3.2.0/open-uri.rb:153:in `open_uri' E, [2024-05-10T14:35:28.549642 #504881] ERROR -- : from /usr/local/lib/ruby/3.2.0/open-uri.rb:740:in `open' E, [2024-05-10T14:35:28.549650 #504881] ERROR -- : from /usr/local/lib/ruby/3.2.0/open-uri.rb:748:in `read' E, [2024-05-10T14:35:28.549658 #504881] ERROR -- : from /home/opc/ruby/src/master/tool/downloader.rb:247:in `block in download' E, [2024-05-10T14:35:28.549666 #504881] ERROR -- : from /home/opc/ruby/src/master/tool/downloader.rb:378:in `with_retry' E, [2024-05-10T14:35:28.549674 #504881] ERROR -- : from /home/opc/ruby/src/master/tool/downloader.rb:246:in `download' E, [2024-05-10T14:35:28.549682 #504881] ERROR -- : from /home/opc/ruby/src/master/tool/downloader.rb:136:in `download' E, [2024-05-10T14:35:28.549691 #504881] ERROR -- : from /home/opc/ruby/src/master/tool/downloader.rb:482:in `block in
' E, [2024-05-10T14:35:28.549699 #504881] ERROR -- : from /home/opc/ruby/src/master/tool/downloader.rb:465:in `each' E, [2024-05-10T14:35:28.549707 #504881] ERROR -- : from /home/opc/ruby/src/master/tool/downloader.rb:465:in `
' E, [2024-05-10T14:35:28.552463 #504881] ERROR -- : make: *** [uncommon.mk:1765: /home/opc/ruby/src/master/enc/unicode/data/emoji/15.0/emoji-sequences.txt] Error 1 E, [2024-05-10T14:35:28.552510 #504881] ERROR -- : make: *** Deleting file '/home/opc/ruby/src/master/enc/unicode/data/emoji/15.0/emoji-sequences.txt' E, [2024-05-10T14:35:28.558954 #504881] ERROR -- : /home/opc/ruby/src/master/tool/downloader.rb:302:in `rescue in download': failed to download emoji/15.0/emoji-test.txt (RuntimeError) E, [2024-05-10T14:35:28.558994 #504881] ERROR -- : OpenURI::HTTPError: 403 Forbidden: https://www.unicode.org/Public/emoji/15.0/emoji-test.txt E, [2024-05-10T14:35:28.559004 #504881] ERROR -- : from /home/opc/ruby/src/master/tool/downloader.rb:201:in `download' E, [2024-05-10T14:35:28.559014 #504881] ERROR -- : from /home/opc/ruby/src/master/tool/downloader.rb:136:in `download' E, [2024-05-10T14:35:28.559022 #504881] ERROR -- : from /home/opc/ruby/src/master/tool/downloader.rb:482:in `block in
' E, [2024-05-10T14:35:28.559031 #504881] ERROR -- : from /home/opc/ruby/src/master/tool/downloader.rb:465:in `each' E, [2024-05-10T14:35:28.559039 #504881] ERROR -- : from /home/opc/ruby/src/master/tool/downloader.rb:465:in `
' E, [2024-05-10T14:35:28.559047 #504881] ERROR -- : /usr/local/lib/ruby/3.2.0/open-uri.rb:369:in `open_http': 403 Forbidden (OpenURI::HTTPError) E, [2024-05-10T14:35:28.559055 #504881] ERROR -- : from /usr/local/lib/ruby/3.2.0/open-uri.rb:760:in `buffer_open' E, [2024-05-10T14:35:28.559063 #504881] ERROR -- : from /usr/local/lib/ruby/3.2.0/open-uri.rb:214:in `block in open_loop' E, [2024-05-10T14:35:28.559072 #504881] ERROR -- : from /usr/local/lib/ruby/3.2.0/open-uri.rb:212:in `catch' E, [2024-05-10T14:35:28.559080 #504881] ERROR -- : from /usr/local/lib/ruby/3.2.0/open-uri.rb:212:in `open_loop' E, [2024-05-10T14:35:28.559088 #504881] ERROR -- : from /usr/local/lib/ruby/3.2.0/open-uri.rb:153:in `open_uri' E, [2024-05-10T14:35:28.559096 #504881] ERROR -- : from /usr/local/lib/ruby/3.2.0/open-uri.rb:740:in `open' E, [2024-05-10T14:35:28.559104 #504881] ERROR -- : from /usr/local/lib/ruby/3.2.0/open-uri.rb:748:in `read' E, [2024-05-10T14:35:28.559112 #504881] ERROR -- : from /home/opc/ruby/src/master/tool/downloader.rb:247:in `block in download' E, [2024-05-10T14:35:28.559120 #504881] ERROR -- : from /home/opc/ruby/src/master/tool/downloader.rb:378:in `with_retry' E, [2024-05-10T14:35:28.559128 #504881] ERROR -- : from /home/opc/ruby/src/master/tool/downloader.rb:246:in `download' E, [2024-05-10T14:35:28.559136 #504881] ERROR -- : from /home/opc/ruby/src/master/tool/downloader.rb:136:in `download' E, [2024-05-10T14:35:28.559145 #504881] ERROR -- : from /home/opc/ruby/src/master/tool/downloader.rb:482:in `block in
' E, [2024-05-10T14:35:28.559153 #504881] ERROR -- : from /home/opc/ruby/src/master/tool/downloader.rb:465:in `each' E, [2024-05-10T14:35:28.559161 #504881] ERROR -- : from /home/opc/ruby/src/master/tool/downloader.rb:465:in `
' E, [2024-05-10T14:35:28.561993 #504881] ERROR -- : make: *** [uncommon.mk:1765: /home/opc/ruby/src/master/enc/unicode/data/emoji/15.0/emoji-test.txt] Error 1 I, [2024-05-10T14:35:28.562052 #504881] INFO -- : downloading emoji/15.0/emoji-test.txt ... I, [2024-05-10T14:35:28.562226 #504881] INFO -- : $$$[end] "make update-unicode -j3" exit with 512. I, [2024-05-10T14:35:28.562256 #504881] INFO -- : $$$[beg] make update-download -j3 I, [2024-05-10T14:35:28.724797 #504881] INFO -- : tool/config.guess already exists I, [2024-05-10T14:35:28.724868 #504881] INFO -- : tool/config.sub already exists I, [2024-05-10T14:35:28.727732 #504881] INFO -- : Update minitest to ea9caafc0754b1d6236a490d59e624b53209734a I, [2024-05-10T14:35:28.727935 #504881] INFO -- : Update power_assert to 84e85124c5014a139af39161d484156cfe87a9ed I, [2024-05-10T14:35:28.728188 #504881] INFO -- : Update rbs to ba7872795d5de04adb8ff500c0e6afdc81a041dd I, [2024-05-10T14:35:28.731318 #504881] INFO -- : echo ea9caafc0754b1d6236a490d59e624b53209734a | /bin/sh /home/opc/ruby/src/master/tool/ifchange /home/opc/ruby/src/master/.bundle/.timestamp/minitest.revision - I, [2024-05-10T14:35:28.731560 #504881] INFO -- : echo 84e85124c5014a139af39161d484156cfe87a9ed | /bin/sh /home/opc/ruby/src/master/tool/ifchange /home/opc/ruby/src/master/.bundle/.timestamp/power_assert.revision - I, [2024-05-10T14:35:28.731704 #504881] INFO -- : echo ba7872795d5de04adb8ff500c0e6afdc81a041dd | /bin/sh /home/opc/ruby/src/master/tool/ifchange /home/opc/ruby/src/master/.bundle/.timestamp/rbs.revision - I, [2024-05-10T14:35:28.738469 #504881] INFO -- : /home/opc/ruby/src/master/.bundle/.timestamp/power_assert.revision unchanged I, [2024-05-10T14:35:28.738917 #504881] INFO -- : /home/opc/ruby/src/master/.bundle/.timestamp/minitest.revision unchanged I, [2024-05-10T14:35:28.739416 #504881] INFO -- : /home/opc/ruby/src/master/.bundle/.timestamp/rbs.revision unchanged I, [2024-05-10T14:35:28.741346 #504881] INFO -- : Update typeprof to b19a6416da3a05d57fadd6ffdadb382b6d236ca5 I, [2024-05-10T14:35:28.745027 #504881] INFO -- : echo b19a6416da3a05d57fadd6ffdadb382b6d236ca5 | /bin/sh /home/opc/ruby/src/master/tool/ifchange /home/opc/ruby/src/master/.bundle/.timestamp/typeprof.revision - I, [2024-05-10T14:35:28.761237 #504881] INFO -- : /home/opc/ruby/src/master/.bundle/.timestamp/typeprof.revision unchanged I, [2024-05-10T14:35:28.828780 #504881] INFO -- : Building power_assert@84e85124c5014a139af39161d484156cfe87a9ed to /home/opc/ruby/src/master/gems/power_assert-2.0.3.gem I, [2024-05-10T14:35:28.938905 #504881] INFO -- : Successfully built RubyGem I, [2024-05-10T14:35:28.938967 #504881] INFO -- : Name: power_assert I, [2024-05-10T14:35:28.938978 #504881] INFO -- : Version: 2.0.4dev I, [2024-05-10T14:35:28.938986 #504881] INFO -- : File: power_assert-2.0.4dev.gem I, [2024-05-10T14:35:29.020941 #504881] INFO -- : $$$[end] "make update-download -j3" exit with 0. I, [2024-05-10T14:35:29.021010 #504881] INFO -- : $$$[beg] make update-rubyspec -j3 I, [2024-05-10T14:35:29.108164 #504881] INFO -- : make: Nothing to be done for 'update-rubyspec'. I, [2024-05-10T14:35:29.108327 #504881] INFO -- : $$$[end] "make update-rubyspec -j3" exit with 0. I, [2024-05-10T14:35:29.108360 #504881] INFO -- : $$$[beg] make update-src -j3 I, [2024-05-10T14:35:31.202108 #504881] INFO -- : Already up to date. I, [2024-05-10T14:35:31.216603 #504881] INFO -- : Latest commit hash = 2bc309e7f3 I, [2024-05-10T14:35:31.217236 #504881] INFO -- : $$$[end] "make update-src -j3" exit with 0. I, [2024-05-10T14:35:31.217280 #504881] INFO -- : $$$[beg] make after-update -j3 I, [2024-05-10T14:35:31.319361 #504881] INFO -- : generating /home/opc/ruby/src/master/ext/ripper/eventids2table.c I, [2024-05-10T14:35:31.325797 #504881] INFO -- : make[1]: Entering directory '/home/opc/ruby/src/master/ext/ripper' I, [2024-05-10T14:35:31.325842 #504881] INFO -- : make[1]: Nothing to be done for 'src'. I, [2024-05-10T14:35:31.325852 #504881] INFO -- : make[1]: Leaving directory '/home/opc/ruby/src/master/ext/ripper' I, [2024-05-10T14:35:31.354121 #504881] INFO -- : /home/opc/ruby/src/master/revision.h updated I, [2024-05-10T14:35:31.355261 #504881] INFO -- : generating aarch64-linux-fake.rb I, [2024-05-10T14:35:31.411435 #504881] INFO -- : aarch64-linux-fake.rb updated I, [2024-05-10T14:35:31.413017 #504881] INFO -- : generating enc.mk I, [2024-05-10T14:35:31.642643 #504881] INFO -- : making srcs under enc I, [2024-05-10T14:35:31.684693 #504881] INFO -- : make[1]: Entering directory '/home/opc/ruby/build/master' I, [2024-05-10T14:35:31.684748 #504881] INFO -- : make[1]: Nothing to be done for 'srcs'. I, [2024-05-10T14:35:31.684759 #504881] INFO -- : make[1]: Leaving directory '/home/opc/ruby/build/master' I, [2024-05-10T14:35:31.764264 #504881] INFO -- : Update minitest to ea9caafc0754b1d6236a490d59e624b53209734a I, [2024-05-10T14:35:31.764375 #504881] INFO -- : Update power_assert to 84e85124c5014a139af39161d484156cfe87a9ed I, [2024-05-10T14:35:31.764633 #504881] INFO -- : Update rbs to ba7872795d5de04adb8ff500c0e6afdc81a041dd I, [2024-05-10T14:35:31.768053 #504881] INFO -- : echo ea9caafc0754b1d6236a490d59e624b53209734a | /bin/sh /home/opc/ruby/src/master/tool/ifchange /home/opc/ruby/src/master/.bundle/.timestamp/minitest.revision - I, [2024-05-10T14:35:31.768288 #504881] INFO -- : echo 84e85124c5014a139af39161d484156cfe87a9ed | /bin/sh /home/opc/ruby/src/master/tool/ifchange /home/opc/ruby/src/master/.bundle/.timestamp/power_assert.revision - I, [2024-05-10T14:35:31.768325 #504881] INFO -- : echo ba7872795d5de04adb8ff500c0e6afdc81a041dd | /bin/sh /home/opc/ruby/src/master/tool/ifchange /home/opc/ruby/src/master/.bundle/.timestamp/rbs.revision - I, [2024-05-10T14:35:31.774245 #504881] INFO -- : /home/opc/ruby/src/master/.bundle/.timestamp/minitest.revision unchanged I, [2024-05-10T14:35:31.774968 #504881] INFO -- : /home/opc/ruby/src/master/.bundle/.timestamp/rbs.revision unchanged I, [2024-05-10T14:35:31.775701 #504881] INFO -- : /home/opc/ruby/src/master/.bundle/.timestamp/power_assert.revision unchanged I, [2024-05-10T14:35:31.777949 #504881] INFO -- : Update typeprof to b19a6416da3a05d57fadd6ffdadb382b6d236ca5 I, [2024-05-10T14:35:31.783442 #504881] INFO -- : echo b19a6416da3a05d57fadd6ffdadb382b6d236ca5 | /bin/sh /home/opc/ruby/src/master/tool/ifchange /home/opc/ruby/src/master/.bundle/.timestamp/typeprof.revision - I, [2024-05-10T14:35:31.788931 #504881] INFO -- : /home/opc/ruby/src/master/.bundle/.timestamp/typeprof.revision unchanged I, [2024-05-10T14:35:31.864402 #504881] INFO -- : Building power_assert@84e85124c5014a139af39161d484156cfe87a9ed to /home/opc/ruby/src/master/gems/power_assert-2.0.3.gem I, [2024-05-10T14:35:31.976169 #504881] INFO -- : Successfully built RubyGem I, [2024-05-10T14:35:31.976226 #504881] INFO -- : Name: power_assert I, [2024-05-10T14:35:31.976237 #504881] INFO -- : Version: 2.0.4dev I, [2024-05-10T14:35:31.976246 #504881] INFO -- : File: power_assert-2.0.4dev.gem I, [2024-05-10T14:35:31.978515 #504881] INFO -- : Extracting bundle gem power_assert-2.0.3... I, [2024-05-10T14:35:32.076076 #504881] INFO -- : Try with hash version of bundled gems instead of gems/power_assert-2.0.3.gem. We don't use this gem with release version of Ruby. I, [2024-05-10T14:35:32.086994 #504881] INFO -- : Unpacked gems/power_assert-2.0.4dev.gem I, [2024-05-10T14:35:32.088984 #504881] INFO -- : $$$[end] "make after-update -j3" exit with 0. I, [2024-05-10T14:35:32.089149 #504881] INFO -- : $$$[beg] make miniruby -j3 I, [2024-05-10T14:35:32.177288 #504881] INFO -- : BASERUBY = /usr/local/bin/ruby --disable=gems I, [2024-05-10T14:35:32.177355 #504881] INFO -- : CC = gcc I, [2024-05-10T14:35:32.177366 #504881] INFO -- : LD = ld I, [2024-05-10T14:35:32.177374 #504881] INFO -- : LDSHARED = gcc -shared I, [2024-05-10T14:35:32.177385 #504881] INFO -- : CFLAGS = -O3 -fno-fast-math -ggdb3 -Wall -Wextra -Wdeprecated-declarations -Wdiv-by-zero -Wduplicated-cond -Wimplicit-function-declaration -Wimplicit-int -Wpointer-arith -Wwrite-strings -Wold-style-definition -Wimplicit-fallthrough=0 -Wmissing-noreturn -Wno-cast-function-type -Wno-constant-logical-operand -Wno-long-long -Wno-missing-field-initializers -Wno-overlength-strings -Wno-packed-bitfield-compat -Wno-parentheses-equality -Wno-self-assign -Wno-tautological-compare -Wno-unused-parameter -Wno-unused-value -Wsuggest-attribute=format -Wsuggest-attribute=noreturn -Wunused-variable -Wmisleading-indentation -Wundef I, [2024-05-10T14:35:32.177395 #504881] INFO -- : XCFLAGS = -U_FORTIFY_SOURCE -D_FORTIFY_SOURCE=2 -fstack-protector-strong -msign-return-address=all -fno-strict-overflow -fvisibility=hidden -fexcess-precision=standard -DRUBY_EXPORT -fPIE -I. -I.ext/include/aarch64-linux -I/home/opc/ruby/src/master/include -I/home/opc/ruby/src/master -I/home/opc/ruby/src/master/prism -I/home/opc/ruby/src/master/enc/unicode/15.0.0 I, [2024-05-10T14:35:32.177404 #504881] INFO -- : CPPFLAGS = I, [2024-05-10T14:35:32.177412 #504881] INFO -- : DLDFLAGS = -Wl,--compress-debug-sections=zlib -fstack-protector-strong -pie I, [2024-05-10T14:35:32.177421 #504881] INFO -- : SOLIBS = -lz -lrt -lrt -ldl -lcrypt -lm -lpthread I, [2024-05-10T14:35:32.177448 #504881] INFO -- : LANG = en_US.UTF-8 I, [2024-05-10T14:35:32.177460 #504881] INFO -- : LC_ALL = I, [2024-05-10T14:35:32.177468 #504881] INFO -- : LC_CTYPE = I, [2024-05-10T14:35:32.177476 #504881] INFO -- : MFLAGS = -j3 --jobserver-auth=4,5 I, [2024-05-10T14:35:32.177483 #504881] INFO -- : RUSTC = rustc I, [2024-05-10T14:35:32.177492 #504881] INFO -- : YJIT_RUSTC_ARGS = --crate-name=yjit --crate-type=staticlib --edition=2021 -g -C lto=thin -C opt-level=3 -C overflow-checks=on '--out-dir=/home/opc/ruby/build/master/yjit/target/release/' /home/opc/ruby/src/master/yjit/src/lib.rs I, [2024-05-10T14:35:32.178171 #504881] INFO -- : gcc (GCC) 8.5.0 20210514 (Red Hat 8.5.0-10.1.0.1) I, [2024-05-10T14:35:32.178190 #504881] INFO -- : Copyright (C) 2018 Free Software Foundation, Inc. I, [2024-05-10T14:35:32.178199 #504881] INFO -- : This is free software; see the source for copying conditions. There is NO I, [2024-05-10T14:35:32.178208 #504881] INFO -- : warranty; not even for MERCHANTABILITY or FITNESS FOR A PARTICULAR PURPOSE. I, [2024-05-10T14:35:32.178216 #504881] INFO -- : I, [2024-05-10T14:35:32.203237 #504881] INFO -- : compiling /home/opc/ruby/src/master/version.c I, [2024-05-10T14:35:32.345489 #504881] INFO -- : linking miniruby I, [2024-05-10T14:35:33.233925 #504881] INFO -- : $$$[end] "make miniruby -j3" exit with 0. I, [2024-05-10T14:35:33.234102 #504881] INFO -- : $$$[beg] make ruby -j3 I, [2024-05-10T14:35:33.322724 #504881] INFO -- : BASERUBY = /usr/local/bin/ruby --disable=gems I, [2024-05-10T14:35:33.322791 #504881] INFO -- : CC = gcc I, [2024-05-10T14:35:33.322802 #504881] INFO -- : LD = ld I, [2024-05-10T14:35:33.322810 #504881] INFO -- : LDSHARED = gcc -shared I, [2024-05-10T14:35:33.322821 #504881] INFO -- : CFLAGS = -O3 -fno-fast-math -ggdb3 -Wall -Wextra -Wdeprecated-declarations -Wdiv-by-zero -Wduplicated-cond -Wimplicit-function-declaration -Wimplicit-int -Wpointer-arith -Wwrite-strings -Wold-style-definition -Wimplicit-fallthrough=0 -Wmissing-noreturn -Wno-cast-function-type -Wno-constant-logical-operand -Wno-long-long -Wno-missing-field-initializers -Wno-overlength-strings -Wno-packed-bitfield-compat -Wno-parentheses-equality -Wno-self-assign -Wno-tautological-compare -Wno-unused-parameter -Wno-unused-value -Wsuggest-attribute=format -Wsuggest-attribute=noreturn -Wunused-variable -Wmisleading-indentation -Wundef I, [2024-05-10T14:35:33.322831 #504881] INFO -- : XCFLAGS = -U_FORTIFY_SOURCE -D_FORTIFY_SOURCE=2 -fstack-protector-strong -msign-return-address=all -fno-strict-overflow -fvisibility=hidden -fexcess-precision=standard -DRUBY_EXPORT -fPIE -I. -I.ext/include/aarch64-linux -I/home/opc/ruby/src/master/include -I/home/opc/ruby/src/master -I/home/opc/ruby/src/master/prism -I/home/opc/ruby/src/master/enc/unicode/15.0.0 I, [2024-05-10T14:35:33.322839 #504881] INFO -- : CPPFLAGS = I, [2024-05-10T14:35:33.322848 #504881] INFO -- : DLDFLAGS = -Wl,--compress-debug-sections=zlib -fstack-protector-strong -pie I, [2024-05-10T14:35:33.322857 #504881] INFO -- : SOLIBS = -lz -lrt -lrt -ldl -lcrypt -lm -lpthread I, [2024-05-10T14:35:33.322865 #504881] INFO -- : LANG = en_US.UTF-8 I, [2024-05-10T14:35:33.322873 #504881] INFO -- : LC_ALL = I, [2024-05-10T14:35:33.322881 #504881] INFO -- : LC_CTYPE = I, [2024-05-10T14:35:33.322889 #504881] INFO -- : MFLAGS = -j3 --jobserver-auth=4,5 I, [2024-05-10T14:35:33.322897 #504881] INFO -- : RUSTC = rustc I, [2024-05-10T14:35:33.322904 #504881] INFO -- : YJIT_RUSTC_ARGS = --crate-name=yjit --crate-type=staticlib --edition=2021 -g -C lto=thin -C opt-level=3 -C overflow-checks=on '--out-dir=/home/opc/ruby/build/master/yjit/target/release/' /home/opc/ruby/src/master/yjit/src/lib.rs I, [2024-05-10T14:35:33.323639 #504881] INFO -- : gcc (GCC) 8.5.0 20210514 (Red Hat 8.5.0-10.1.0.1) I, [2024-05-10T14:35:33.323673 #504881] INFO -- : Copyright (C) 2018 Free Software Foundation, Inc. I, [2024-05-10T14:35:33.323683 #504881] INFO -- : This is free software; see the source for copying conditions. There is NO I, [2024-05-10T14:35:33.323696 #504881] INFO -- : warranty; not even for MERCHANTABILITY or FITNESS FOR A PARTICULAR PURPOSE. I, [2024-05-10T14:35:33.323705 #504881] INFO -- : I, [2024-05-10T14:35:33.500814 #504881] INFO -- : builtin_binary.inc updated I, [2024-05-10T14:35:33.504632 #504881] INFO -- : c5234a9416e4f20f175185e840b25b0f08674d14078ed7083f37e655458e3ca9 builtin_binary.inc I, [2024-05-10T14:35:33.505957 #504881] INFO -- : compiling /home/opc/ruby/src/master/builtin.c I, [2024-05-10T14:35:33.828013 #504881] INFO -- : linking static-library libruby-static.a I, [2024-05-10T14:35:35.762068 #504881] INFO -- : linking ruby I, [2024-05-10T14:35:36.664786 #504881] INFO -- : $$$[end] "make ruby -j3" exit with 0. I, [2024-05-10T14:35:36.664956 #504881] INFO -- : $$$[beg] make all -j3 I, [2024-05-10T14:35:36.753307 #504881] INFO -- : BASERUBY = /usr/local/bin/ruby --disable=gems I, [2024-05-10T14:35:36.753370 #504881] INFO -- : CC = gcc I, [2024-05-10T14:35:36.753381 #504881] INFO -- : LD = ld I, [2024-05-10T14:35:36.753390 #504881] INFO -- : LDSHARED = gcc -shared I, [2024-05-10T14:35:36.753401 #504881] INFO -- : CFLAGS = -O3 -fno-fast-math -ggdb3 -Wall -Wextra -Wdeprecated-declarations -Wdiv-by-zero -Wduplicated-cond -Wimplicit-function-declaration -Wimplicit-int -Wpointer-arith -Wwrite-strings -Wold-style-definition -Wimplicit-fallthrough=0 -Wmissing-noreturn -Wno-cast-function-type -Wno-constant-logical-operand -Wno-long-long -Wno-missing-field-initializers -Wno-overlength-strings -Wno-packed-bitfield-compat -Wno-parentheses-equality -Wno-self-assign -Wno-tautological-compare -Wno-unused-parameter -Wno-unused-value -Wsuggest-attribute=format -Wsuggest-attribute=noreturn -Wunused-variable -Wmisleading-indentation -Wundef I, [2024-05-10T14:35:36.753410 #504881] INFO -- : XCFLAGS = -U_FORTIFY_SOURCE -D_FORTIFY_SOURCE=2 -fstack-protector-strong -msign-return-address=all -fno-strict-overflow -fvisibility=hidden -fexcess-precision=standard -DRUBY_EXPORT -fPIE -I. -I.ext/include/aarch64-linux -I/home/opc/ruby/src/master/include -I/home/opc/ruby/src/master -I/home/opc/ruby/src/master/prism -I/home/opc/ruby/src/master/enc/unicode/15.0.0 I, [2024-05-10T14:35:36.753419 #504881] INFO -- : CPPFLAGS = I, [2024-05-10T14:35:36.753427 #504881] INFO -- : DLDFLAGS = -Wl,--compress-debug-sections=zlib -fstack-protector-strong -pie I, [2024-05-10T14:35:36.753436 #504881] INFO -- : SOLIBS = -lz -lrt -lrt -ldl -lcrypt -lm -lpthread I, [2024-05-10T14:35:36.753444 #504881] INFO -- : LANG = en_US.UTF-8 I, [2024-05-10T14:35:36.753452 #504881] INFO -- : LC_ALL = I, [2024-05-10T14:35:36.753460 #504881] INFO -- : LC_CTYPE = I, [2024-05-10T14:35:36.753468 #504881] INFO -- : MFLAGS = -j3 --jobserver-auth=4,5 I, [2024-05-10T14:35:36.753475 #504881] INFO -- : RUSTC = rustc I, [2024-05-10T14:35:36.753483 #504881] INFO -- : YJIT_RUSTC_ARGS = --crate-name=yjit --crate-type=staticlib --edition=2021 -g -C lto=thin -C opt-level=3 -C overflow-checks=on '--out-dir=/home/opc/ruby/build/master/yjit/target/release/' /home/opc/ruby/src/master/yjit/src/lib.rs I, [2024-05-10T14:35:36.754329 #504881] INFO -- : gcc (GCC) 8.5.0 20210514 (Red Hat 8.5.0-10.1.0.1) I, [2024-05-10T14:35:36.754373 #504881] INFO -- : Copyright (C) 2018 Free Software Foundation, Inc. I, [2024-05-10T14:35:36.754383 #504881] INFO -- : This is free software; see the source for copying conditions. There is NO I, [2024-05-10T14:35:36.754393 #504881] INFO -- : warranty; not even for MERCHANTABILITY or FITNESS FOR A PARTICULAR PURPOSE. I, [2024-05-10T14:35:36.754401 #504881] INFO -- : I, [2024-05-10T14:35:36.787106 #504881] INFO -- : generating encdb.h I, [2024-05-10T14:35:36.788400 #504881] INFO -- : generating enc.mk I, [2024-05-10T14:35:36.824753 #504881] INFO -- : encdb.h unchanged I, [2024-05-10T14:35:37.022311 #504881] INFO -- : making srcs under enc I, [2024-05-10T14:35:37.022465 #504881] INFO -- : making enc I, [2024-05-10T14:35:37.049840 #504881] INFO -- : make[1]: Entering directory '/home/opc/ruby/build/master' I, [2024-05-10T14:35:37.049913 #504881] INFO -- : make[1]: Nothing to be done for 'enc'. I, [2024-05-10T14:35:37.049926 #504881] INFO -- : make[1]: Leaving directory '/home/opc/ruby/build/master' I, [2024-05-10T14:35:37.064652 #504881] INFO -- : make[1]: Entering directory '/home/opc/ruby/build/master' I, [2024-05-10T14:35:37.064734 #504881] INFO -- : make[1]: Nothing to be done for 'srcs'. I, [2024-05-10T14:35:37.064756 #504881] INFO -- : make[1]: Leaving directory '/home/opc/ruby/build/master' I, [2024-05-10T14:35:37.065563 #504881] INFO -- : generating transdb.h I, [2024-05-10T14:35:37.207997 #504881] INFO -- : transdb.h unchanged I, [2024-05-10T14:35:37.209386 #504881] INFO -- : generating makefiles ext/configure-ext.mk I, [2024-05-10T14:35:37.209766 #504881] INFO -- : making trans I, [2024-05-10T14:35:37.249474 #504881] INFO -- : ext/configure-ext.mk updated I, [2024-05-10T14:35:37.252745 #504881] INFO -- : make[1]: Entering directory '/home/opc/ruby/build/master' I, [2024-05-10T14:35:37.258235 #504881] INFO -- : make[1]: Entering directory '/home/opc/ruby/build/master' I, [2024-05-10T14:35:37.258291 #504881] INFO -- : make[1]: Nothing to be done for 'trans'. I, [2024-05-10T14:35:37.258301 #504881] INFO -- : make[1]: Leaving directory '/home/opc/ruby/build/master' I, [2024-05-10T14:35:37.379299 #504881] INFO -- : making encs I, [2024-05-10T14:35:37.431975 #504881] INFO -- : make[1]: Entering directory '/home/opc/ruby/build/master' I, [2024-05-10T14:35:37.432049 #504881] INFO -- : make[1]: Nothing to be done for 'encs'. I, [2024-05-10T14:35:37.432060 #504881] INFO -- : make[1]: Leaving directory '/home/opc/ruby/build/master' I, [2024-05-10T14:35:37.997701 #504881] INFO -- : make[1]: Leaving directory '/home/opc/ruby/build/master' I, [2024-05-10T14:35:37.998403 #504881] INFO -- : generating makefile exts.mk I, [2024-05-10T14:35:38.056922 #504881] INFO -- : exts.mk unchanged I, [2024-05-10T14:35:38.061852 #504881] INFO -- : make[1]: Entering directory '/home/opc/ruby/build/master' I, [2024-05-10T14:35:38.166324 #504881] INFO -- : make[2]: Entering directory '/home/opc/ruby/build/master/ext/coverage' I, [2024-05-10T14:35:38.167604 #504881] INFO -- : make[2]: Entering directory '/home/opc/ruby/build/master/ext/digest' I, [2024-05-10T14:35:38.169063 #504881] INFO -- : make[2]: Entering directory '/home/opc/ruby/build/master/ext/date' I, [2024-05-10T14:35:38.171798 #504881] INFO -- : make[2]: Leaving directory '/home/opc/ruby/build/master/ext/coverage' I, [2024-05-10T14:35:38.175877 #504881] INFO -- : make[2]: Leaving directory '/home/opc/ruby/build/master/ext/date' I, [2024-05-10T14:35:38.179237 #504881] INFO -- : make[2]: Leaving directory '/home/opc/ruby/build/master/ext/digest' I, [2024-05-10T14:35:38.184474 #504881] INFO -- : make[2]: Entering directory '/home/opc/ruby/build/master/ext/io/console' I, [2024-05-10T14:35:38.186549 #504881] INFO -- : make[2]: Entering directory '/home/opc/ruby/build/master/ext/fiddle' I, [2024-05-10T14:35:38.188666 #504881] INFO -- : make[2]: Leaving directory '/home/opc/ruby/build/master/ext/io/console' I, [2024-05-10T14:35:38.190678 #504881] INFO -- : make[2]: Entering directory '/home/opc/ruby/build/master/ext/json' I, [2024-05-10T14:35:38.197254 #504881] INFO -- : make[2]: Leaving directory '/home/opc/ruby/build/master/ext/json' I, [2024-05-10T14:35:38.198674 #504881] INFO -- : make[2]: Entering directory '/home/opc/ruby/build/master/ext/monitor' I, [2024-05-10T14:35:38.200333 #504881] INFO -- : make[2]: Leaving directory '/home/opc/ruby/build/master/ext/fiddle' I, [2024-05-10T14:35:38.202848 #504881] INFO -- : make[2]: Leaving directory '/home/opc/ruby/build/master/ext/monitor' I, [2024-05-10T14:35:38.203629 #504881] INFO -- : make[2]: Entering directory '/home/opc/ruby/build/master/ext/objspace' I, [2024-05-10T14:35:38.207182 #504881] INFO -- : make[2]: Entering directory '/home/opc/ruby/build/master/ext/pathname' I, [2024-05-10T14:35:38.209671 #504881] INFO -- : make[2]: Leaving directory '/home/opc/ruby/build/master/ext/objspace' I, [2024-05-10T14:35:38.214908 #504881] INFO -- : make[2]: Leaving directory '/home/opc/ruby/build/master/ext/pathname' I, [2024-05-10T14:35:38.216943 #504881] INFO -- : make[2]: Entering directory '/home/opc/ruby/build/master/ext/psych' I, [2024-05-10T14:35:38.219257 #504881] INFO -- : make[2]: Entering directory '/home/opc/ruby/build/master/ext/pty' I, [2024-05-10T14:35:38.223476 #504881] INFO -- : make[2]: Entering directory '/home/opc/ruby/build/master/ext/openssl' I, [2024-05-10T14:35:38.227409 #504881] INFO -- : make[2]: Leaving directory '/home/opc/ruby/build/master/ext/pty' I, [2024-05-10T14:35:38.238438 #504881] INFO -- : make[2]: Leaving directory '/home/opc/ruby/build/master/ext/psych' I, [2024-05-10T14:35:38.240232 #504881] INFO -- : make[2]: Entering directory '/home/opc/ruby/build/master/ext/rubyvm' I, [2024-05-10T14:35:38.240925 #504881] INFO -- : make[2]: Entering directory '/home/opc/ruby/build/master/ext/ripper' I, [2024-05-10T14:35:38.244705 #504881] INFO -- : make[2]: Leaving directory '/home/opc/ruby/build/master/ext/rubyvm' I, [2024-05-10T14:35:38.244940 #504881] INFO -- : make[2]: Leaving directory '/home/opc/ruby/build/master/ext/openssl' I, [2024-05-10T14:35:38.248239 #504881] INFO -- : make[2]: Leaving directory '/home/opc/ruby/build/master/ext/ripper' I, [2024-05-10T14:35:38.255068 #504881] INFO -- : make[2]: Entering directory '/home/opc/ruby/build/master/.bundle/gems/bigdecimal-3.1.7/ext/bigdecimal' I, [2024-05-10T14:35:38.255868 #504881] INFO -- : make[2]: Entering directory '/home/opc/ruby/build/master/.bundle/gems/bigdecimal-3.1.8/ext/bigdecimal' I, [2024-05-10T14:35:38.256822 #504881] INFO -- : make[2]: Entering directory '/home/opc/ruby/build/master/ext/socket' I, [2024-05-10T14:35:38.269645 #504881] INFO -- : make[2]: Leaving directory '/home/opc/ruby/build/master/ext/socket' I, [2024-05-10T14:35:38.271990 #504881] INFO -- : make[2]: Entering directory '/home/opc/ruby/build/master/.bundle/gems/debug-1.9.2/ext/debug' I, [2024-05-10T14:35:38.286846 #504881] INFO -- : make[2]: Leaving directory '/home/opc/ruby/build/master/.bundle/gems/bigdecimal-3.1.7/ext/bigdecimal' I, [2024-05-10T14:35:38.289333 #504881] INFO -- : make[2]: Entering directory '/home/opc/ruby/build/master/.bundle/gems/nkf-0.2.0/ext/nkf' I, [2024-05-10T14:35:38.294278 #504881] INFO -- : make[2]: Leaving directory '/home/opc/ruby/build/master/.bundle/gems/bigdecimal-3.1.8/ext/bigdecimal' I, [2024-05-10T14:35:38.296573 #504881] INFO -- : make[2]: Entering directory '/home/opc/ruby/build/master/.bundle/gems/racc-1.7.3/ext/racc/cparse' I, [2024-05-10T14:35:38.306976 #504881] INFO -- : make[2]: Leaving directory '/home/opc/ruby/build/master/.bundle/gems/debug-1.9.2/ext/debug' I, [2024-05-10T14:35:38.309999 #504881] INFO -- : make[2]: Entering directory '/home/opc/ruby/build/master/.bundle/gems/rbs-3.4.4/ext/rbs_extension' I, [2024-05-10T14:35:38.320136 #504881] INFO -- : make[2]: Leaving directory '/home/opc/ruby/build/master/.bundle/gems/nkf-0.2.0/ext/nkf' I, [2024-05-10T14:35:38.322588 #504881] INFO -- : make[2]: Entering directory '/home/opc/ruby/build/master/.bundle/gems/syslog-0.1.2/ext/syslog' I, [2024-05-10T14:35:38.328981 #504881] INFO -- : make[2]: Leaving directory '/home/opc/ruby/build/master/.bundle/gems/racc-1.7.3/ext/racc/cparse' I, [2024-05-10T14:35:38.343305 #504881] INFO -- : make[2]: Leaving directory '/home/opc/ruby/build/master/.bundle/gems/rbs-3.4.4/ext/rbs_extension' I, [2024-05-10T14:35:38.349256 #504881] INFO -- : make[2]: Entering directory '/home/opc/ruby/build/master/ext/digest/sha2' I, [2024-05-10T14:35:38.353569 #504881] INFO -- : make[2]: Leaving directory '/home/opc/ruby/build/master/.bundle/gems/syslog-0.1.2/ext/syslog' I, [2024-05-10T14:35:38.354508 #504881] INFO -- : make[2]: Leaving directory '/home/opc/ruby/build/master/ext/digest/sha2' I, [2024-05-10T14:35:38.394888 #504881] INFO -- : make[2]: Entering directory '/home/opc/ruby/build/master' I, [2024-05-10T14:35:38.477638 #504881] INFO -- : make[2]: 'ruby' is up to date. I, [2024-05-10T14:35:38.477713 #504881] INFO -- : make[2]: Leaving directory '/home/opc/ruby/build/master' I, [2024-05-10T14:35:38.477846 #504881] INFO -- : make[1]: Leaving directory '/home/opc/ruby/build/master' I, [2024-05-10T14:35:38.482303 #504881] INFO -- : make[1]: Entering directory '/home/opc/ruby/build/master' I, [2024-05-10T14:35:38.482349 #504881] INFO -- : make[1]: Nothing to be done for 'note'. I, [2024-05-10T14:35:38.482360 #504881] INFO -- : make[1]: Leaving directory '/home/opc/ruby/build/master' I, [2024-05-10T14:35:38.482655 #504881] INFO -- : $$$[end] "make all -j3" exit with 0. I, [2024-05-10T14:35:38.482778 #504881] INFO -- : $$$[beg] make install -j3 I, [2024-05-10T14:35:38.576228 #504881] INFO -- : Update minitest to ea9caafc0754b1d6236a490d59e624b53209734a I, [2024-05-10T14:35:38.576449 #504881] INFO -- : Update power_assert to 84e85124c5014a139af39161d484156cfe87a9ed I, [2024-05-10T14:35:38.576664 #504881] INFO -- : Update rbs to ba7872795d5de04adb8ff500c0e6afdc81a041dd I, [2024-05-10T14:35:38.579213 #504881] INFO -- : echo ea9caafc0754b1d6236a490d59e624b53209734a | /bin/sh /home/opc/ruby/src/master/tool/ifchange /home/opc/ruby/src/master/.bundle/.timestamp/minitest.revision - I, [2024-05-10T14:35:38.579647 #504881] INFO -- : echo 84e85124c5014a139af39161d484156cfe87a9ed | /bin/sh /home/opc/ruby/src/master/tool/ifchange /home/opc/ruby/src/master/.bundle/.timestamp/power_assert.revision - I, [2024-05-10T14:35:38.579857 #504881] INFO -- : echo ba7872795d5de04adb8ff500c0e6afdc81a041dd | /bin/sh /home/opc/ruby/src/master/tool/ifchange /home/opc/ruby/src/master/.bundle/.timestamp/rbs.revision - I, [2024-05-10T14:35:38.585152 #504881] INFO -- : /home/opc/ruby/src/master/.bundle/.timestamp/minitest.revision unchanged I, [2024-05-10T14:35:38.585857 #504881] INFO -- : /home/opc/ruby/src/master/.bundle/.timestamp/power_assert.revision unchanged I, [2024-05-10T14:35:38.586193 #504881] INFO -- : /home/opc/ruby/src/master/.bundle/.timestamp/rbs.revision unchanged I, [2024-05-10T14:35:38.588241 #504881] INFO -- : Update typeprof to b19a6416da3a05d57fadd6ffdadb382b6d236ca5 I, [2024-05-10T14:35:38.589645 #504881] INFO -- : BASERUBY = /usr/local/bin/ruby --disable=gems I, [2024-05-10T14:35:38.589684 #504881] INFO -- : CC = gcc I, [2024-05-10T14:35:38.589695 #504881] INFO -- : LD = ld I, [2024-05-10T14:35:38.589703 #504881] INFO -- : LDSHARED = gcc -shared I, [2024-05-10T14:35:38.589714 #504881] INFO -- : CFLAGS = -O3 -fno-fast-math -ggdb3 -Wall -Wextra -Wdeprecated-declarations -Wdiv-by-zero -Wduplicated-cond -Wimplicit-function-declaration -Wimplicit-int -Wpointer-arith -Wwrite-strings -Wold-style-definition -Wimplicit-fallthrough=0 -Wmissing-noreturn -Wno-cast-function-type -Wno-constant-logical-operand -Wno-long-long -Wno-missing-field-initializers -Wno-overlength-strings -Wno-packed-bitfield-compat -Wno-parentheses-equality -Wno-self-assign -Wno-tautological-compare -Wno-unused-parameter -Wno-unused-value -Wsuggest-attribute=format -Wsuggest-attribute=noreturn -Wunused-variable -Wmisleading-indentation -Wundef I, [2024-05-10T14:35:38.589724 #504881] INFO -- : XCFLAGS = -U_FORTIFY_SOURCE -D_FORTIFY_SOURCE=2 -fstack-protector-strong -msign-return-address=all -fno-strict-overflow -fvisibility=hidden -fexcess-precision=standard -DRUBY_EXPORT -fPIE -I. -I.ext/include/aarch64-linux -I/home/opc/ruby/src/master/include -I/home/opc/ruby/src/master -I/home/opc/ruby/src/master/prism -I/home/opc/ruby/src/master/enc/unicode/15.0.0 I, [2024-05-10T14:35:38.589733 #504881] INFO -- : CPPFLAGS = I, [2024-05-10T14:35:38.589741 #504881] INFO -- : DLDFLAGS = -Wl,--compress-debug-sections=zlib -fstack-protector-strong -pie I, [2024-05-10T14:35:38.589750 #504881] INFO -- : SOLIBS = -lz -lrt -lrt -ldl -lcrypt -lm -lpthread I, [2024-05-10T14:35:38.589758 #504881] INFO -- : LANG = en_US.UTF-8 I, [2024-05-10T14:35:38.589765 #504881] INFO -- : LC_ALL = I, [2024-05-10T14:35:38.589773 #504881] INFO -- : LC_CTYPE = I, [2024-05-10T14:35:38.589780 #504881] INFO -- : MFLAGS = -j3 --jobserver-auth=4,5 I, [2024-05-10T14:35:38.589788 #504881] INFO -- : RUSTC = rustc I, [2024-05-10T14:35:38.589799 #504881] INFO -- : YJIT_RUSTC_ARGS = --crate-name=yjit --crate-type=staticlib --edition=2021 -g -C lto=thin -C opt-level=3 -C overflow-checks=on '--out-dir=/home/opc/ruby/build/master/yjit/target/release/' /home/opc/ruby/src/master/yjit/src/lib.rs I, [2024-05-10T14:35:38.621175 #504881] INFO -- : gcc (GCC) 8.5.0 20210514 (Red Hat 8.5.0-10.1.0.1) I, [2024-05-10T14:35:38.621288 #504881] INFO -- : Copyright (C) 2018 Free Software Foundation, Inc. I, [2024-05-10T14:35:38.621298 #504881] INFO -- : This is free software; see the source for copying conditions. There is NO I, [2024-05-10T14:35:38.621308 #504881] INFO -- : warranty; not even for MERCHANTABILITY or FITNESS FOR A PARTICULAR PURPOSE. I, [2024-05-10T14:35:38.621316 #504881] INFO -- : I, [2024-05-10T14:35:38.621627 #504881] INFO -- : generating encdb.h I, [2024-05-10T14:35:38.622359 #504881] INFO -- : generating enc.mk I, [2024-05-10T14:35:38.626551 #504881] INFO -- : echo b19a6416da3a05d57fadd6ffdadb382b6d236ca5 | /bin/sh /home/opc/ruby/src/master/tool/ifchange /home/opc/ruby/src/master/.bundle/.timestamp/typeprof.revision - I, [2024-05-10T14:35:38.634472 #504881] INFO -- : /home/opc/ruby/src/master/.bundle/.timestamp/typeprof.revision unchanged I, [2024-05-10T14:35:38.663981 #504881] INFO -- : encdb.h unchanged I, [2024-05-10T14:35:38.755309 #504881] INFO -- : Building power_assert@84e85124c5014a139af39161d484156cfe87a9ed to /home/opc/ruby/src/master/gems/power_assert-2.0.3.gem I, [2024-05-10T14:35:38.861086 #504881] INFO -- : making srcs under enc I, [2024-05-10T14:35:38.861145 #504881] INFO -- : making enc I, [2024-05-10T14:35:38.876752 #504881] INFO -- : Successfully built RubyGem I, [2024-05-10T14:35:38.876801 #504881] INFO -- : Name: power_assert I, [2024-05-10T14:35:38.876812 #504881] INFO -- : Version: 2.0.4dev I, [2024-05-10T14:35:38.876820 #504881] INFO -- : File: power_assert-2.0.4dev.gem I, [2024-05-10T14:35:38.879078 #504881] INFO -- : Extracting bundle gem power_assert-2.0.3... I, [2024-05-10T14:35:38.889617 #504881] INFO -- : make[1]: Entering directory '/home/opc/ruby/build/master' I, [2024-05-10T14:35:38.889677 #504881] INFO -- : make[1]: Nothing to be done for 'enc'. I, [2024-05-10T14:35:38.889690 #504881] INFO -- : make[1]: Leaving directory '/home/opc/ruby/build/master' I, [2024-05-10T14:35:38.904648 #504881] INFO -- : make[1]: Entering directory '/home/opc/ruby/build/master' I, [2024-05-10T14:35:38.904707 #504881] INFO -- : make[1]: Nothing to be done for 'srcs'. I, [2024-05-10T14:35:38.904718 #504881] INFO -- : make[1]: Leaving directory '/home/opc/ruby/build/master' I, [2024-05-10T14:35:38.905609 #504881] INFO -- : generating transdb.h I, [2024-05-10T14:35:38.977288 #504881] INFO -- : Try with hash version of bundled gems instead of gems/power_assert-2.0.3.gem. We don't use this gem with release version of Ruby. I, [2024-05-10T14:35:38.987340 #504881] INFO -- : Unpacked gems/power_assert-2.0.4dev.gem I, [2024-05-10T14:35:39.049419 #504881] INFO -- : transdb.h unchanged I, [2024-05-10T14:35:39.050790 #504881] INFO -- : generating makefiles ext/configure-ext.mk I, [2024-05-10T14:35:39.050951 #504881] INFO -- : making trans I, [2024-05-10T14:35:39.089706 #504881] INFO -- : ext/configure-ext.mk unchanged I, [2024-05-10T14:35:39.092702 #504881] INFO -- : make[1]: Entering directory '/home/opc/ruby/build/master' I, [2024-05-10T14:35:39.100211 #504881] INFO -- : make[1]: Entering directory '/home/opc/ruby/build/master' I, [2024-05-10T14:35:39.100263 #504881] INFO -- : make[1]: Nothing to be done for 'trans'. I, [2024-05-10T14:35:39.100273 #504881] INFO -- : make[1]: Leaving directory '/home/opc/ruby/build/master' I, [2024-05-10T14:35:39.793603 #504881] INFO -- : making encs I, [2024-05-10T14:35:39.827759 #504881] INFO -- : make[1]: Leaving directory '/home/opc/ruby/build/master' I, [2024-05-10T14:35:39.828407 #504881] INFO -- : generating makefile exts.mk I, [2024-05-10T14:35:39.849133 #504881] INFO -- : make[1]: Entering directory '/home/opc/ruby/build/master' I, [2024-05-10T14:35:39.849235 #504881] INFO -- : make[1]: Nothing to be done for 'encs'. I, [2024-05-10T14:35:39.849249 #504881] INFO -- : make[1]: Leaving directory '/home/opc/ruby/build/master' I, [2024-05-10T14:35:39.886707 #504881] INFO -- : exts.mk unchanged I, [2024-05-10T14:35:39.891667 #504881] INFO -- : make[1]: Entering directory '/home/opc/ruby/build/master' I, [2024-05-10T14:35:39.998369 #504881] INFO -- : make[2]: Entering directory '/home/opc/ruby/build/master/ext/coverage' I, [2024-05-10T14:35:39.998978 #504881] INFO -- : make[2]: Entering directory '/home/opc/ruby/build/master/ext/digest' I, [2024-05-10T14:35:40.000952 #504881] INFO -- : make[2]: Entering directory '/home/opc/ruby/build/master/ext/date' I, [2024-05-10T14:35:40.004306 #504881] INFO -- : make[2]: Leaving directory '/home/opc/ruby/build/master/ext/coverage' I, [2024-05-10T14:35:40.006153 #504881] INFO -- : make[2]: Leaving directory '/home/opc/ruby/build/master/ext/date' I, [2024-05-10T14:35:40.008734 #504881] INFO -- : make[2]: Leaving directory '/home/opc/ruby/build/master/ext/digest' I, [2024-05-10T14:35:40.016201 #504881] INFO -- : make[2]: Entering directory '/home/opc/ruby/build/master/ext/fiddle' I, [2024-05-10T14:35:40.022132 #504881] INFO -- : make[2]: Entering directory '/home/opc/ruby/build/master/ext/json' I, [2024-05-10T14:35:40.025029 #504881] INFO -- : make[2]: Entering directory '/home/opc/ruby/build/master/ext/io/console' I, [2024-05-10T14:35:40.026696 #504881] INFO -- : make[2]: Leaving directory '/home/opc/ruby/build/master/ext/fiddle' I, [2024-05-10T14:35:40.031347 #504881] INFO -- : make[2]: Entering directory '/home/opc/ruby/build/master/ext/monitor' I, [2024-05-10T14:35:40.032738 #504881] INFO -- : make[2]: Leaving directory '/home/opc/ruby/build/master/ext/json' I, [2024-05-10T14:35:40.035342 #504881] INFO -- : make[2]: Leaving directory '/home/opc/ruby/build/master/ext/io/console' I, [2024-05-10T14:35:40.036063 #504881] INFO -- : make[2]: Leaving directory '/home/opc/ruby/build/master/ext/monitor' I, [2024-05-10T14:35:40.040136 #504881] INFO -- : make[2]: Entering directory '/home/opc/ruby/build/master/ext/pathname' I, [2024-05-10T14:35:40.041972 #504881] INFO -- : make[2]: Entering directory '/home/opc/ruby/build/master/ext/objspace' I, [2024-05-10T14:35:40.048236 #504881] INFO -- : make[2]: Leaving directory '/home/opc/ruby/build/master/ext/pathname' I, [2024-05-10T14:35:40.052363 #504881] INFO -- : make[2]: Leaving directory '/home/opc/ruby/build/master/ext/objspace' I, [2024-05-10T14:35:40.054158 #504881] INFO -- : make[2]: Entering directory '/home/opc/ruby/build/master/ext/openssl' I, [2024-05-10T14:35:40.058389 #504881] INFO -- : make[2]: Entering directory '/home/opc/ruby/build/master/ext/pty' I, [2024-05-10T14:35:40.060114 #504881] INFO -- : make[2]: Entering directory '/home/opc/ruby/build/master/ext/psych' I, [2024-05-10T14:35:40.072019 #504881] INFO -- : make[2]: Leaving directory '/home/opc/ruby/build/master/ext/pty' I, [2024-05-10T14:35:40.080751 #504881] INFO -- : make[2]: Leaving directory '/home/opc/ruby/build/master/ext/openssl' I, [2024-05-10T14:35:40.085781 #504881] INFO -- : make[2]: Entering directory '/home/opc/ruby/build/master/ext/ripper' I, [2024-05-10T14:35:40.088273 #504881] INFO -- : make[2]: Leaving directory '/home/opc/ruby/build/master/ext/psych' I, [2024-05-10T14:35:40.090081 #504881] INFO -- : make[2]: Entering directory '/home/opc/ruby/build/master/ext/rubyvm' I, [2024-05-10T14:35:40.094211 #504881] INFO -- : make[2]: Leaving directory '/home/opc/ruby/build/master/ext/ripper' I, [2024-05-10T14:35:40.100696 #504881] INFO -- : make[2]: Leaving directory '/home/opc/ruby/build/master/ext/rubyvm' I, [2024-05-10T14:35:40.103886 #504881] INFO -- : make[2]: Entering directory '/home/opc/ruby/build/master/ext/socket' I, [2024-05-10T14:35:40.108425 #504881] INFO -- : make[2]: Entering directory '/home/opc/ruby/build/master/.bundle/gems/bigdecimal-3.1.7/ext/bigdecimal' I, [2024-05-10T14:35:40.119200 #504881] INFO -- : make[2]: Entering directory '/home/opc/ruby/build/master/.bundle/gems/bigdecimal-3.1.8/ext/bigdecimal' I, [2024-05-10T14:35:40.120571 #504881] INFO -- : make[2]: Leaving directory '/home/opc/ruby/build/master/ext/socket' I, [2024-05-10T14:35:40.126797 #504881] INFO -- : make[2]: Entering directory '/home/opc/ruby/build/master/.bundle/gems/debug-1.9.2/ext/debug' I, [2024-05-10T14:35:40.141001 #504881] INFO -- : make[2]: Leaving directory '/home/opc/ruby/build/master/.bundle/gems/bigdecimal-3.1.7/ext/bigdecimal' I, [2024-05-10T14:35:40.143515 #504881] INFO -- : make[2]: Entering directory '/home/opc/ruby/build/master/.bundle/gems/nkf-0.2.0/ext/nkf' I, [2024-05-10T14:35:40.168950 #504881] INFO -- : make[2]: Leaving directory '/home/opc/ruby/build/master/.bundle/gems/debug-1.9.2/ext/debug' I, [2024-05-10T14:35:40.177256 #504881] INFO -- : make[2]: Leaving directory '/home/opc/ruby/build/master/.bundle/gems/bigdecimal-3.1.8/ext/bigdecimal' I, [2024-05-10T14:35:40.179050 #504881] INFO -- : make[2]: Entering directory '/home/opc/ruby/build/master/.bundle/gems/racc-1.7.3/ext/racc/cparse' I, [2024-05-10T14:35:40.180034 #504881] INFO -- : make[2]: Entering directory '/home/opc/ruby/build/master/.bundle/gems/rbs-3.4.4/ext/rbs_extension' I, [2024-05-10T14:35:40.193303 #504881] INFO -- : make[2]: Leaving directory '/home/opc/ruby/build/master/.bundle/gems/nkf-0.2.0/ext/nkf' I, [2024-05-10T14:35:40.202858 #504881] INFO -- : make[2]: Entering directory '/home/opc/ruby/build/master/.bundle/gems/syslog-0.1.2/ext/syslog' I, [2024-05-10T14:35:40.213365 #504881] INFO -- : make[2]: Leaving directory '/home/opc/ruby/build/master/.bundle/gems/racc-1.7.3/ext/racc/cparse' I, [2024-05-10T14:35:40.229270 #504881] INFO -- : make[2]: Leaving directory '/home/opc/ruby/build/master/.bundle/gems/rbs-3.4.4/ext/rbs_extension' I, [2024-05-10T14:35:40.244698 #504881] INFO -- : make[2]: Leaving directory '/home/opc/ruby/build/master/.bundle/gems/syslog-0.1.2/ext/syslog' I, [2024-05-10T14:35:40.253132 #504881] INFO -- : make[2]: Entering directory '/home/opc/ruby/build/master/ext/digest/sha2' I, [2024-05-10T14:35:40.261370 #504881] INFO -- : make[2]: Leaving directory '/home/opc/ruby/build/master/ext/digest/sha2' I, [2024-05-10T14:35:40.298950 #504881] INFO -- : make[2]: Entering directory '/home/opc/ruby/build/master' I, [2024-05-10T14:35:40.380921 #504881] INFO -- : make[2]: 'ruby' is up to date. I, [2024-05-10T14:35:40.380995 #504881] INFO -- : make[2]: Leaving directory '/home/opc/ruby/build/master' I, [2024-05-10T14:35:40.381165 #504881] INFO -- : make[1]: Leaving directory '/home/opc/ruby/build/master' I, [2024-05-10T14:35:40.385482 #504881] INFO -- : make[1]: Entering directory '/home/opc/ruby/build/master' I, [2024-05-10T14:35:40.385538 #504881] INFO -- : make[1]: Nothing to be done for 'note'. I, [2024-05-10T14:35:40.385548 #504881] INFO -- : make[1]: Leaving directory '/home/opc/ruby/build/master' I, [2024-05-10T14:35:40.385860 #504881] INFO -- : ./miniruby -I/home/opc/ruby/src/master/lib -I. -I.ext/common /home/opc/ruby/src/master/tool/runruby.rb --extout=.ext -- --disable-gems -r./aarch64-linux-fake /home/opc/ruby/src/master/tool/rbinstall.rb --make="make" --dest-dir="" --extout=".ext" --ext-build-dir="./ext" --mflags="-j3 --jobserver-auth=4,5" --make-flags=" -j3 --jobserver-auth=4,5" --data-mode=0644 --prog-mode=0755 --installed-list .installed.list --mantype="doc" --gnumake --install=all --exclude=doc I, [2024-05-10T14:35:40.532943 #504881] INFO -- : Installing to I, [2024-05-10T14:35:40.533010 #504881] INFO -- : installing binary commands: /home/opc/ruby/install/master/bin I, [2024-05-10T14:35:40.544647 #504881] INFO -- : installing base libraries: /home/opc/ruby/install/master/lib I, [2024-05-10T14:35:40.545127 #504881] INFO -- : installing arch files: /home/opc/ruby/install/master/lib/ruby/3.4.0+0/aarch64-linux I, [2024-05-10T14:35:40.545274 #504881] INFO -- : installing pkgconfig data: /home/opc/ruby/install/master/lib/pkgconfig I, [2024-05-10T14:35:40.545347 #504881] INFO -- : installing extension objects: /home/opc/ruby/install/master/lib/ruby/3.4.0+0/aarch64-linux I, [2024-05-10T14:35:40.557704 #504881] INFO -- : installing extension objects: /home/opc/ruby/install/master/lib/ruby/site_ruby/3.4.0+0/aarch64-linux I, [2024-05-10T14:35:40.557738 #504881] INFO -- : installing extension objects: /home/opc/ruby/install/master/lib/ruby/vendor_ruby/3.4.0+0/aarch64-linux I, [2024-05-10T14:35:40.558067 #504881] INFO -- : installing extension headers: /home/opc/ruby/install/master/include/ruby-3.4.0+0/aarch64-linux I, [2024-05-10T14:35:40.558324 #504881] INFO -- : installing extension scripts: /home/opc/ruby/install/master/lib/ruby/3.4.0+0 I, [2024-05-10T14:35:40.567344 #504881] INFO -- : installing extension scripts: /home/opc/ruby/install/master/lib/ruby/site_ruby/3.4.0+0 I, [2024-05-10T14:35:40.567365 #504881] INFO -- : installing extension scripts: /home/opc/ruby/install/master/lib/ruby/vendor_ruby/3.4.0+0 I, [2024-05-10T14:35:40.567376 #504881] INFO -- : installing extension headers: /home/opc/ruby/install/master/include/ruby-3.4.0+0/ruby I, [2024-05-10T14:35:40.567488 #504881] INFO -- : installing command scripts: /home/opc/ruby/install/master/bin I, [2024-05-10T14:35:40.567620 #504881] INFO -- : installing library scripts: /home/opc/ruby/install/master/lib/ruby/3.4.0+0 I, [2024-05-10T14:35:40.651207 #504881] INFO -- : installing common headers: /home/opc/ruby/install/master/include/ruby-3.4.0+0 I, [2024-05-10T14:35:40.666825 #504881] INFO -- : installing manpages: /home/opc/ruby/install/master/share/man/man1 I, [2024-05-10T14:35:40.667093 #504881] INFO -- : installing default gems from lib: /home/opc/ruby/install/master/lib/ruby/gems/3.4.0+0 I, [2024-05-10T14:35:40.706242 #504881] INFO -- : benchmark 0.3.0 I, [2024-05-10T14:35:40.719555 #504881] INFO -- : bundler 2.6.0.dev I, [2024-05-10T14:35:40.724336 #504881] INFO -- : cgi 0.4.1 I, [2024-05-10T14:35:40.725735 #504881] INFO -- : delegate 0.3.1 I, [2024-05-10T14:35:40.726817 #504881] INFO -- : did_you_mean 1.6.3 I, [2024-05-10T14:35:40.728098 #504881] INFO -- : english 0.8.0 I, [2024-05-10T14:35:40.729308 #504881] INFO -- : erb 4.0.4 I, [2024-05-10T14:35:40.731874 #504881] INFO -- : error_highlight 0.6.0 I, [2024-05-10T14:35:40.732995 #504881] INFO -- : fileutils 1.7.2 I, [2024-05-10T14:35:40.734125 #504881] INFO -- : find 0.2.0 I, [2024-05-10T14:35:40.735197 #504881] INFO -- : forwardable 1.3.3 I, [2024-05-10T14:35:40.736264 #504881] INFO -- : ipaddr 1.2.6 I, [2024-05-10T14:35:40.737403 #504881] INFO -- : irb 1.13.1 I, [2024-05-10T14:35:40.740045 #504881] INFO -- : logger 1.6.0 I, [2024-05-10T14:35:40.742654 #504881] INFO -- : net-http 0.4.1 I, [2024-05-10T14:35:40.744158 #504881] INFO -- : net-protocol 0.2.2 I, [2024-05-10T14:35:40.745334 #504881] INFO -- : open-uri 0.4.1 I, [2024-05-10T14:35:40.746479 #504881] INFO -- : open3 0.2.1 I, [2024-05-10T14:35:40.747559 #504881] INFO -- : optparse 0.5.0 I, [2024-05-10T14:35:40.748697 #504881] INFO -- : ostruct 0.6.0 I, [2024-05-10T14:35:40.749814 #504881] INFO -- : pp 0.5.0 I, [2024-05-10T14:35:40.750934 #504881] INFO -- : prettyprint 0.2.0 I, [2024-05-10T14:35:40.752025 #504881] INFO -- : prism 0.28.0 I, [2024-05-10T14:35:40.753263 #504881] INFO -- : pstore 0.1.3 I, [2024-05-10T14:35:40.754533 #504881] INFO -- : rdoc 6.6.3.1 I, [2024-05-10T14:35:40.758177 #504881] INFO -- : readline 0.0.4 I, [2024-05-10T14:35:40.759296 #504881] INFO -- : reline 0.5.6 I, [2024-05-10T14:35:40.760460 #504881] INFO -- : resolv 0.4.0 I, [2024-05-10T14:35:40.761648 #504881] INFO -- : ruby2_keywords 0.0.5 I, [2024-05-10T14:35:40.762720 #504881] INFO -- : securerandom 0.3.1 I, [2024-05-10T14:35:40.763811 #504881] INFO -- : set 1.1.0 I, [2024-05-10T14:35:40.764951 #504881] INFO -- : shellwords 0.2.0 I, [2024-05-10T14:35:40.766150 #504881] INFO -- : singleton 0.2.0 I, [2024-05-10T14:35:40.768392 #504881] INFO -- : syntax_suggest 2.0.0 I, [2024-05-10T14:35:40.771326 #504881] INFO -- : tempfile 0.2.1 I, [2024-05-10T14:35:40.772444 #504881] INFO -- : time 0.3.0 I, [2024-05-10T14:35:40.773638 #504881] INFO -- : timeout 0.4.1 I, [2024-05-10T14:35:40.774731 #504881] INFO -- : tmpdir 0.2.0 I, [2024-05-10T14:35:40.775849 #504881] INFO -- : tsort 0.2.0 I, [2024-05-10T14:35:40.776980 #504881] INFO -- : un 0.3.0 I, [2024-05-10T14:35:40.778125 #504881] INFO -- : uri 0.13.0 I, [2024-05-10T14:35:40.779261 #504881] INFO -- : weakref 0.1.3 I, [2024-05-10T14:35:40.780367 #504881] INFO -- : yaml 0.3.0 I, [2024-05-10T14:35:40.781545 #504881] INFO -- : installing default gems from ext: /home/opc/ruby/install/master/lib/ruby/gems/3.4.0+0 I, [2024-05-10T14:35:40.792417 #504881] INFO -- : date 3.3.4 I, [2024-05-10T14:35:40.793682 #504881] INFO -- : digest 3.1.1 I, [2024-05-10T14:35:40.794756 #504881] INFO -- : etc 1.4.3 I, [2024-05-10T14:35:40.795869 #504881] INFO -- : fcntl 1.1.0 I, [2024-05-10T14:35:40.797013 #504881] INFO -- : fiddle 1.1.3 I, [2024-05-10T14:35:40.798159 #504881] INFO -- : io-console 0.7.2 I, [2024-05-10T14:35:40.799227 #504881] INFO -- : io-nonblock 0.3.0 I, [2024-05-10T14:35:40.800316 #504881] INFO -- : io-wait 0.3.1 I, [2024-05-10T14:35:40.801460 #504881] INFO -- : json 2.7.2 I, [2024-05-10T14:35:40.802821 #504881] INFO -- : openssl 3.2.0 I, [2024-05-10T14:35:40.804344 #504881] INFO -- : pathname 0.3.0 I, [2024-05-10T14:35:40.805622 #504881] INFO -- : psych 5.1.2 I, [2024-05-10T14:35:40.806841 #504881] INFO -- : stringio 3.1.1 I, [2024-05-10T14:35:40.807988 #504881] INFO -- : strscan 3.1.1 I, [2024-05-10T14:35:40.809109 #504881] INFO -- : zlib 3.1.0 I, [2024-05-10T14:35:40.810079 #504881] INFO -- : installing bundled gems: /home/opc/ruby/install/master/lib/ruby/gems/3.4.0+0 I, [2024-05-10T14:35:40.810709 #504881] INFO -- : minitest 5.22.3 I, [2024-05-10T14:35:40.824735 #504881] INFO -- : rake 13.2.1 I, [2024-05-10T14:35:40.837910 #504881] INFO -- : test-unit 3.6.2 I, [2024-05-10T14:35:40.853835 #504881] INFO -- : rexml 3.2.6 I, [2024-05-10T14:35:40.867329 #504881] INFO -- : rss 0.3.0 I, [2024-05-10T14:35:40.876852 #504881] INFO -- : net-ftp 0.3.4 I, [2024-05-10T14:35:40.880415 #504881] INFO -- : net-imap 0.4.11 I, [2024-05-10T14:35:40.892159 #504881] INFO -- : net-pop 0.1.2 I, [2024-05-10T14:35:40.895037 #504881] INFO -- : net-smtp 0.5.0 I, [2024-05-10T14:35:40.898197 #504881] INFO -- : matrix 0.4.2 I, [2024-05-10T14:35:40.903880 #504881] INFO -- : prime 0.1.2 I, [2024-05-10T14:35:40.914332 #504881] INFO -- : rbs 3.4.4 I, [2024-05-10T14:35:41.019418 #504881] INFO -- : typeprof 0.21.11 I, [2024-05-10T14:35:41.027543 #504881] INFO -- : debug 1.9.2 I, [2024-05-10T14:35:41.037271 #504881] INFO -- : racc 1.7.3 I, [2024-05-10T14:35:41.046645 #504881] INFO -- : mutex_m 0.2.0 I, [2024-05-10T14:35:41.050585 #504881] INFO -- : getoptlong 0.2.1 I, [2024-05-10T14:35:41.055009 #504881] INFO -- : base64 0.2.0 I, [2024-05-10T14:35:41.057875 #504881] INFO -- : bigdecimal 3.1.8 I, [2024-05-10T14:35:41.063591 #504881] INFO -- : observer 0.1.2 I, [2024-05-10T14:35:41.066554 #504881] INFO -- : abbrev 0.1.2 I, [2024-05-10T14:35:41.069491 #504881] INFO -- : resolv-replace 0.1.1 I, [2024-05-10T14:35:41.072437 #504881] INFO -- : rinda 0.2.0 I, [2024-05-10T14:35:41.075827 #504881] INFO -- : drb 2.2.1 I, [2024-05-10T14:35:41.080260 #504881] INFO -- : nkf 0.2.0 I, [2024-05-10T14:35:41.087872 #504881] INFO -- : syslog 0.1.2 I, [2024-05-10T14:35:41.092296 #504881] INFO -- : csv 3.3.0 I, [2024-05-10T14:35:41.101359 #504881] INFO -- : installing bundled gem cache: /home/opc/ruby/install/master/lib/ruby/gems/3.4.0+0/cache I, [2024-05-10T14:35:41.103267 #504881] INFO -- : skipped bundled gems: I, [2024-05-10T14:35:41.103287 #504881] INFO -- : power_assert-2.0.4dev.gem not found in bundled_gems I, [2024-05-10T14:35:41.106633 #504881] INFO -- : $$$[end] "make install -j3" exit with 0. I, [2024-05-10T14:35:41.106782 #504881] INFO -- : $$$[beg] make yes-btest TESTOPTS='-q -j3' I, [2024-05-10T14:36:06.165237 #504881] INFO -- : PASS all 1936 tests E, [2024-05-10T14:36:06.167097 #504881] ERROR -- : I, [2024-05-10T14:36:06.167223 #504881] INFO -- : $$$[end] "make yes-btest TESTOPTS='-q -j3'" exit with 0. I, [2024-05-10T14:36:06.167355 #504881] INFO -- : $$$[beg] make yes-test-basic TESTS='-j3' I, [2024-05-10T14:36:06.259121 #504881] INFO -- : BASERUBY = /usr/local/bin/ruby --disable=gems I, [2024-05-10T14:36:06.259201 #504881] INFO -- : CC = gcc I, [2024-05-10T14:36:06.259213 #504881] INFO -- : LD = ld I, [2024-05-10T14:36:06.260767 #504881] INFO -- : LDSHARED = gcc -shared I, [2024-05-10T14:36:06.260829 #504881] INFO -- : CFLAGS = -O3 -fno-fast-math -ggdb3 -Wall -Wextra -Wdeprecated-declarations -Wdiv-by-zero -Wduplicated-cond -Wimplicit-function-declaration -Wimplicit-int -Wpointer-arith -Wwrite-strings -Wold-style-definition -Wimplicit-fallthrough=0 -Wmissing-noreturn -Wno-cast-function-type -Wno-constant-logical-operand -Wno-long-long -Wno-missing-field-initializers -Wno-overlength-strings -Wno-packed-bitfield-compat -Wno-parentheses-equality -Wno-self-assign -Wno-tautological-compare -Wno-unused-parameter -Wno-unused-value -Wsuggest-attribute=format -Wsuggest-attribute=noreturn -Wunused-variable -Wmisleading-indentation -Wundef I, [2024-05-10T14:36:06.260856 #504881] INFO -- : XCFLAGS = -U_FORTIFY_SOURCE -D_FORTIFY_SOURCE=2 -fstack-protector-strong -msign-return-address=all -fno-strict-overflow -fvisibility=hidden -fexcess-precision=standard -DRUBY_EXPORT -fPIE -I. -I.ext/include/aarch64-linux -I/home/opc/ruby/src/master/include -I/home/opc/ruby/src/master -I/home/opc/ruby/src/master/prism -I/home/opc/ruby/src/master/enc/unicode/15.0.0 I, [2024-05-10T14:36:06.260865 #504881] INFO -- : CPPFLAGS = I, [2024-05-10T14:36:06.260873 #504881] INFO -- : DLDFLAGS = -Wl,--compress-debug-sections=zlib -fstack-protector-strong -pie I, [2024-05-10T14:36:06.260882 #504881] INFO -- : SOLIBS = -lz -lrt -lrt -ldl -lcrypt -lm -lpthread I, [2024-05-10T14:36:06.260889 #504881] INFO -- : LANG = en_US.UTF-8 I, [2024-05-10T14:36:06.260897 #504881] INFO -- : LC_ALL = I, [2024-05-10T14:36:06.260904 #504881] INFO -- : LC_CTYPE = I, [2024-05-10T14:36:06.260912 #504881] INFO -- : MFLAGS = I, [2024-05-10T14:36:06.260919 #504881] INFO -- : RUSTC = rustc I, [2024-05-10T14:36:06.260927 #504881] INFO -- : YJIT_RUSTC_ARGS = --crate-name=yjit --crate-type=staticlib --edition=2021 -g -C lto=thin -C opt-level=3 -C overflow-checks=on '--out-dir=/home/opc/ruby/build/master/yjit/target/release/' /home/opc/ruby/src/master/yjit/src/lib.rs I, [2024-05-10T14:36:06.260935 #504881] INFO -- : gcc (GCC) 8.5.0 20210514 (Red Hat 8.5.0-10.1.0.1) I, [2024-05-10T14:36:06.260943 #504881] INFO -- : Copyright (C) 2018 Free Software Foundation, Inc. I, [2024-05-10T14:36:06.260950 #504881] INFO -- : This is free software; see the source for copying conditions. There is NO I, [2024-05-10T14:36:06.260958 #504881] INFO -- : warranty; not even for MERCHANTABILITY or FITNESS FOR A PARTICULAR PURPOSE. I, [2024-05-10T14:36:06.260966 #504881] INFO -- : I, [2024-05-10T14:36:06.415318 #504881] INFO -- : Checking leaked global symbols...none I, [2024-05-10T14:36:06.470491 #504881] INFO -- : /home/opc/ruby/src/master/basictest/test.rb:assignment ....................................................................................................................................................................................................................................................................................................................................................................................OK 372 I, [2024-05-10T14:36:06.470565 #504881] INFO -- : /home/opc/ruby/src/master/basictest/test.rb:condition ..OK 2 I, [2024-05-10T14:36:06.470591 #504881] INFO -- : /home/opc/ruby/src/master/basictest/test.rb:if/unless ...OK 3 I, [2024-05-10T14:36:06.470645 #504881] INFO -- : /home/opc/ruby/src/master/basictest/test.rb:case .....OK 5 I, [2024-05-10T14:36:06.471214 #504881] INFO -- : /home/opc/ruby/src/master/basictest/test.rb:while/until ........OK 8 I, [2024-05-10T14:36:06.471340 #504881] INFO -- : /home/opc/ruby/src/master/basictest/test.rb:exception ..........OK 10 I, [2024-05-10T14:36:06.471972 #504881] INFO -- : /home/opc/ruby/src/master/basictest/test.rb:array .......................................OK 39 I, [2024-05-10T14:36:06.472243 #504881] INFO -- : /home/opc/ruby/src/master/basictest/test.rb:hash ...........................OK 27 I, [2024-05-10T14:36:06.474021 #504881] INFO -- : /home/opc/ruby/src/master/basictest/test.rb:iterator ...........................................................................................................OK 107 I, [2024-05-10T14:36:06.474791 #504881] INFO -- : /home/opc/ruby/src/master/basictest/test.rb:float ................................................................................OK 80 I, [2024-05-10T14:36:06.483201 #504881] INFO -- : /home/opc/ruby/src/master/basictest/test.rb:bignum ...............................OK 31 I, [2024-05-10T14:36:06.486663 #504881] INFO -- : /home/opc/ruby/src/master/basictest/test.rb:string & char ..............................................................OK 62 I, [2024-05-10T14:36:06.486752 #504881] INFO -- : /home/opc/ruby/src/master/basictest/test.rb:assignment ..........OK 10 I, [2024-05-10T14:36:06.487159 #504881] INFO -- : /home/opc/ruby/src/master/basictest/test.rb:call ......OK 6 I, [2024-05-10T14:36:06.487293 #504881] INFO -- : /home/opc/ruby/src/master/basictest/test.rb:proc .........OK 9 I, [2024-05-10T14:36:06.587629 #504881] INFO -- : /home/opc/ruby/src/master/basictest/test.rb:signal ..OK 2 I, [2024-05-10T14:36:06.589296 #504881] INFO -- : /home/opc/ruby/src/master/basictest/test.rb:eval ...........................OK 27 I, [2024-05-10T14:36:06.718191 #504881] INFO -- : /home/opc/ruby/src/master/basictest/test.rb:system ........OK 8 I, [2024-05-10T14:36:06.718266 #504881] INFO -- : /home/opc/ruby/src/master/basictest/test.rb:const .....OK 5 I, [2024-05-10T14:36:06.718355 #504881] INFO -- : /home/opc/ruby/src/master/basictest/test.rb:clone .....OK 5 I, [2024-05-10T14:36:06.718527 #504881] INFO -- : /home/opc/ruby/src/master/basictest/test.rb:marshal ....OK 4 I, [2024-05-10T14:36:06.718606 #504881] INFO -- : /home/opc/ruby/src/master/basictest/test.rb:pack ....OK 4 I, [2024-05-10T14:36:06.718637 #504881] INFO -- : /home/opc/ruby/src/master/basictest/test.rb:math ..OK 2 I, [2024-05-10T14:36:06.718727 #504881] INFO -- : /home/opc/ruby/src/master/basictest/test.rb:struct ......OK 6 I, [2024-05-10T14:36:06.718899 #504881] INFO -- : /home/opc/ruby/src/master/basictest/test.rb:variable ............OK 12 I, [2024-05-10T14:36:06.718941 #504881] INFO -- : /home/opc/ruby/src/master/basictest/test.rb:trace ...OK 3 I, [2024-05-10T14:36:06.719067 #504881] INFO -- : /home/opc/ruby/src/master/basictest/test.rb:defined? ............OK 12 I, [2024-05-10T14:36:06.719156 #504881] INFO -- : /home/opc/ruby/src/master/basictest/test.rb:alias ......OK 6 I, [2024-05-10T14:36:06.719678 #504881] INFO -- : /home/opc/ruby/src/master/basictest/test.rb:path .......................OK 23 I, [2024-05-10T14:36:06.786647 #504881] INFO -- : /home/opc/ruby/src/master/basictest/test.rb:gc ....OK 4 I, [2024-05-10T14:36:06.788571 #504881] INFO -- : I, [2024-05-10T14:36:06.788611 #504881] INFO -- : test succeeded I, [2024-05-10T14:36:06.789311 #504881] INFO -- : $$$[end] "make yes-test-basic TESTS='-j3'" exit with 0. I, [2024-05-10T14:36:06.789492 #504881] INFO -- : $$$[beg] make yes-test-all TESTOPTS='--stderr-on-failure' TESTS='-j3' I, [2024-05-10T14:36:06.912751 #504881] INFO -- : BASERUBY = /usr/local/bin/ruby --disable=gems I, [2024-05-10T14:36:06.912828 #504881] INFO -- : CC = gcc I, [2024-05-10T14:36:06.912839 #504881] INFO -- : LD = ld I, [2024-05-10T14:36:06.912848 #504881] INFO -- : LDSHARED = gcc -shared I, [2024-05-10T14:36:06.912859 #504881] INFO -- : CFLAGS = -O3 -fno-fast-math -ggdb3 -Wall -Wextra -Wdeprecated-declarations -Wdiv-by-zero -Wduplicated-cond -Wimplicit-function-declaration -Wimplicit-int -Wpointer-arith -Wwrite-strings -Wold-style-definition -Wimplicit-fallthrough=0 -Wmissing-noreturn -Wno-cast-function-type -Wno-constant-logical-operand -Wno-long-long -Wno-missing-field-initializers -Wno-overlength-strings -Wno-packed-bitfield-compat -Wno-parentheses-equality -Wno-self-assign -Wno-tautological-compare -Wno-unused-parameter -Wno-unused-value -Wsuggest-attribute=format -Wsuggest-attribute=noreturn -Wunused-variable -Wmisleading-indentation -Wundef I, [2024-05-10T14:36:06.912869 #504881] INFO -- : XCFLAGS = -U_FORTIFY_SOURCE -D_FORTIFY_SOURCE=2 -fstack-protector-strong -msign-return-address=all -fno-strict-overflow -fvisibility=hidden -fexcess-precision=standard -DRUBY_EXPORT -fPIE -I. -I.ext/include/aarch64-linux -I/home/opc/ruby/src/master/include -I/home/opc/ruby/src/master -I/home/opc/ruby/src/master/prism -I/home/opc/ruby/src/master/enc/unicode/15.0.0 I, [2024-05-10T14:36:06.912878 #504881] INFO -- : CPPFLAGS = I, [2024-05-10T14:36:06.912886 #504881] INFO -- : DLDFLAGS = -Wl,--compress-debug-sections=zlib -fstack-protector-strong -pie I, [2024-05-10T14:36:06.912895 #504881] INFO -- : SOLIBS = -lz -lrt -lrt -ldl -lcrypt -lm -lpthread I, [2024-05-10T14:36:06.912904 #504881] INFO -- : LANG = en_US.UTF-8 I, [2024-05-10T14:36:06.912912 #504881] INFO -- : LC_ALL = I, [2024-05-10T14:36:06.912920 #504881] INFO -- : LC_CTYPE = I, [2024-05-10T14:36:06.912928 #504881] INFO -- : MFLAGS = I, [2024-05-10T14:36:06.912936 #504881] INFO -- : RUSTC = rustc I, [2024-05-10T14:36:06.912945 #504881] INFO -- : YJIT_RUSTC_ARGS = --crate-name=yjit --crate-type=staticlib --edition=2021 -g -C lto=thin -C opt-level=3 -C overflow-checks=on '--out-dir=/home/opc/ruby/build/master/yjit/target/release/' /home/opc/ruby/src/master/yjit/src/lib.rs I, [2024-05-10T14:36:06.913631 #504881] INFO -- : gcc (GCC) 8.5.0 20210514 (Red Hat 8.5.0-10.1.0.1) I, [2024-05-10T14:36:06.913648 #504881] INFO -- : Copyright (C) 2018 Free Software Foundation, Inc. I, [2024-05-10T14:36:06.913658 #504881] INFO -- : This is free software; see the source for copying conditions. There is NO I, [2024-05-10T14:36:06.913666 #504881] INFO -- : warranty; not even for MERCHANTABILITY or FITNESS FOR A PARTICULAR PURPOSE. I, [2024-05-10T14:36:06.913674 #504881] INFO -- : I, [2024-05-10T14:36:06.915722 #504881] INFO -- : generating enc.mk I, [2024-05-10T14:36:07.152855 #504881] INFO -- : generating encdb.h I, [2024-05-10T14:36:07.189350 #504881] INFO -- : encdb.h unchanged I, [2024-05-10T14:36:07.190612 #504881] INFO -- : making enc I, [2024-05-10T14:36:07.217780 #504881] INFO -- : make[1]: Entering directory '/home/opc/ruby/build/master' I, [2024-05-10T14:36:07.217823 #504881] INFO -- : make[1]: Nothing to be done for 'enc'. I, [2024-05-10T14:36:07.217834 #504881] INFO -- : make[1]: Leaving directory '/home/opc/ruby/build/master' I, [2024-05-10T14:36:07.218602 #504881] INFO -- : making srcs under enc I, [2024-05-10T14:36:07.260290 #504881] INFO -- : make[1]: Entering directory '/home/opc/ruby/build/master' I, [2024-05-10T14:36:07.260351 #504881] INFO -- : make[1]: Nothing to be done for 'srcs'. I, [2024-05-10T14:36:07.260370 #504881] INFO -- : make[1]: Leaving directory '/home/opc/ruby/build/master' I, [2024-05-10T14:36:07.261495 #504881] INFO -- : generating transdb.h I, [2024-05-10T14:36:07.415152 #504881] INFO -- : transdb.h unchanged I, [2024-05-10T14:36:07.416419 #504881] INFO -- : making trans I, [2024-05-10T14:36:07.464641 #504881] INFO -- : make[1]: Entering directory '/home/opc/ruby/build/master' I, [2024-05-10T14:36:07.464719 #504881] INFO -- : make[1]: Nothing to be done for 'trans'. I, [2024-05-10T14:36:07.464739 #504881] INFO -- : make[1]: Leaving directory '/home/opc/ruby/build/master' I, [2024-05-10T14:36:07.465499 #504881] INFO -- : making encs I, [2024-05-10T14:36:07.517849 #504881] INFO -- : make[1]: Entering directory '/home/opc/ruby/build/master' I, [2024-05-10T14:36:07.517921 #504881] INFO -- : make[1]: Nothing to be done for 'encs'. I, [2024-05-10T14:36:07.517931 #504881] INFO -- : make[1]: Leaving directory '/home/opc/ruby/build/master' I, [2024-05-10T14:36:07.519862 #504881] INFO -- : generating makefiles ext/configure-ext.mk I, [2024-05-10T14:36:07.559419 #504881] INFO -- : ext/configure-ext.mk updated I, [2024-05-10T14:36:07.562462 #504881] INFO -- : make[1]: Entering directory '/home/opc/ruby/build/master' I, [2024-05-10T14:36:09.607220 #504881] INFO -- : make[1]: Leaving directory '/home/opc/ruby/build/master' I, [2024-05-10T14:36:09.607913 #504881] INFO -- : generating makefile exts.mk I, [2024-05-10T14:36:09.667089 #504881] INFO -- : exts.mk unchanged I, [2024-05-10T14:36:09.671960 #504881] INFO -- : make[1]: Entering directory '/home/opc/ruby/build/master' I, [2024-05-10T14:36:09.970062 #504881] INFO -- : make[2]: Entering directory '/home/opc/ruby/build/master/ext/coverage' I, [2024-05-10T14:36:09.974696 #504881] INFO -- : make[2]: Leaving directory '/home/opc/ruby/build/master/ext/coverage' I, [2024-05-10T14:36:09.980275 #504881] INFO -- : make[2]: Entering directory '/home/opc/ruby/build/master/ext/date' I, [2024-05-10T14:36:09.985520 #504881] INFO -- : make[2]: Leaving directory '/home/opc/ruby/build/master/ext/date' I, [2024-05-10T14:36:09.988778 #504881] INFO -- : make[2]: Entering directory '/home/opc/ruby/build/master/ext/digest' I, [2024-05-10T14:36:09.997424 #504881] INFO -- : make[2]: Leaving directory '/home/opc/ruby/build/master/ext/digest' I, [2024-05-10T14:36:10.019912 #504881] INFO -- : make[2]: Entering directory '/home/opc/ruby/build/master/ext/digest/sha2' I, [2024-05-10T14:36:10.024815 #504881] INFO -- : make[2]: Leaving directory '/home/opc/ruby/build/master/ext/digest/sha2' I, [2024-05-10T14:36:10.042837 #504881] INFO -- : make[2]: Entering directory '/home/opc/ruby/build/master/ext/fiddle' I, [2024-05-10T14:36:10.052861 #504881] INFO -- : make[2]: Leaving directory '/home/opc/ruby/build/master/ext/fiddle' I, [2024-05-10T14:36:10.057108 #504881] INFO -- : make[2]: Entering directory '/home/opc/ruby/build/master/ext/io/console' I, [2024-05-10T14:36:10.061416 #504881] INFO -- : make[2]: Leaving directory '/home/opc/ruby/build/master/ext/io/console' I, [2024-05-10T14:36:10.072075 #504881] INFO -- : make[2]: Entering directory '/home/opc/ruby/build/master/ext/json' I, [2024-05-10T14:36:10.081475 #504881] INFO -- : make[2]: Leaving directory '/home/opc/ruby/build/master/ext/json' I, [2024-05-10T14:36:10.094370 #504881] INFO -- : make[2]: Entering directory '/home/opc/ruby/build/master/ext/monitor' I, [2024-05-10T14:36:10.098547 #504881] INFO -- : make[2]: Leaving directory '/home/opc/ruby/build/master/ext/monitor' I, [2024-05-10T14:36:10.104589 #504881] INFO -- : make[2]: Entering directory '/home/opc/ruby/build/master/ext/objspace' I, [2024-05-10T14:36:10.110509 #504881] INFO -- : make[2]: Leaving directory '/home/opc/ruby/build/master/ext/objspace' I, [2024-05-10T14:36:10.129315 #504881] INFO -- : make[2]: Entering directory '/home/opc/ruby/build/master/ext/openssl' I, [2024-05-10T14:36:10.150903 #504881] INFO -- : make[2]: Leaving directory '/home/opc/ruby/build/master/ext/openssl' I, [2024-05-10T14:36:10.155034 #504881] INFO -- : make[2]: Entering directory '/home/opc/ruby/build/master/ext/pathname' I, [2024-05-10T14:36:10.159247 #504881] INFO -- : make[2]: Leaving directory '/home/opc/ruby/build/master/ext/pathname' I, [2024-05-10T14:36:10.165562 #504881] INFO -- : make[2]: Entering directory '/home/opc/ruby/build/master/ext/psych' I, [2024-05-10T14:36:10.187157 #504881] INFO -- : make[2]: Leaving directory '/home/opc/ruby/build/master/ext/psych' I, [2024-05-10T14:36:10.191625 #504881] INFO -- : make[2]: Entering directory '/home/opc/ruby/build/master/ext/pty' I, [2024-05-10T14:36:10.195767 #504881] INFO -- : make[2]: Leaving directory '/home/opc/ruby/build/master/ext/pty' I, [2024-05-10T14:36:10.209056 #504881] INFO -- : make[2]: Entering directory '/home/opc/ruby/build/master/ext/ripper' I, [2024-05-10T14:36:10.216839 #504881] INFO -- : make[2]: Leaving directory '/home/opc/ruby/build/master/ext/ripper' I, [2024-05-10T14:36:10.219221 #504881] INFO -- : make[2]: Entering directory '/home/opc/ruby/build/master/ext/rubyvm' I, [2024-05-10T14:36:10.222873 #504881] INFO -- : make[2]: Leaving directory '/home/opc/ruby/build/master/ext/rubyvm' I, [2024-05-10T14:36:10.234890 #504881] INFO -- : make[2]: Entering directory '/home/opc/ruby/build/master/ext/socket' I, [2024-05-10T14:36:10.245513 #504881] INFO -- : make[2]: Leaving directory '/home/opc/ruby/build/master/ext/socket' I, [2024-05-10T14:36:10.260985 #504881] INFO -- : make[2]: Entering directory '/home/opc/ruby/build/master/.bundle/gems/bigdecimal-3.1.7/ext/bigdecimal' I, [2024-05-10T14:36:10.291305 #504881] INFO -- : make[2]: Leaving directory '/home/opc/ruby/build/master/.bundle/gems/bigdecimal-3.1.7/ext/bigdecimal' I, [2024-05-10T14:36:10.294006 #504881] INFO -- : make[2]: Entering directory '/home/opc/ruby/build/master/.bundle/gems/bigdecimal-3.1.8/ext/bigdecimal' I, [2024-05-10T14:36:10.324124 #504881] INFO -- : make[2]: Leaving directory '/home/opc/ruby/build/master/.bundle/gems/bigdecimal-3.1.8/ext/bigdecimal' I, [2024-05-10T14:36:10.326775 #504881] INFO -- : make[2]: Entering directory '/home/opc/ruby/build/master/.bundle/gems/debug-1.9.2/ext/debug' I, [2024-05-10T14:36:10.357223 #504881] INFO -- : make[2]: Leaving directory '/home/opc/ruby/build/master/.bundle/gems/debug-1.9.2/ext/debug' I, [2024-05-10T14:36:10.359862 #504881] INFO -- : make[2]: Entering directory '/home/opc/ruby/build/master/.bundle/gems/nkf-0.2.0/ext/nkf' I, [2024-05-10T14:36:10.389960 #504881] INFO -- : make[2]: Leaving directory '/home/opc/ruby/build/master/.bundle/gems/nkf-0.2.0/ext/nkf' I, [2024-05-10T14:36:10.392453 #504881] INFO -- : make[2]: Entering directory '/home/opc/ruby/build/master/.bundle/gems/racc-1.7.3/ext/racc/cparse' I, [2024-05-10T14:36:10.423016 #504881] INFO -- : make[2]: Leaving directory '/home/opc/ruby/build/master/.bundle/gems/racc-1.7.3/ext/racc/cparse' I, [2024-05-10T14:36:10.426064 #504881] INFO -- : make[2]: Entering directory '/home/opc/ruby/build/master/.bundle/gems/rbs-3.4.4/ext/rbs_extension' I, [2024-05-10T14:36:10.456519 #504881] INFO -- : make[2]: Leaving directory '/home/opc/ruby/build/master/.bundle/gems/rbs-3.4.4/ext/rbs_extension' I, [2024-05-10T14:36:10.459025 #504881] INFO -- : make[2]: Entering directory '/home/opc/ruby/build/master/.bundle/gems/syslog-0.1.2/ext/syslog' I, [2024-05-10T14:36:10.489306 #504881] INFO -- : make[2]: Leaving directory '/home/opc/ruby/build/master/.bundle/gems/syslog-0.1.2/ext/syslog' I, [2024-05-10T14:36:10.527407 #504881] INFO -- : make[2]: Entering directory '/home/opc/ruby/build/master' I, [2024-05-10T14:36:10.609808 #504881] INFO -- : make[2]: 'ruby' is up to date. I, [2024-05-10T14:36:10.609886 #504881] INFO -- : make[2]: Leaving directory '/home/opc/ruby/build/master' I, [2024-05-10T14:36:10.610038 #504881] INFO -- : make[1]: Leaving directory '/home/opc/ruby/build/master' I, [2024-05-10T14:36:10.614499 #504881] INFO -- : make[1]: Entering directory '/home/opc/ruby/build/master' I, [2024-05-10T14:36:10.614536 #504881] INFO -- : make[1]: Nothing to be done for 'note'. I, [2024-05-10T14:36:10.614547 #504881] INFO -- : make[1]: Leaving directory '/home/opc/ruby/build/master' I, [2024-05-10T14:36:10.726003 #504881] INFO -- : Run options: I, [2024-05-10T14:36:10.726085 #504881] INFO -- : --seed=36098 I, [2024-05-10T14:36:10.726095 #504881] INFO -- : "--ruby=./miniruby -I/home/opc/ruby/src/master/lib -I. -I.ext/common /home/opc/ruby/src/master/tool/runruby.rb --extout=.ext -- --disable-gems" I, [2024-05-10T14:36:10.726105 #504881] INFO -- : --excludes-dir=/home/opc/ruby/src/master/test/.excludes I, [2024-05-10T14:36:10.726113 #504881] INFO -- : --name=!/memory_leak/ I, [2024-05-10T14:36:10.726122 #504881] INFO -- : --stderr-on-failure I, [2024-05-10T14:36:10.726130 #504881] INFO -- : -j3 I, [2024-05-10T14:36:10.726138 #504881] INFO -- : I, [2024-05-10T14:36:10.726147 #504881] INFO -- : # Running tests: I, [2024-05-10T14:36:10.726155 #504881] INFO -- : I, [2024-05-10T14:36:10.858273 #504881] INFO -- : [ 1/885] 545762=json_fixtures_test I, [2024-05-10T14:36:10.861878 #504881] INFO -- : [ 2/885] 545764=test_gem_doctor I, [2024-05-10T14:36:10.865059 #504881] INFO -- : [ 3/885] 545763=test_len I, [2024-05-10T14:36:10.872736 #504881] INFO -- : [ 4/885] 545763=test_io_wait I, [2024-05-10T14:36:10.876580 #504881] INFO -- : [ 5/885] 545762=test_pack I, [2024-05-10T14:36:11.068546 #504881] INFO -- : [ 6/885] 545764=test_rdoc_parser_c I, [2024-05-10T14:36:11.072339 #504881] INFO -- : [ 7/885] 545762=test_kwargs I, [2024-05-10T14:36:11.078574 #504881] INFO -- : [ 8/885] 545762=parse_test I, [2024-05-10T14:36:11.208422 #504881] INFO -- : [ 9/885] 545763=test_gem_commands_fetch_command I, [2024-05-10T14:36:11.404273 #504881] INFO -- : [ 10/885] 545764=test_typeddata I, [2024-05-10T14:36:11.599272 #504881] INFO -- : [ 11/885] 545763=test_tsort I, [2024-05-10T14:36:11.610715 #504881] INFO -- : [ 12/885] 545763=test_securerandom I, [2024-05-10T14:36:11.642913 #504881] INFO -- : [ 13/885] 545763=test_gem_dependency_list I, [2024-05-10T14:36:11.654325 #504881] INFO -- : [ 14/885] 545764=test_gem_commands_outdated_command I, [2024-05-10T14:36:11.723485 #504881] INFO -- : [ 15/885] 545763=parameters_signature_test I, [2024-05-10T14:36:11.744252 #504881] INFO -- : [ 16/885] 545764=test_rdoc_parser_changelog I, [2024-05-10T14:36:11.813330 #504881] INFO -- : [ 17/885] 545763=redundant_return_test I, [2024-05-10T14:36:11.818761 #504881] INFO -- : [ 18/885] 545764=test_random_formatter I, [2024-05-10T14:36:11.827443 #504881] INFO -- : [ 19/885] 545763=test_string_processing I, [2024-05-10T14:36:11.854249 #504881] INFO -- : [ 20/885] 545764=test_rand I, [2024-05-10T14:36:11.883859 #504881] INFO -- : [ 21/885] 545763=test_rdoc_markup_attributes I, [2024-05-10T14:36:12.039381 #504881] INFO -- : [ 22/885] 545763=test_rdoc_code_object I, [2024-05-10T14:36:12.076594 #504881] INFO -- : [ 23/885] 545764=test_process I, [2024-05-10T14:36:12.376577 #504881] INFO -- : [ 24/885] 545763=test_bmethod I, [2024-05-10T14:36:12.388545 #504881] INFO -- : [ 25/885] 545763=test_euc_kr I, [2024-05-10T14:36:12.399174 #504881] INFO -- : [ 26/885] 545763=test_provider I, [2024-05-10T14:36:12.400681 #504881] INFO -- : [ 27/885] 545763=test_gem_source_specific_file I, [2024-05-10T14:36:12.499478 #504881] INFO -- : [ 28/885] 545763=test_win32ole_variant_outarg I, [2024-05-10T14:36:12.503772 #504881] INFO -- : [ 29/885] 545763=test_rdoc_encoding I, [2024-05-10T14:36:12.532526 #504881] INFO -- : [ 30/885] 545763=test_postponed_job I, [2024-05-10T14:36:12.911287 #504881] INFO -- : [ 31/885] 545763=test_key_actor_vi I, [2024-05-10T14:36:13.025508 #504881] INFO -- : [ 32/885] 545763=test_rdoc_markdown I, [2024-05-10T14:36:13.241071 #504881] INFO -- : [ 33/885] 545763=test_gem_request_set_lockfile I, [2024-05-10T14:36:13.290383 #504881] INFO -- : Leaked file descriptor: TestProcess#test_execopts_uid: 7 # I, [2024-05-10T14:36:13.318076 #504881] INFO -- : COMMAND PID USER FD TYPE DEVICE SIZE/OFF NODE NAME I, [2024-05-10T14:36:13.318144 #504881] INFO -- : ruby 545764 opc 7r REG 252,0 9253600 13705411 /var/lib/sss/mc/passwd I, [2024-05-10T14:36:13.810835 #504881] INFO -- : [ 34/885] 545762=test_httpresponses I, [2024-05-10T14:36:13.826819 #504881] INFO -- : [ 35/885] 545763=test_deprecate I, [2024-05-10T14:36:13.860309 #504881] INFO -- : [ 36/885] 545762=test_rdoc_constant I, [2024-05-10T14:36:13.889552 #504881] INFO -- : [ 37/885] 545763=test_generic I, [2024-05-10T14:36:13.912989 #504881] INFO -- : [ 38/885] 545763=test_common I, [2024-05-10T14:36:14.097304 #504881] INFO -- : [ 39/885] 545763=test_rdoc_markup_to_html_snippet I, [2024-05-10T14:36:14.114858 #504881] INFO -- : [ 40/885] 545762=test_stringify_symbols I, [2024-05-10T14:36:14.131280 #504881] INFO -- : [ 41/885] 545762=test_require I, [2024-05-10T14:36:14.140881 #504881] INFO -- : [ 42/885] 545762=test_objspace I, [2024-05-10T14:36:14.179122 #504881] INFO -- : [ 43/885] 545763=test_rdoc_text I, [2024-05-10T14:36:14.232645 #504881] INFO -- : [ 44/885] 545763=library_symbols_test I, [2024-05-10T14:36:14.244778 #504881] INFO -- : [ 45/885] 545763=test_rdoc_markup_parser I, [2024-05-10T14:36:14.320941 #504881] INFO -- : [ 46/885] 545763=test_iseq_load I, [2024-05-10T14:36:15.456630 #504881] INFO -- : Leaked file descriptor: TestProcess#test_uid_from_name: 8 # I, [2024-05-10T14:36:15.481296 #504881] INFO -- : COMMAND PID USER FD TYPE DEVICE SIZE/OFF NODE NAME I, [2024-05-10T14:36:15.481372 #504881] INFO -- : ruby 545764 opc 8u unix 0x0000000000000000 0t0 2921394982 type=STREAM I, [2024-05-10T14:36:15.491528 #504881] INFO -- : [ 47/885] 545763=test_rdoc_markup_indented_paragraph I, [2024-05-10T14:36:15.717870 #504881] INFO -- : [ 48/885] 545763=test_have_library I, [2024-05-10T14:36:16.488245 #504881] INFO -- : [ 49/885] 545763=test_stream I, [2024-05-10T14:36:16.493926 #504881] INFO -- : [ 50/885] 545763=test_ns_spki I, [2024-05-10T14:36:16.498824 #504881] INFO -- : [ 51/885] 545763=test_deprecated I, [2024-05-10T14:36:16.508153 #504881] INFO -- : [ 52/885] 545763=test_io_buffer I, [2024-05-10T14:36:16.618659 #504881] INFO -- : [ 53/885] 545763=test_rdoc_context_section I, [2024-05-10T14:36:16.693695 #504881] INFO -- : [ 54/885] 545763=test_optparse I, [2024-05-10T14:36:16.712915 #504881] INFO -- : [ 55/885] 545763=test_exception I, [2024-05-10T14:36:18.881000 #504881] INFO -- : [ 56/885] 545763=test_bash_completion I, [2024-05-10T14:36:18.918184 #504881] INFO -- : [ 57/885] 545763=test_rdoc_markup_to_html_crossref I, [2024-05-10T14:36:19.185415 #504881] INFO -- : [ 58/885] 545763=test_div I, [2024-05-10T14:36:19.188195 #504881] INFO -- : [ 59/885] 545763=test_files_test_2 I, [2024-05-10T14:36:21.743091 #504881] INFO -- : Leaked file descriptor: TestProcess#test_gid_from_name: 9 # I, [2024-05-10T14:36:21.768767 #504881] INFO -- : COMMAND PID USER FD TYPE DEVICE SIZE/OFF NODE NAME I, [2024-05-10T14:36:21.768838 #504881] INFO -- : ruby 545764 opc 9r REG 252,0 6940392 13705429 /var/lib/sss/mc/group I, [2024-05-10T14:36:22.167390 #504881] INFO -- : [ 60/885] 545763=test_class_name_check I, [2024-05-10T14:36:22.185912 #504881] INFO -- : [ 61/885] 545763=test_scalar I, [2024-05-10T14:36:22.208829 #504881] INFO -- : [ 62/885] 545763=test_syntax I, [2024-05-10T14:36:26.238805 #504881] INFO -- : [ 63/885] 545762=test_zsh_completion I, [2024-05-10T14:36:26.245886 #504881] INFO -- : [ 64/885] 545762=test_basicsocket I, [2024-05-10T14:36:26.291774 #504881] INFO -- : [ 65/885] 545762=test_pkcs7 I, [2024-05-10T14:36:26.452405 #504881] INFO -- : [ 66/885] 545762=test_gem_commands_environment_command I, [2024-05-10T14:36:26.708758 #504881] INFO -- : [ 67/885] 545762=test_pack I, [2024-05-10T14:36:26.817109 #504881] INFO -- : [ 68/885] 545762=ruby_parser_test I, [2024-05-10T14:36:26.839993 #504881] INFO -- : [ 69/885] 545762=test_gem_commands_stale_command I, [2024-05-10T14:36:26.846897 #504881] INFO -- : [ 70/885] 545762=test_ws I, [2024-05-10T14:36:26.858629 #504881] INFO -- : [ 71/885] 545762=json_parser_test I, [2024-05-10T14:36:26.995659 #504881] INFO -- : [ 72/885] 545762=test_date_strftime I, [2024-05-10T14:36:27.351853 #504881] INFO -- : [ 73/885] 545762=test_rdoc_markup_to_tt_only I, [2024-05-10T14:36:27.400767 #504881] INFO -- : [ 74/885] 545762=test_gem_commands_cert_command I, [2024-05-10T14:36:28.079324 #504881] INFO -- : [ 75/885] 545763=test_numeric I, [2024-05-10T14:36:28.148207 #504881] INFO -- : [ 76/885] 545763=test_fstring I, [2024-05-10T14:36:28.202834 #504881] INFO -- : [ 77/885] 545763=test_singleton I, [2024-05-10T14:36:28.206071 #504881] INFO -- : [ 78/885] 545763=test_word I, [2024-05-10T14:36:28.242266 #504881] INFO -- : [ 79/885] 545763=test_gem_ext_rake_builder I, [2024-05-10T14:36:28.725254 #504881] INFO -- : [ 80/885] 545762=test_rdoc_require I, [2024-05-10T14:36:28.733626 #504881] INFO -- : [ 81/885] 545762=test_rdoc_markup_raw I, [2024-05-10T14:36:28.742965 #504881] INFO -- : [ 82/885] 545762=test_key_name_check I, [2024-05-10T14:36:28.752662 #504881] INFO -- : [ 83/885] 545762=test_rdoc_markup_to_bs I, [2024-05-10T14:36:28.836646 #504881] INFO -- : [ 84/885] 545762=test_timeout I, [2024-05-10T14:36:28.844075 #504881] INFO -- : [ 85/885] 545763=test_rdoc_alias I, [2024-05-10T14:36:28.932055 #504881] INFO -- : [ 86/885] 545763=test_weakref I, [2024-05-10T14:36:29.049146 #504881] INFO -- : [ 87/885] 545763=test_instrumentation_api I, [2024-05-10T14:36:29.764599 #504881] INFO -- : [ 88/885] 545762=test_ractor I, [2024-05-10T14:36:29.787911 #504881] INFO -- : [ 89/885] 545762=test_null I, [2024-05-10T14:36:29.798049 #504881] INFO -- : [ 90/885] 545762=test_memory_view I, [2024-05-10T14:36:29.824074 #504881] INFO -- : [ 91/885] 545762=test_data I, [2024-05-10T14:36:29.836629 #504881] INFO -- : [ 92/885] 545762=test_pkey_dh I, [2024-05-10T14:36:30.159984 #504881] INFO -- : [ 93/885] 545764=test_multi_irb_commands I, [2024-05-10T14:36:30.193055 #504881] INFO -- : [ 94/885] 545764=test_m17n_comb I, [2024-05-10T14:36:31.163773 #504881] INFO -- : [ 95/885] 545762=test_win32ole_typelib I, [2024-05-10T14:36:31.172572 #504881] INFO -- : [ 96/885] 545762=test_external_new I, [2024-05-10T14:36:31.182152 #504881] INFO -- : [ 97/885] 545762=test_pkey I, [2024-05-10T14:36:31.193186 #504881] INFO -- : [ 98/885] 545762=test_bigzero I, [2024-05-10T14:36:31.206217 #504881] INFO -- : [ 99/885] 545762=test_gem_commands_query_command I, [2024-05-10T14:36:31.851204 #504881] INFO -- : [100/885] 545762=test_gem_platform I, [2024-05-10T14:36:31.971057 #504881] INFO -- : [101/885] 545762=test_literal I, [2024-05-10T14:36:31.996397 #504881] INFO -- : [102/885] 545763=test_gem_unsatisfiable_dependency_error I, [2024-05-10T14:36:32.015627 #504881] INFO -- : [103/885] 545763=test_thread I, [2024-05-10T14:36:32.239947 #504881] INFO -- : [104/885] 545763=test_gem_util I, [2024-05-10T14:36:32.288129 #504881] INFO -- : [105/885] 545764=test_gem_security_signer I, [2024-05-10T14:36:32.386564 #504881] INFO -- : [106/885] 545764=test_complex2 I, [2024-05-10T14:36:32.392815 #504881] INFO -- : [107/885] 545764=test_config I, [2024-05-10T14:36:32.398132 #504881] INFO -- : [108/885] 545763=test_input_method I, [2024-05-10T14:36:32.464880 #504881] INFO -- : [109/885] 545764=test_io I, [2024-05-10T14:36:32.498049 #504881] INFO -- : [110/885] 545762=test_rdoc_i18n_text I, [2024-05-10T14:36:32.512984 #504881] INFO -- : [111/885] 545763=test_tree_builder I, [2024-05-10T14:36:32.517896 #504881] INFO -- : [112/885] 545763=test_protect I, [2024-05-10T14:36:32.518143 #504881] INFO -- : [113/885] 545762=test_gem_commands_update_command I, [2024-05-10T14:36:32.524142 #504881] INFO -- : [114/885] 545763=test_date I, [2024-05-10T14:36:32.530265 #504881] INFO -- : [115/885] 545763=test_big5 I, [2024-05-10T14:36:32.561568 #504881] INFO -- : [116/885] 545763=test_fnmatch I, [2024-05-10T14:36:32.611286 #504881] INFO -- : [117/885] 545763=test_pathname I, [2024-05-10T14:36:32.659703 #504881] INFO -- : [118/885] 545764=test_http_request I, [2024-05-10T14:36:32.719706 #504881] INFO -- : [119/885] 545764=test_tempfile I, [2024-05-10T14:36:32.802830 #504881] INFO -- : [120/885] 545763=test_coverage I, [2024-05-10T14:36:32.924699 #504881] INFO -- : [121/885] 545764=test_rdoc_markup_pre_process I, [2024-05-10T14:36:32.988203 #504881] INFO -- : [122/885] 545764=test_store I, [2024-05-10T14:36:33.284620 #504881] INFO -- : [123/885] 545764=test_rdoc_generator_pot_po_entry I, [2024-05-10T14:36:33.304074 #504881] INFO -- : [124/885] 545764=test_erb_m17n I, [2024-05-10T14:36:33.306611 #504881] INFO -- : [125/885] 545764=test_timeout I, [2024-05-10T14:36:33.327724 #504881] INFO -- : [126/885] 545764=test_date_conv I, [2024-05-10T14:36:33.341057 #504881] INFO -- : [127/885] 545764=test_webauthn_poller I, [2024-05-10T14:36:33.512986 #504881] INFO -- : [128/885] 545764=test_rdoc_markup_verbatim I, [2024-05-10T14:36:33.521895 #504881] INFO -- : [129/885] 545764=test_egrep_cpp I, [2024-05-10T14:36:33.594498 #504881] INFO -- : [130/885] 545763=test_gem_resolver_index_specification I, [2024-05-10T14:36:33.647390 #504881] INFO -- : [131/885] 545764=test_serialize_subclasses I, [2024-05-10T14:36:33.652736 #504881] INFO -- : [132/885] 545763=test_frozen I, [2024-05-10T14:36:33.656345 #504881] INFO -- : [133/885] 545764=test_files_lib I, [2024-05-10T14:36:33.664574 #504881] INFO -- : [134/885] 545763=test_help I, [2024-05-10T14:36:33.671092 #504881] INFO -- : [135/885] 545763=test_string_memory I, [2024-05-10T14:36:33.778676 #504881] INFO -- : [136/885] 545763=test_enumerator_kw I, [2024-05-10T14:36:33.785428 #504881] INFO -- : [137/885] 545763=reflection_test I, [2024-05-10T14:36:33.792225 #504881] INFO -- : [138/885] 545763=test_line_editor I, [2024-05-10T14:36:33.796424 #504881] INFO -- : [139/885] 545763=test_marshalable I, [2024-05-10T14:36:33.803104 #504881] INFO -- : [140/885] 545763=json_common_interface_test I, [2024-05-10T14:36:33.840649 #504881] INFO -- : [141/885] 545763=test_string I, [2024-05-10T14:36:33.858164 #504881] INFO -- : [142/885] 545763=test_function_entry I, [2024-05-10T14:36:33.870107 #504881] INFO -- : [143/885] 545763=test_rdoc_any_method I, [2024-05-10T14:36:34.123520 #504881] INFO -- : [144/885] 545762=test_error_highlight I, [2024-05-10T14:36:34.239861 #504881] INFO -- : [145/885] 545763=test_complexrational I, [2024-05-10T14:36:34.243494 #504881] INFO -- : [146/885] 545763=test_raise I, [2024-05-10T14:36:34.247590 #504881] INFO -- : [147/885] 545763=version_test I, [2024-05-10T14:36:34.253270 #504881] INFO -- : [148/885] 545763=test_wait I, [2024-05-10T14:36:34.308804 #504881] INFO -- : [149/885] 545763=test_human_typo I, [2024-05-10T14:36:34.313843 #504881] INFO -- : [150/885] 545763=test_import I, [2024-05-10T14:36:34.619927 #504881] INFO -- : [151/885] 545762=test_psych I, [2024-05-10T14:36:34.646595 #504881] INFO -- : [152/885] 545762=test_nil I, [2024-05-10T14:36:34.655219 #504881] INFO -- : [153/885] 545762=test_gem_commands_yank_command I, [2024-05-10T14:36:35.181849 #504881] INFO -- : [154/885] 545762=test_yaml_tree I, [2024-05-10T14:36:35.216531 #504881] INFO -- : [155/885] 545762=test_gem_resolver_dependency_request I, [2024-05-10T14:36:35.250946 #504881] INFO -- : [156/885] 545762=test_euc_tw I, [2024-05-10T14:36:35.254722 #504881] INFO -- : [157/885] 545762=test_command I, [2024-05-10T14:36:35.582442 #504881] INFO -- : [158/885] 545762=test_cstr I, [2024-05-10T14:36:35.660467 #504881] INFO -- : [159/885] 545763=test_gem_resolver_specification I, [2024-05-10T14:36:35.699939 #504881] INFO -- : [160/885] 545763=test_big2str I, [2024-05-10T14:36:35.713765 #504881] INFO -- : [161/885] 545763=test_logger I, [2024-05-10T14:36:35.730843 #504881] INFO -- : [162/885] 545763=test_pkey_dsa I, [2024-05-10T14:36:36.561838 #504881] INFO -- : [163/885] 545762=test_gem_config_file I, [2024-05-10T14:36:36.747074 #504881] INFO -- : [164/885] 545762=json_string_matching_test I, [2024-05-10T14:36:36.760060 #504881] INFO -- : [165/885] 545762=test_comparable I, [2024-05-10T14:36:36.763965 #504881] INFO -- : [166/885] 545762=test_yjit_exit_locations I, [2024-05-10T14:36:36.776123 #504881] INFO -- : [167/885] 545762=test_rdoc_rdoc I, [2024-05-10T14:36:36.813746 #504881] INFO -- : [168/885] 545764=test_rdoc_normal_module I, [2024-05-10T14:36:36.857476 #504881] INFO -- : [169/885] 545764=test_type_completor I, [2024-05-10T14:36:36.865730 #504881] INFO -- : [170/885] 545764=test_io_timeout I, [2024-05-10T14:36:36.866907 #504881] INFO -- : [171/885] 545764=test_rdoc_markdown_test I, [2024-05-10T14:36:36.889405 #504881] INFO -- : [172/885] 545762=test_io_buffer I, [2024-05-10T14:36:36.945990 #504881] INFO -- : [173/885] 545762=test_ldap I, [2024-05-10T14:36:36.958952 #504881] INFO -- : [174/885] 545762=test_kdf I, [2024-05-10T14:36:37.028768 #504881] INFO -- : [175/885] 545762=test_nowrite I, [2024-05-10T14:36:37.061097 #504881] INFO -- : [176/885] 545762=test_defined I, [2024-05-10T14:36:37.134653 #504881] INFO -- : [177/885] 545762=test_passing_block I, [2024-05-10T14:36:37.317590 #504881] INFO -- : [178/885] 545762=test_thread_queue I, [2024-05-10T14:36:37.828543 #504881] INFO -- : [179/885] 545764=test_path_to_class I, [2024-05-10T14:36:37.832273 #504881] INFO -- : [180/885] 545764=test_enumerator I, [2024-05-10T14:36:37.883267 #504881] INFO -- : [181/885] 545764=test_reqarg I, [2024-05-10T14:36:38.253486 #504881] INFO -- : [182/885] 545764=test_gem_ext_ext_conf_builder I, [2024-05-10T14:36:38.410435 #504881] INFO -- : [183/885] 545763=test_spell_checker I, [2024-05-10T14:36:38.422378 #504881] INFO -- : [184/885] 545763=test_gem_version I, [2024-05-10T14:36:38.514832 #504881] INFO -- : [185/885] 545763=test_frozen_error I, [2024-05-10T14:36:38.532760 #504881] INFO -- : [186/885] 545763=test_gem_package_tar_reader_entry I, [2024-05-10T14:36:38.746912 #504881] INFO -- : [187/885] 545763=test_resource I, [2024-05-10T14:36:38.758011 #504881] INFO -- : [188/885] 545763=test_gem_uri I, [2024-05-10T14:36:38.789608 #504881] INFO -- : [189/885] 545763=test_yield_block I, [2024-05-10T14:36:38.794151 #504881] INFO -- : [190/885] 545763=test_bug-5832 I, [2024-05-10T14:36:38.827486 #504881] INFO -- : [191/885] 545763=test_c_struct_builder I, [2024-05-10T14:36:38.962864 #504881] INFO -- : [192/885] 545763=test_pstore I, [2024-05-10T14:36:39.167189 #504881] INFO -- : [193/885] 545763=test_ubf_async_safe I, [2024-05-10T14:36:39.176739 #504881] INFO -- : [194/885] 545763=test_gem_version_option I, [2024-05-10T14:36:39.221468 #504881] INFO -- : [195/885] 545764=test_rdoc_include I, [2024-05-10T14:36:39.226866 #504881] INFO -- : [196/885] 545763=test_win32ole_record I, [2024-05-10T14:36:39.228743 #504881] INFO -- : [197/885] 545763=test_date_compat I, [2024-05-10T14:36:39.236695 #504881] INFO -- : [198/885] 545763=test_proc I, [2024-05-10T14:36:39.246852 #504881] INFO -- : [199/885] 545764=test_console_attr I, [2024-05-10T14:36:39.250209 #504881] INFO -- : [200/885] 545764=test_gem_ext_cargo_builder I, [2024-05-10T14:36:39.285040 #504881] INFO -- : [201/885] 545764=test_gem_commands_unpack_command I, [2024-05-10T14:36:39.609102 #504881] INFO -- : [202/885] 545764=test_rdoc_options I, [2024-05-10T14:36:39.858698 #504881] INFO -- : [203/885] 545764=test_zlib I, [2024-05-10T14:36:40.161400 #504881] INFO -- : [204/885] 545763=test_init I, [2024-05-10T14:36:40.468231 #504881] INFO -- : [205/885] 545763=test_gem_request_connection_pools I, [2024-05-10T14:36:41.515475 #504881] INFO -- : [206/885] 545763=test_rat I, [2024-05-10T14:36:41.528869 #504881] INFO -- : [207/885] 545763=test_bug-3571 I, [2024-05-10T14:36:41.530020 #504881] INFO -- : [208/885] 545763=test_yamlstore I, [2024-05-10T14:36:41.549361 #504881] INFO -- : [209/885] 545763=test_numeric I, [2024-05-10T14:36:41.615117 #504881] INFO -- : [210/885] 545763=test_flags I, [2024-05-10T14:36:42.044344 #504881] INFO -- : [211/885] 545762=test_time I, [2024-05-10T14:36:42.184559 #504881] INFO -- : [212/885] 545763=test_file I, [2024-05-10T14:36:42.187722 #504881] INFO -- : [213/885] 545762=test_nextafter I, [2024-05-10T14:36:42.200205 #504881] INFO -- : [214/885] 545763=test_gem_commands_owner_command I, [2024-05-10T14:36:42.286439 #504881] INFO -- : [215/885] 545762=test_capacity I, [2024-05-10T14:36:42.298794 #504881] INFO -- : [216/885] 545762=test_hmac I, [2024-05-10T14:36:42.308313 #504881] INFO -- : [217/885] 545762=test_encoding I, [2024-05-10T14:36:42.482604 #504881] INFO -- : [218/885] 545762=test_rdoc_generator_markup I, [2024-05-10T14:36:42.497431 #504881] INFO -- : [219/885] 545762=test_find I, [2024-05-10T14:36:42.529372 #504881] INFO -- : [220/885] 545762=test_constant I, [2024-05-10T14:36:42.944732 #504881] INFO -- : [221/885] 545763=test_macro I, [2024-05-10T14:36:42.981842 #504881] INFO -- : [222/885] 545763=test_string I, [2024-05-10T14:36:43.843921 #504881] INFO -- : [223/885] 545764=test_pipe I, [2024-05-10T14:36:43.969307 #504881] INFO -- : [224/885] 545764=test_gem_commands_server_command I, [2024-05-10T14:36:44.186885 #504881] INFO -- : [225/885] 545764=test_function I, [2024-05-10T14:36:44.217185 #504881] INFO -- : [226/885] 545764=test_gem_resolver_activation_request I, [2024-05-10T14:36:44.311658 #504881] INFO -- : [227/885] 545764=parse_comments_test I, [2024-05-10T14:36:44.406766 #504881] INFO -- : [228/885] 545764=test_tcp I, [2024-05-10T14:36:44.417124 #504881] INFO -- : [229/885] 545764=test_win32ole_method_event I, [2024-05-10T14:36:44.425118 #504881] INFO -- : [230/885] 545764=test_integer I, [2024-05-10T14:36:44.486916 #504881] INFO -- : [231/885] 545764=test_rdoc_markup_to_table_of_contents I, [2024-05-10T14:36:44.514545 #504881] INFO -- : [232/885] 545764=test_gem_name_tuple I, [2024-05-10T14:36:44.549338 #504881] INFO -- : [233/885] 545764=test_gem_requirement I, [2024-05-10T14:36:44.696638 #504881] INFO -- : [234/885] 545762=test_open-uri I, [2024-05-10T14:36:44.726060 #504881] INFO -- : [235/885] 545764=test_case I, [2024-05-10T14:36:44.740802 #504881] INFO -- : [236/885] 545764=test_enumerator I, [2024-05-10T14:36:45.149933 #504881] INFO -- : [237/885] 545762=test_enc_associate I, [2024-05-10T14:36:45.624820 #504881] INFO -- : [238/885] 545762=test_rdoc_context I, [2024-05-10T14:36:46.444763 #504881] INFO -- : [239/885] 545762=test_gem_command_manager I, [2024-05-10T14:36:46.617669 #504881] INFO -- : [240/885] 545762=test_array I, [2024-05-10T14:36:46.632160 #504881] INFO -- : [241/885] 545762=test_math I, [2024-05-10T14:36:46.651560 #504881] INFO -- : [242/885] 545762=test_qsort I, [2024-05-10T14:36:46.658197 #504881] INFO -- : [243/885] 545762=comments_test I, [2024-05-10T14:36:46.660146 #504881] INFO -- : [244/885] 545762=test_gc I, [2024-05-10T14:36:46.665846 #504881] INFO -- : [245/885] 545762=test_libs I, [2024-05-10T14:36:46.682766 #504881] INFO -- : [246/885] 545762=test_iso_8859 I, [2024-05-10T14:36:46.742284 #504881] INFO -- : [247/885] 545762=ripper_test I, [2024-05-10T14:36:47.434847 #504881] INFO -- : [248/885] 545762=test_safe_load I, [2024-05-10T14:36:47.451336 #504881] INFO -- : [249/885] 545762=test_sprintf I, [2024-05-10T14:36:47.671404 #504881] INFO -- : [250/885] 545762=test_name_error I, [2024-05-10T14:36:47.758316 #504881] INFO -- : [251/885] 545762=test_gem_source_list I, [2024-05-10T14:36:47.841804 #504881] INFO -- : [252/885] 545762=json_addition_test I, [2024-05-10T14:36:47.865446 #504881] INFO -- : [253/885] 545762=test_gem_commands_sources_command I, [2024-05-10T14:36:48.088038 #504881] INFO -- : [254/885] 545762=test_yaml_special_cases I, [2024-05-10T14:36:48.098546 #504881] INFO -- : [255/885] 545762=test_recorder I, [2024-05-10T14:36:48.239475 #504881] INFO -- : [256/885] 545762=test_class I, [2024-05-10T14:36:51.500728 #504881] INFO -- : [257/885] 545762=test_exit I, [2024-05-10T14:36:51.509639 #504881] INFO -- : [258/885] 545762=test_const I, [2024-05-10T14:36:51.514938 #504881] INFO -- : [259/885] 545762=index_write_test I, [2024-05-10T14:36:51.525735 #504881] INFO -- : [260/885] 545762=test_rdoc_parser_rd I, [2024-05-10T14:36:51.530752 #504881] INFO -- : [261/885] 545762=test_framework I, [2024-05-10T14:36:51.539374 #504881] INFO -- : [262/885] 545762=test_ansi_with_terminfo I, [2024-05-10T14:36:51.549056 #504881] INFO -- : [263/885] 545762=test_inadvertent_creation I, [2024-05-10T14:36:51.652394 #504881] INFO -- : [264/885] 545762=test_coderange I, [2024-05-10T14:36:51.715849 #504881] INFO -- : [265/885] 545762=test_weakmap I, [2024-05-10T14:36:58.736705 #504881] INFO -- : [266/885] 545764=test_cgi_tag_helper I, [2024-05-10T14:36:58.765821 #504881] INFO -- : [267/885] 545764=test_pack I, [2024-05-10T14:36:58.792737 #504881] INFO -- : [268/885] 545764=test_pinned I, [2024-05-10T14:36:58.828753 #504881] INFO -- : [269/885] 545764=test_rdoc_generator_json_index I, [2024-05-10T14:36:58.861748 #504881] INFO -- : [270/885] 545764=test_nil2vtempty I, [2024-05-10T14:36:58.871109 #504881] INFO -- : [271/885] 545764=test_date_time I, [2024-05-10T14:36:58.884982 #504881] INFO -- : [272/885] 545764=test_condition I, [2024-05-10T14:36:58.896512 #504881] INFO -- : [273/885] 545764=test_gem_resolver_vendor_set I, [2024-05-10T14:36:58.927451 #504881] INFO -- : [274/885] 545764=test_jaro_winkler I, [2024-05-10T14:36:58.932970 #504881] INFO -- : [275/885] 545764=test_cp949 I, [2024-05-10T14:36:58.961992 #504881] INFO -- : [276/885] 545764=test_fileutils I, [2024-05-10T14:36:59.333049 #504881] INFO -- : [277/885] 545762=test_mixed_unicode_escapes I, [2024-05-10T14:36:59.334308 #504881] INFO -- : [278/885] 545762=test_sleep I, [2024-05-10T14:36:59.499863 #504881] INFO -- : [279/885] 545764=test_gem_dependency_resolution_error I, [2024-05-10T14:36:59.503840 #504881] INFO -- : [280/885] 545764=test_windows_1252 I, [2024-05-10T14:36:59.682854 #504881] INFO -- : [281/885] 545764=test_stack I, [2024-05-10T14:37:00.287136 #504881] INFO -- : [282/885] 545764=test_emoji I, [2024-05-10T14:37:00.376452 #504881] INFO -- : [283/885] 545764=test_sorted_set I, [2024-05-10T14:37:00.512230 #504881] INFO -- : [284/885] 545764=test_gem_request_set_lockfile_parser I, [2024-05-10T14:37:00.663269 #504881] INFO -- : [285/885] 545764=test_date_attr I, [2024-05-10T14:37:01.344720 #504881] INFO -- : [286/885] 545764=test_sizeof I, [2024-05-10T14:37:01.393770 #504881] INFO -- : [287/885] 545762=test_face I, [2024-05-10T14:37:01.414976 #504881] INFO -- : [288/885] 545762=warnings_test I, [2024-05-10T14:37:01.488870 #504881] INFO -- : [289/885] 545762=test_stringchar I, [2024-05-10T14:37:01.504867 #504881] INFO -- : [290/885] 545762=test_econv I, [2024-05-10T14:37:01.780755 #504881] INFO -- : [291/885] 545763=test_gem_install_update_options I, [2024-05-10T14:37:01.939507 #504881] INFO -- : [292/885] 545763=test_gem_specification I, [2024-05-10T14:37:02.376192 #504881] INFO -- : [293/885] 545762=test_pkey_rsa I, [2024-05-10T14:37:02.660701 #504881] INFO -- : [294/885] 545762=test_flush I, [2024-05-10T14:37:02.693774 #504881] INFO -- : [295/885] 545762=test_system I, [2024-05-10T14:37:03.113849 #504881] INFO -- : [296/885] 545764=test_numhash I, [2024-05-10T14:37:03.116920 #504881] INFO -- : [297/885] 545764=test_method_cache I, [2024-05-10T14:37:03.130472 #504881] INFO -- : [298/885] 545764=test_rdoc_class_module I, [2024-05-10T14:37:03.607401 #504881] INFO -- : [299/885] 545762=test_rdoc_cross_reference I, [2024-05-10T14:37:03.738335 #504881] INFO -- : [300/885] 545764=test_parse I, [2024-05-10T14:37:04.019214 #504881] INFO -- : [301/885] 545762=test_win32ole_variable I, [2024-05-10T14:37:04.092610 #504881] INFO -- : [302/885] 545762=test_argf I, [2024-05-10T14:37:04.214345 #504881] INFO -- : [303/885] 545764=test_x509name I, [2024-05-10T14:37:04.230633 #504881] INFO -- : [304/885] 545764=test_yaml I, [2024-05-10T14:37:04.347805 #504881] INFO -- : [305/885] 545764=test_cclass I, [2024-05-10T14:37:04.398178 #504881] INFO -- : [306/885] 545764=test_gem_uninstaller I, [2024-05-10T14:37:04.869519 #504881] INFO -- : [307/885] 545763=test_yjit I, [2024-05-10T14:37:04.896042 #504881] INFO -- : [308/885] 545763=test_gem_dependency I, [2024-05-10T14:37:05.103207 #504881] INFO -- : [309/885] 545763=test_method I, [2024-05-10T14:37:05.629590 #504881] INFO -- : [310/885] 545764=test_m17n I, [2024-05-10T14:37:05.728537 #504881] INFO -- : [311/885] 545764=test_parser_events I, [2024-05-10T14:37:05.791211 #504881] INFO -- : [312/885] 545764=test_filter I, [2024-05-10T14:37:05.887449 #504881] INFO -- : [313/885] 545764=test_pkcs12 I, [2024-05-10T14:37:06.522113 #504881] INFO -- : [314/885] 545764=test_koi8 I, [2024-05-10T14:37:06.529851 #504881] INFO -- : [315/885] 545764=test_json_tree I, [2024-05-10T14:37:06.581682 #504881] INFO -- : [316/885] 545764=test_gem_remote_fetcher I, [2024-05-10T14:37:07.699040 #504881] INFO -- : [317/885] 545762=test_case I, [2024-05-10T14:37:07.705364 #504881] INFO -- : [318/885] 545762=test_ractor I, [2024-05-10T14:37:07.724479 #504881] INFO -- : [319/885] 545762=test_severity I, [2024-05-10T14:37:07.730191 #504881] INFO -- : [320/885] 545762=test_str2big I, [2024-05-10T14:37:07.747012 #504881] INFO -- : [321/885] 545762=test_gem_package_tar_writer I, [2024-05-10T14:37:07.981541 #504881] INFO -- : [322/885] 545762=test_set I, [2024-05-10T14:37:07.990434 #504881] INFO -- : [323/885] 545762=attribute_write_test I, [2024-05-10T14:37:08.007645 #504881] INFO -- : [324/885] 545762=test_http I, [2024-05-10T14:37:08.558728 #504881] INFO -- : [325/885] 545764=test_utf16 I, [2024-05-10T14:37:08.574108 #504881] INFO -- : [326/885] 545764=test_rdoc_markup_to_rdoc I, [2024-05-10T14:37:08.640189 #504881] INFO -- : [327/885] 545764=test_gem_commands_push_command I, [2024-05-10T14:37:09.258037 #504881] INFO -- : [328/885] 545764=locals_test I, [2024-05-10T14:37:09.631992 #504881] INFO -- : [329/885] 545764=test_method_cache I, [2024-05-10T14:37:09.696140 #504881] INFO -- : [330/885] 545764=test_too_many_dummy_encodings I, [2024-05-10T14:37:09.709849 #504881] INFO -- : [331/885] 545764=test_sprintf_comb I, [2024-05-10T14:37:09.904108 #504881] INFO -- : [332/885] 545764=test_rendering I, [2024-05-10T14:37:09.909101 #504881] INFO -- : [333/885] 545764=test_win32ole I, [2024-05-10T14:37:09.914865 #504881] INFO -- : [334/885] 545764=test_internal_ivar I, [2024-05-10T14:37:09.924107 #504881] INFO -- : [335/885] 545764=desugar_compiler_test I, [2024-05-10T14:37:09.948670 #504881] INFO -- : [336/885] 545764=test_gem_source_local I, [2024-05-10T14:37:10.199397 #504881] INFO -- : [337/885] 545764=test_gem_gemcutter_utilities I, [2024-05-10T14:37:10.642713 #504881] INFO -- : [338/885] 545764=test_rdoc_task I, [2024-05-10T14:37:10.773989 #504881] INFO -- : [339/885] 545764=test_backtrace I, [2024-05-10T14:37:11.408916 #504881] INFO -- : [340/885] 545763=test_gem_text I, [2024-05-10T14:37:11.495277 #504881] INFO -- : [341/885] 545763=test_settracefunc I, [2024-05-10T14:37:11.920312 #504881] INFO -- : [342/885] 545764=test_tracepoint I, [2024-05-10T14:37:12.211768 #504881] INFO -- : [343/885] 545764=test_pty I, [2024-05-10T14:37:12.376443 #504881] INFO -- : [344/885] 545763=test_gem_dependency_installer I, [2024-05-10T14:37:12.660467 #504881] INFO -- : [345/885] 545764=test_http I, [2024-05-10T14:37:12.679287 #504881] INFO -- : [346/885] 545764=test_hash I, [2024-05-10T14:37:14.674236 #504881] INFO -- : [347/885] 545763=parser_test I, [2024-05-10T14:37:14.684299 #504881] INFO -- : [348/885] 545763=encoding_test I, [2024-05-10T14:37:14.807168 #504881] INFO -- : [349/885] 545763=test_gem_commands_specification_command I, [2024-05-10T14:37:14.950036 #504881] INFO -- : [350/885] 545763=test_scan_args I, [2024-05-10T14:37:14.968531 #504881] INFO -- : [351/885] 545763=test_gem_request I, [2024-05-10T14:37:15.227998 #504881] INFO -- : [352/885] 545763=test_gem_commands_which_command I, [2024-05-10T14:37:15.266209 #504881] INFO -- : [353/885] 545763=test_gem_package_old I, [2024-05-10T14:37:15.321361 #504881] INFO -- : [354/885] 545763=test_gem_ext_cargo_builder_unit I, [2024-05-10T14:37:15.343802 #504881] INFO -- : [355/885] 545763=test_rational I, [2024-05-10T14:37:15.372752 #504881] INFO -- : [356/885] 545763=test_case_mapping I, [2024-05-10T14:37:15.387932 #504881] INFO -- : [357/885] 545763=test_gem_resolver_api_specification I, [2024-05-10T14:37:15.482290 #504881] INFO -- : [358/885] 545763=test_rdoc_rubygems_hook I, [2024-05-10T14:37:15.564744 #504881] INFO -- : [359/885] 545763=test_ractor I, [2024-05-10T14:37:15.576524 #504881] INFO -- : [360/885] 545763=test_webauthn_listener I, [2024-05-10T14:37:15.643710 #504881] INFO -- : [361/885] 545763=test_key_event_record I, [2024-05-10T14:37:15.710710 #504881] INFO -- : [362/885] 545763=test_open3 I, [2024-05-10T14:37:16.342221 #504881] INFO -- : [363/885] 545764=test_mdns I, [2024-05-10T14:37:16.357008 #504881] INFO -- : [364/885] 545764=test_date_parse I, [2024-05-10T14:37:16.465089 #504881] INFO -- : [365/885] 545764=test_thread I, [2024-05-10T14:37:16.472245 #504881] INFO -- : [366/885] 545764=test_arity I, [2024-05-10T14:37:16.476589 #504881] INFO -- : [367/885] 545764=test_buffering I, [2024-05-10T14:37:16.484974 #504881] INFO -- : [368/885] 545764=test_svcb_https I, [2024-05-10T14:37:16.504278 #504881] INFO -- : [369/885] 545764=test_pkey_ec I, [2024-05-10T14:37:16.554668 #504881] INFO -- : [370/885] 545764=test_gem_spec_fetcher I, [2024-05-10T14:37:16.788172 #504881] INFO -- : [371/885] 545764=test_yamldbm I, [2024-05-10T14:37:16.801528 #504881] INFO -- : [372/885] 545764=test_switch_hitter I, [2024-05-10T14:37:16.832859 #504881] INFO -- : [373/885] 545764=test_default_gems I, [2024-05-10T14:37:16.876250 #504881] INFO -- : [374/885] 545764=test_unicode_escape I, [2024-05-10T14:37:16.911872 #504881] INFO -- : [375/885] 545762=test_gbk I, [2024-05-10T14:37:16.917753 #504881] INFO -- : [376/885] 545762=test_backtrace I, [2024-05-10T14:37:16.930145 #504881] INFO -- : [377/885] 545762=test_gem_commands_dependency_command I, [2024-05-10T14:37:16.951737 #504881] INFO -- : [378/885] 545764=test_set I, [2024-05-10T14:37:16.987166 #504881] INFO -- : [379/885] 545764=test_enumerable I, [2024-05-10T14:37:16.991443 #504881] INFO -- : [380/885] 545764=test_rdoc_method_attr I, [2024-05-10T14:37:17.040700 #504881] INFO -- : [381/885] 545762=test_tree_spell_checker I, [2024-05-10T14:37:17.068056 #504881] INFO -- : [382/885] 545762=static_literals_test I, [2024-05-10T14:37:17.074680 #504881] INFO -- : [383/885] 545762=test_hash_create I, [2024-05-10T14:37:17.076320 #504881] INFO -- : [384/885] 545762=test_grapheme_breaks I, [2024-05-10T14:37:17.099273 #504881] INFO -- : [385/885] 545762=test_queue I, [2024-05-10T14:37:17.104026 #504881] INFO -- : [386/885] 545764=test_boolean I, [2024-05-10T14:37:17.107114 #504881] INFO -- : [387/885] 545762=test_gem_resolver_lock_specification I, [2024-05-10T14:37:17.123090 #504881] INFO -- : [388/885] 545764=test_dryrun I, [2024-05-10T14:37:17.136715 #504881] INFO -- : [389/885] 545764=test_rdoc_i18n_locale I, [2024-05-10T14:37:17.162379 #504881] INFO -- : [390/885] 545764=test_gc_compact I, [2024-05-10T14:37:17.228730 #504881] INFO -- : [391/885] 545762=test_prettyprint I, [2024-05-10T14:37:17.263311 #504881] INFO -- : [392/885] 545762=test_gem_uri_formatter I, [2024-05-10T14:37:17.289871 #504881] INFO -- : [393/885] 545762=test_cgi_util I, [2024-05-10T14:37:17.553916 #504881] INFO -- : [394/885] 545762=test_ole_methods I, [2024-05-10T14:37:17.560068 #504881] INFO -- : [395/885] 545762=test_clone I, [2024-05-10T14:37:17.713565 #504881] INFO -- : [396/885] 545762=test_enc_raise I, [2024-05-10T14:37:17.736758 #504881] INFO -- : [397/885] 545762=test_rubyoptions I, [2024-05-10T14:37:18.135237 #504881] INFO -- : [398/885] 545763=test_rdoc_stats I, [2024-05-10T14:37:18.223920 #504881] INFO -- : [399/885] 545763=test_files_sample I, [2024-05-10T14:37:18.307531 #504881] INFO -- : [400/885] 545763=test_data_error I, [2024-05-10T14:37:18.312653 #504881] INFO -- : [401/885] 545763=test_force_exit I, [2024-05-10T14:37:18.375850 #504881] INFO -- : [402/885] 545763=test_optimization I, [2024-05-10T14:37:20.346489 #504881] INFO -- : [403/885] 545764=test_rdoc_store I, [2024-05-10T14:37:21.003483 #504881] INFO -- : [404/885] 545764=test_shift_jis I, [2024-05-10T14:37:21.016708 #504881] INFO -- : [405/885] 545764=regexp_test I, [2024-05-10T14:37:21.040463 #504881] INFO -- : [406/885] 545764=test_show_source I, [2024-05-10T14:37:21.096158 #504881] INFO -- : [407/885] 545764=test_remote_fetch_error I, [2024-05-10T14:37:21.122172 #504881] INFO -- : [408/885] 545764=test_yield I, [2024-05-10T14:37:23.798567 #504881] INFO -- : [409/885] 545764=test_gem_resolver_lock_set I, [2024-05-10T14:37:23.829508 #504881] INFO -- : [410/885] 545764=test_random I, [2024-05-10T14:37:23.838978 #504881] INFO -- : [411/885] 545764=test_rdoc_generator_darkfish I, [2024-05-10T14:37:23.947678 #504881] INFO -- : [412/885] 545762=test_undef I, [2024-05-10T14:37:23.957973 #504881] INFO -- : [413/885] 545762=test_gem_command I, [2024-05-10T14:37:24.111945 #504881] INFO -- : [414/885] 545762=test_asn1 I, [2024-05-10T14:37:24.144415 #504881] INFO -- : [415/885] 545762=test_emoji_breaks I, [2024-05-10T14:37:24.146657 #504881] INFO -- : [416/885] 545762=test_normalize I, [2024-05-10T14:37:24.146704 #504881] INFO -- : [417/885] 545762=test_verbose I, [2024-05-10T14:37:24.209934 #504881] INFO -- : [418/885] 545762=test_gem_commands_open_command I, [2024-05-10T14:37:24.237819 #504881] INFO -- : [419/885] 545764=test_gem_update_suggestion I, [2024-05-10T14:37:24.296304 #504881] INFO -- : [420/885] 545762=test_assignment I, [2024-05-10T14:37:24.354294 #504881] INFO -- : [421/885] 545764=test_gem_resolver_git_specification I, [2024-05-10T14:37:24.657373 #504881] INFO -- : [422/885] 545764=test_utf32 I, [2024-05-10T14:37:24.667894 #504881] INFO -- : [423/885] 545764=test_basicinstructions I, [2024-05-10T14:37:24.734778 #504881] INFO -- : [424/885] 545764=test_erb I, [2024-05-10T14:37:24.803700 #504881] INFO -- : [425/885] 545764=test_date_ractor I, [2024-05-10T14:37:24.936232 #504881] INFO -- : [426/885] 545763=test_key_actor_emacs I, [2024-05-10T14:37:24.999619 #504881] INFO -- : [427/885] 545764=test_gem_security I, [2024-05-10T14:37:25.017629 #504881] INFO -- : [428/885] 545763=test_hash I, [2024-05-10T14:37:25.038674 #504881] INFO -- : [429/885] 545763=test_variable I, [2024-05-10T14:37:25.152288 #504881] INFO -- : [430/885] 545763=test_gem_commands_pristine_command I, [2024-05-10T14:37:25.634447 #504881] INFO -- : [431/885] 545762=test_optarg I, [2024-05-10T14:37:25.767337 #504881] INFO -- : [432/885] 545762=test_rdoc_tom_doc I, [2024-05-10T14:37:25.831001 #504881] INFO -- : [433/885] 545762=test_pp I, [2024-05-10T14:37:25.877103 #504881] INFO -- : Leaked file descriptor: PPTestModule::PPFileStatTest#test_nothing_raised: 11 # I, [2024-05-10T14:37:25.901856 #504881] INFO -- : COMMAND PID USER FD TYPE DEVICE SIZE/OFF NODE NAME I, [2024-05-10T14:37:25.901923 #504881] INFO -- : ruby 545762 opc 11r REG 252,0 9253600 13705411 /var/lib/sss/mc/passwd I, [2024-05-10T14:37:25.970057 #504881] INFO -- : [434/885] 545762=test_gem_impossible_dependencies_error I, [2024-05-10T14:37:25.988833 #504881] INFO -- : [435/885] 545762=test_noarg I, [2024-05-10T14:37:26.193120 #504881] INFO -- : [436/885] 545762=test_raise_exception I, [2024-05-10T14:37:26.624717 #504881] INFO -- : [437/885] 545763=test_arith_seq_beg_len_step I, [2024-05-10T14:37:26.633926 #504881] INFO -- : [438/885] 545762=test_exception I, [2024-05-10T14:37:26.634515 #504881] INFO -- : [439/885] 545763=memsize_test I, [2024-05-10T14:37:26.639519 #504881] INFO -- : [440/885] 545763=test_gem_resolver_requirement_list I, [2024-05-10T14:37:26.646021 #504881] INFO -- : [441/885] 545762=test_did_you_mean I, [2024-05-10T14:37:26.655216 #504881] INFO -- : [442/885] 545763=test_shapes I, [2024-05-10T14:37:26.662877 #504881] INFO -- : [443/885] 545763=test_cesu8 I, [2024-05-10T14:37:26.679595 #504881] INFO -- : [444/885] 545763=test_rdoc_extend I, [2024-05-10T14:37:26.701068 #504881] INFO -- : [445/885] 545763=test_method_name_check I, [2024-05-10T14:37:26.706332 #504881] INFO -- : [446/885] 545762=test_err_in_callback I, [2024-05-10T14:37:26.712975 #504881] INFO -- : [447/885] 545762=test_storage I, [2024-05-10T14:37:26.719139 #504881] INFO -- : [448/885] 545762=test_merge_keys I, [2024-05-10T14:37:26.727275 #504881] INFO -- : [449/885] 545762=test_iterator I, [2024-05-10T14:37:26.741013 #504881] INFO -- : [450/885] 545763=test_string I, [2024-05-10T14:37:26.754798 #504881] INFO -- : [451/885] 545763=test_gem_commands_install_command I, [2024-05-10T14:37:26.811761 #504881] INFO -- : [452/885] 545762=test_rendering I, [2024-05-10T14:37:26.812982 #504881] INFO -- : [453/885] 545762=test_kernel I, [2024-05-10T14:37:27.528863 #504881] INFO -- : [454/885] 545762=test_dot_dot I, [2024-05-10T14:37:27.539892 #504881] INFO -- : [455/885] 545762=test_gem_rdoc I, [2024-05-10T14:37:27.709947 #504881] INFO -- : [456/885] 545762=pattern_test I, [2024-05-10T14:37:27.717482 #504881] INFO -- : [457/885] 545762=!Nothing_to_test I, [2024-05-10T14:37:27.720132 #504881] INFO -- : [458/885] 545762=test_forwardable I, [2024-05-10T14:37:27.753505 #504881] INFO -- : [459/885] 545762=test_process I, [2024-05-10T14:37:27.784281 #504881] INFO -- : [460/885] 545762=test_fd_setsize I, [2024-05-10T14:37:27.793011 #504881] INFO -- : [461/885] 545762=test_dir_m17n I, [2024-05-10T14:37:28.720154 #504881] INFO -- : [462/885] 545763=test_memory_view I, [2024-05-10T14:37:28.991296 #504881] INFO -- : [463/885] 545762=test_array_create I, [2024-05-10T14:37:28.998734 #504881] INFO -- : [464/885] 545762=test_threadgroup I, [2024-05-10T14:37:29.055131 #504881] INFO -- : [465/885] 545763=test_complex I, [2024-05-10T14:37:29.120808 #504881] INFO -- : [466/885] 545763=test_dup I, [2024-05-10T14:37:29.270609 #504881] INFO -- : [467/885] 545763=test_rdoc_single_class I, [2024-05-10T14:37:29.318619 #504881] INFO -- : [468/885] 545763=test_acceptable I, [2024-05-10T14:37:29.338060 #504881] INFO -- : [469/885] 545763=test_gem_ext_cargo_builder_link_flag_converter I, [2024-05-10T14:37:29.422647 #504881] INFO -- : [470/885] 545763=test_gem_local_remote_options I, [2024-05-10T14:37:29.493602 #504881] INFO -- : [471/885] 545763=test_mutex I, [2024-05-10T14:37:30.015790 #504881] INFO -- : [472/885] 545762=test_rdoc_token_stream I, [2024-05-10T14:37:30.026708 #504881] INFO -- : [473/885] 545762=test_type I, [2024-05-10T14:37:30.032784 #504881] INFO -- : [474/885] 545762=heredoc_dedent_test I, [2024-05-10T14:37:30.042074 #504881] INFO -- : [475/885] 545762=test_tmpdir I, [2024-05-10T14:37:30.120450 #504881] INFO -- : [476/885] 545762=test_struct I, [2024-05-10T14:37:30.631192 #504881] INFO -- : [477/885] 545763=test_exception_at_throwing I, [2024-05-10T14:37:30.654580 #504881] INFO -- : [478/885] 545762=test_gem_resolver_installed_specification I, [2024-05-10T14:37:30.669065 #504881] INFO -- : [479/885] 545763=test_ractor I, [2024-05-10T14:37:30.695523 #504881] INFO -- : [480/885] 545762=test_stringscanner I, [2024-05-10T14:37:30.728763 #504881] INFO -- : [481/885] 545762=json_generic_object_test I, [2024-05-10T14:37:30.730334 #504881] INFO -- : [482/885] 545762=test_fiddle I, [2024-05-10T14:37:30.758807 #504881] INFO -- : [483/885] 545763=test_gem_resolver_vendor_specification I, [2024-05-10T14:37:30.792113 #504881] INFO -- : [484/885] 545763=test_date_arith I, [2024-05-10T14:37:30.813225 #504881] INFO -- : [485/885] 545763=test_gem_safe_marshal I, [2024-05-10T14:37:30.940063 #504881] INFO -- : [486/885] 545762=test_httpheader I, [2024-05-10T14:37:30.950532 #504881] INFO -- : [487/885] 545762=test_sexp I, [2024-05-10T14:37:30.972289 #504881] INFO -- : [488/885] 545762=test_ractor I, [2024-05-10T14:37:31.036607 #504881] INFO -- : [489/885] 545762=test_rdoc_ri_driver I, [2024-05-10T14:37:31.605171 #504881] INFO -- : [490/885] 545762=test_gem_resolver_git_set I, [2024-05-10T14:37:32.058743 #504881] INFO -- : [491/885] 545763=test_gem_commands_check_command I, [2024-05-10T14:37:32.153621 #504881] INFO -- : [492/885] 545763=test_signedness I, [2024-05-10T14:37:32.440478 #504881] INFO -- : [493/885] 545762=test_digest I, [2024-05-10T14:37:33.286249 #504881] INFO -- : [494/885] 545762=test_files_test I, [2024-05-10T14:37:33.295195 #504881] INFO -- : [495/885] 545762=test_weakkeymap I, [2024-05-10T14:37:33.661930 #504881] INFO -- : [496/885] 545762=test_evaluation I, [2024-05-10T14:37:33.668473 #504881] INFO -- : [497/885] 545762=test_protocol I, [2024-05-10T14:37:33.871250 #504881] INFO -- : [498/885] 545763=test_rdoc_markup_to_ansi I, [2024-05-10T14:37:33.910751 #504881] INFO -- : [499/885] 545763=test_object_create_start I, [2024-05-10T14:37:33.925758 #504881] INFO -- : [500/885] 545763=test_gem_commands_info_command I, [2024-05-10T14:37:33.971572 #504881] INFO -- : [501/885] 545763=test_https I, [2024-05-10T14:37:33.986538 #504881] INFO -- : [502/885] 545762=test_gem_request_set_gem_dependency_api I, [2024-05-10T14:37:34.176626 #504881] INFO -- : [503/885] 545763=test_name_error_extension I, [2024-05-10T14:37:34.182682 #504881] INFO -- : [504/885] 545763=test_x509cert I, [2024-05-10T14:37:34.272265 #504881] INFO -- : [505/885] 545763=test_rdoc_markup_paragraph I, [2024-05-10T14:37:34.283834 #504881] INFO -- : [506/885] 545763=test_irb I, [2024-05-10T14:37:34.317086 #504881] INFO -- : [507/885] 545762=test_variable_name_check I, [2024-05-10T14:37:34.430051 #504881] INFO -- : [508/885] 545762=test_bn I, [2024-05-10T14:37:34.449334 #504881] INFO -- : [509/885] 545762=test_require_path_check I, [2024-05-10T14:37:34.614259 #504881] INFO -- : [510/885] 545763=test_logdevice I, [2024-05-10T14:37:34.668770 #504881] INFO -- : [511/885] 545762=test_ast I, [2024-05-10T14:37:35.514668 #504881] INFO -- : [512/885] 545763=test_gem_package_tar_header I, [2024-05-10T14:37:35.809828 #504881] INFO -- : [513/885] 545763=test_ssl_session I, [2024-05-10T14:37:36.467128 #504881] INFO -- : [514/885] 545763=test_logperiod I, [2024-05-10T14:37:36.682362 #504881] INFO -- : [515/885] 545763=test_case_comprehensive I, [2024-05-10T14:37:39.423710 #504881] INFO -- : [516/885] 545764=test_rational2 I, [2024-05-10T14:37:39.471068 #504881] INFO -- : [517/885] 545764=test_placearg I, [2024-05-10T14:37:39.492479 #504881] INFO -- : [518/885] 545764=test_completion I, [2024-05-10T14:37:40.186527 #504881] INFO -- : [519/885] 545764=test_file_exhaustive I, [2024-05-10T14:37:49.058546 #504881] INFO -- : [520/885] 545764=test_gem_security_policy I, [2024-05-10T14:37:49.469152 #504881] INFO -- : [521/885] 545764=test_rdoc_markup_document I, [2024-05-10T14:37:49.484756 #504881] INFO -- : [522/885] 545764=test_delete I, [2024-05-10T14:37:49.489843 #504881] INFO -- : [523/885] 545764=test_handle I, [2024-05-10T14:37:50.217642 #504881] INFO -- : [524/885] 545764=parse_stream_test I, [2024-05-10T14:37:50.223072 #504881] INFO -- : [525/885] 545764=test_io_wait_uncommon I, [2024-05-10T14:37:50.242081 #504881] INFO -- : [526/885] 545764=test_fixnum I, [2024-05-10T14:37:50.260696 #504881] INFO -- : [527/885] 545764=test_gem_silent_ui I, [2024-05-10T14:37:50.325283 #504881] INFO -- : [528/885] 545764=test_signal I, [2024-05-10T14:37:52.308222 #504881] INFO -- : [529/885] 545764=test_continuation I, [2024-05-10T14:37:52.318379 #504881] INFO -- : [530/885] 545764=test_gem_ci_detector I, [2024-05-10T14:37:52.336343 #504881] INFO -- : [531/885] 545764=test_x509store I, [2024-05-10T14:37:52.849877 #504881] INFO -- : [532/885] 545764=test_rdoc_rd_block_parser I, [2024-05-10T14:37:52.876341 #504881] INFO -- : [533/885] 545764=test_rdoc_generator_pot I, [2024-05-10T14:37:52.881585 #504881] INFO -- : [534/885] 545764=test_rdoc_markup_to_joined_paragraph I, [2024-05-10T14:37:52.892648 #504881] INFO -- : [535/885] 545764=test_rdoc_markup_to_markdown I, [2024-05-10T14:37:52.973516 #504881] INFO -- : [536/885] 545764=test_rdoc_rd I, [2024-05-10T14:37:52.983935 #504881] INFO -- : [537/885] 545764=test_gem_gem_runner I, [2024-05-10T14:37:53.062335 #504881] INFO -- : [538/885] 545764=test_require_lib I, [2024-05-10T14:37:56.066342 #504881] INFO -- : [539/885] 545764=test_metaclass I, [2024-05-10T14:37:56.091335 #504881] INFO -- : [540/885] 545764=test_require I, [2024-05-10T14:37:57.065127 #504881] INFO -- : [541/885] 545763=test_objectspace I, [2024-05-10T14:37:58.016681 #504881] INFO -- : [542/885] 545763=test_gem_resolver_composed_set I, [2024-05-10T14:37:58.035271 #504881] INFO -- : [543/885] 545763=test_my_integer I, [2024-05-10T14:37:58.039060 #504881] INFO -- : [544/885] 545763=test_debugger_integration I, [2024-05-10T14:37:58.050681 #504881] INFO -- : [545/885] 545763=test_cgi_cookie I, [2024-05-10T14:37:58.063709 #504881] INFO -- : [546/885] 545763=test_not I, [2024-05-10T14:37:58.068083 #504881] INFO -- : [547/885] 545763=test_tracer I, [2024-05-10T14:37:58.078577 #504881] INFO -- : [548/885] 545763=test_wss I, [2024-05-10T14:37:58.079363 #504881] INFO -- : [549/885] 545763=test_rdoc_markup_attribute_manager I, [2024-05-10T14:37:58.120979 #504881] INFO -- : [550/885] 545763=test_option I, [2024-05-10T14:37:58.246278 #504881] INFO -- : [551/885] 545763=test_gem_source_lock I, [2024-05-10T14:37:58.317561 #504881] INFO -- : [552/885] 545763=test_update I, [2024-05-10T14:37:58.329065 #504881] INFO -- : [553/885] 545763=test_cipher I, [2024-05-10T14:37:58.352866 #504881] INFO -- : [554/885] 545763=test_new I, [2024-05-10T14:37:58.358773 #504881] INFO -- : [555/885] 545763=test_win32ole_type I, [2024-05-10T14:37:58.375497 #504881] INFO -- : [556/885] 545763=test_rdoc_rd_inline_parser I, [2024-05-10T14:37:58.401237 #504881] INFO -- : [557/885] 545763=test_load I, [2024-05-10T14:37:58.409019 #504881] INFO -- : [558/885] 545763=test_custom_command I, [2024-05-10T14:37:58.416722 #504881] INFO -- : [559/885] 545763=test_rdoc_parser_markdown I, [2024-05-10T14:37:58.491788 #504881] INFO -- : [560/885] 545763=test_cparser I, [2024-05-10T14:37:58.611324 #504881] INFO -- : [561/885] 545764=fuzzer_test I, [2024-05-10T14:37:58.635713 #504881] INFO -- : [562/885] 545764=test_rubyvm I, [2024-05-10T14:37:58.636310 #504881] INFO -- : [563/885] 545764=test_c_struct_entry I, [2024-05-10T14:37:59.328197 #504881] INFO -- : [564/885] 545764=test_struct I, [2024-05-10T14:37:59.336137 #504881] INFO -- : [565/885] 545764=static_inspect_test I, [2024-05-10T14:37:59.340611 #504881] INFO -- : [566/885] 545764=test_config I, [2024-05-10T14:37:59.394013 #504881] INFO -- : [567/885] 545764=test_ostruct I, [2024-05-10T14:37:59.520907 #504881] INFO -- : [568/885] 545764=test_depth_first I, [2024-05-10T14:37:59.527481 #504881] INFO -- : [569/885] 545764=test_change_word I, [2024-05-10T14:37:59.538863 #504881] INFO -- : [570/885] 545764=test_erb_command I, [2024-05-10T14:37:59.576541 #504881] INFO -- : [571/885] 545764=test_module I, [2024-05-10T14:38:00.543092 #504881] INFO -- : [572/885] 545763=test_gem_security_trust_dir I, [2024-05-10T14:38:00.619883 #504881] INFO -- : [573/885] 545763=test_gem_source_installed I, [2024-05-10T14:38:00.635520 #504881] INFO -- : [574/885] 545763=test_gem_validator I, [2024-05-10T14:38:00.664095 #504881] INFO -- : [575/885] 545763=test_usrmarshal I, [2024-05-10T14:38:00.851180 #504881] INFO -- : [576/885] 545763=test_load I, [2024-05-10T14:38:00.855244 #504881] INFO -- : Leaked file descriptor: TestOptionParserLoad#test_load_nothing: 10 # I, [2024-05-10T14:38:00.878213 #504881] INFO -- : COMMAND PID USER FD TYPE DEVICE SIZE/OFF NODE NAME I, [2024-05-10T14:38:00.878286 #504881] INFO -- : ruby 545763 opc 10r REG 252,0 9253600 13705411 /var/lib/sss/mc/passwd I, [2024-05-10T14:38:01.053990 #504881] INFO -- : [577/885] 545763=test_integer_comb I, [2024-05-10T14:38:02.248655 #504881] INFO -- : [578/885] 545764=test_bundled_ca I, [2024-05-10T14:38:03.616949 #504881] INFO -- : [579/885] 545763=test_abi I, [2024-05-10T14:38:03.748570 #504881] INFO -- : [580/885] 545763=test_ssl I, [2024-05-10T14:38:04.674880 #504881] INFO -- : [581/885] 545764=test_lock_native_thread I, [2024-05-10T14:38:05.007648 #504881] INFO -- : [582/885] 545764=test_gem_package_task I, [2024-05-10T14:38:05.021267 #504881] INFO -- : [583/885] 545764=test_resize I, [2024-05-10T14:38:05.027171 #504881] INFO -- : [584/885] 545764=test_key_error I, [2024-05-10T14:38:05.032060 #504881] INFO -- : [585/885] 545764=test_win32ole_param I, [2024-05-10T14:38:05.041031 #504881] INFO -- : [586/885] 545764=test_gem_commands_mirror I, [2024-05-10T14:38:05.049728 #504881] INFO -- : [587/885] 545764=test_fiber I, [2024-05-10T14:38:11.182917 #504881] INFO -- : [588/885] 545764=test_engine I, [2024-05-10T14:38:11.680026 #504881] INFO -- : [589/885] 545764=test_io_m17n I, [2024-05-10T14:38:12.976265 #504881] INFO -- : [590/885] 545764=test_rdoc_top_level I, [2024-05-10T14:38:13.316717 #504881] INFO -- : [591/885] 545764=test_gem_stub_specification I, [2024-05-10T14:38:13.484273 #504881] INFO -- : [592/885] 545764=test_float I, [2024-05-10T14:38:14.371366 #504881] INFO -- : [593/885] 545763=test_cmethod I, [2024-05-10T14:38:14.381120 #504881] INFO -- : [594/885] 545763=test_color I, [2024-05-10T14:38:14.458053 #504881] INFO -- : [595/885] 545763=test_gb18030 I, [2024-05-10T14:38:14.463855 #504881] INFO -- : [596/885] 545763=test_propertyputref I, [2024-05-10T14:38:14.469834 #504881] INFO -- : [597/885] 545763=test_reline_key I, [2024-05-10T14:38:14.484067 #504881] INFO -- : [598/885] 545763=test_gem_commands_lock_command I, [2024-05-10T14:38:14.604781 #504881] INFO -- : [599/885] 545763=test_unicode_normalize I, [2024-05-10T14:38:15.361057 #504881] INFO -- : [600/885] 545764=test_rdoc_generator_ri I, [2024-05-10T14:38:15.372173 #504881] INFO -- : [601/885] 545764=test_gem_stream_ui I, [2024-05-10T14:38:15.503328 #504881] INFO -- : [602/885] 545764=test_ipaddr I, [2024-05-10T14:38:15.542332 #504881] INFO -- : [603/885] 545764=test_ocsp I, [2024-05-10T14:38:15.638780 #504881] INFO -- : [604/885] 545764=test_scanner_events I, [2024-05-10T14:38:15.679793 #504881] INFO -- : [605/885] 545764=test_date_strptime I, [2024-05-10T14:38:15.798528 #504881] INFO -- : [606/885] 545764=test_omap I, [2024-05-10T14:38:15.808753 #504881] INFO -- : [607/885] 545764=test_mul I, [2024-05-10T14:38:15.815405 #504881] INFO -- : [608/885] 545764=test_shellwords I, [2024-05-10T14:38:15.820848 #504881] INFO -- : [609/885] 545764=test_rdoc_generator_pot_po I, [2024-05-10T14:38:15.844691 #504881] INFO -- : [610/885] 545764=test_gem_ext_configure_builder I, [2024-05-10T14:38:15.880192 #504881] INFO -- : [611/885] 545764=json_ext_parser_test I, [2024-05-10T14:38:15.885307 #504881] INFO -- : [612/885] 545764=test_nonblock I, [2024-05-10T14:38:15.909004 #504881] INFO -- : [613/885] 545764=test_rdoc_parser_simple I, [2024-05-10T14:38:15.931098 #504881] INFO -- : [614/885] 545764=test_printf I, [2024-05-10T14:38:15.948778 #504881] INFO -- : [615/885] 545764=test_x509attr I, [2024-05-10T14:38:15.954856 #504881] INFO -- : [616/885] 545764=test_workspace I, [2024-05-10T14:38:16.075086 #504881] INFO -- : [617/885] 545764=test_cgi_modruby I, [2024-05-10T14:38:16.090615 #504881] INFO -- : [618/885] 545764=test_win32ole_variant I, [2024-05-10T14:38:16.097375 #504881] INFO -- : [619/885] 545764=magic_comment_test I, [2024-05-10T14:38:16.100040 #504881] INFO -- : [620/885] 545764=test_win32ole_param_event I, [2024-05-10T14:38:16.100599 #504881] INFO -- : [621/885] 545764=test_rdoc_parser I, [2024-05-10T14:38:16.132535 #504881] INFO -- : [622/885] 545764=test_https_proxy I, [2024-05-10T14:38:16.141959 #504881] INFO -- : [623/885] 545764=test_etc I, [2024-05-10T14:38:16.231528 #504881] INFO -- : [624/885] 545764=test_nomethod_error I, [2024-05-10T14:38:16.242541 #504881] INFO -- : [625/885] 545764=test_gem_commands_rebuild_command I, [2024-05-10T14:38:16.307970 #504881] INFO -- : [626/885] 545764=test_stat I, [2024-05-10T14:38:16.358189 #504881] INFO -- : [627/885] 545764=test_dir I, [2024-05-10T14:38:16.680613 #504881] INFO -- : [628/885] 545764=test_files_test_1 I, [2024-05-10T14:38:16.683927 #504881] INFO -- : [629/885] 545764=test_resolve_symbol I, [2024-05-10T14:38:16.780723 #504881] INFO -- : [630/885] 545764=test_rubygems I, [2024-05-10T14:38:16.955388 #504881] INFO -- : [631/885] 545764=test_closure I, [2024-05-10T14:38:19.025875 #504881] INFO -- : [632/885] 545763=test_digest I, [2024-05-10T14:38:19.040260 #504881] INFO -- : [633/885] 545763=test_path I, [2024-05-10T14:38:19.049533 #504881] INFO -- : [634/885] 545763=test_rdoc_rd_inline I, [2024-05-10T14:38:19.081815 #504881] INFO -- : [635/885] 545763=test_io I, [2024-05-10T14:38:19.475145 #504881] INFO -- : [636/885] 545764=test_uncorrectable_name_check I, [2024-05-10T14:38:19.482222 #504881] INFO -- : [637/885] 545764=command_line_test I, [2024-05-10T14:38:19.528413 #504881] INFO -- : [638/885] 545764=test_env I, [2024-05-10T14:38:20.453894 #504881] INFO -- : [639/885] 545762=test_gem_package_tar_reader I, [2024-05-10T14:38:20.556703 #504881] INFO -- : [640/885] 545762=test_gem_commands_signout_command I, [2024-05-10T14:38:20.579703 #504881] INFO -- : [641/885] 545762=test_win32ole_variant_m I, [2024-05-10T14:38:20.630899 #504881] INFO -- : [642/885] 545762=test_pair I, [2024-05-10T14:38:21.975590 #504881] INFO -- : [643/885] 545764=test_history I, [2024-05-10T14:38:22.047253 #504881] INFO -- : [644/885] 545764=test_gem_commands_setup_command I, [2024-05-10T14:38:22.799942 #504881] INFO -- : [645/885] 545764=test_gem_safe_yaml I, [2024-05-10T14:38:22.812009 #504881] INFO -- : [646/885] 545764=test_document I, [2024-05-10T14:38:22.819472 #504881] INFO -- : [647/885] 545764=test_eval I, [2024-05-10T14:38:22.821619 #504881] INFO -- : [648/885] 545764=test_singleton_function I, [2024-05-10T14:38:22.852782 #504881] INFO -- : [649/885] 545764=test_iseq I, [2024-05-10T14:38:23.455355 #504881] INFO -- : [650/885] 545764=test_primitive I, [2024-05-10T14:38:23.461893 #504881] INFO -- : [651/885] 545764=test_rdoc_ri_paths I, [2024-05-10T14:38:23.527956 #504881] INFO -- : [652/885] 545764=test_parser I, [2024-05-10T14:38:23.552876 #504881] INFO -- : [653/885] 545764=test_gem_request_set_lockfile_tokenizer I, [2024-05-10T14:38:23.652612 #504881] INFO -- : [654/885] 545764=test_lazy_enumerator I, [2024-05-10T14:38:24.132716 #504881] INFO -- : [655/885] 545764=test_cgi_multipart I, [2024-05-10T14:38:24.203864 #504881] INFO -- : [656/885] 545764=test_autoconf I, [2024-05-10T14:38:24.211720 #504881] INFO -- : [657/885] 545764=integer_parse_test I, [2024-05-10T14:38:24.223459 #504881] INFO -- : [658/885] 545764=test_arithmetic_sequence I, [2024-05-10T14:38:24.283284 #504881] INFO -- : [659/885] 545764=test_ractor_compatibility I, [2024-05-10T14:38:24.618021 #504881] INFO -- : [660/885] 545764=test_find_executable I, [2024-05-10T14:38:24.624793 #504881] INFO -- : [661/885] 545764=test_ftp I, [2024-05-10T14:38:24.632433 #504881] INFO -- : [662/885] 545764=test_sockopt I, [2024-05-10T14:38:24.641722 #504881] INFO -- : [663/885] 545764=test_gem_source_fetch_problem I, [2024-05-10T14:38:24.667805 #504881] INFO -- : [664/885] 545764=test_rdoc_comment I, [2024-05-10T14:38:24.719380 #504881] INFO -- : [665/885] 545764=test_install I, [2024-05-10T14:38:24.900586 #504881] INFO -- : [666/885] 545764=test_encoding I, [2024-05-10T14:38:25.196403 #504881] INFO -- : [667/885] 545764=test_autoload I, [2024-05-10T14:38:25.988897 #504881] INFO -- : [668/885] 545762=test_gem_package I, [2024-05-10T14:38:26.950341 #504881] INFO -- : [669/885] 545762=test_array I, [2024-05-10T14:38:29.355050 #504881] INFO -- : [670/885] 545764=test_at_exit I, [2024-05-10T14:38:29.418768 #504881] INFO -- : [671/885] 545764=test_benchmark I, [2024-05-10T14:38:30.993319 #504881] INFO -- : [672/885] 545764=test_gem_source I, [2024-05-10T14:38:31.380221 #504881] INFO -- : [673/885] 545764=test_mkmf I, [2024-05-10T14:38:31.504888 #504881] INFO -- : [674/885] 545764=test_have_macro I, [2024-05-10T14:38:31.712262 #504881] INFO -- : [675/885] 545764=test_class I, [2024-05-10T14:38:31.748052 #504881] INFO -- : [676/885] 545764=test_regex_casefold I, [2024-05-10T14:38:32.226151 #504881] INFO -- : [677/885] 545764=test_win32ole_method I, [2024-05-10T14:38:32.236855 #504881] INFO -- : [678/885] 545764=test_lexer I, [2024-05-10T14:38:32.274763 #504881] INFO -- : [679/885] 545764=test_gem_source_git I, [2024-05-10T14:38:33.372059 #504881] INFO -- : [680/885] 545764=test_ripper I, [2024-05-10T14:38:33.699652 #504881] INFO -- : [681/885] 545764=test_thread_cv I, [2024-05-10T14:38:34.049464 #504881] INFO -- : [682/885] 545763=test_stringio I, [2024-05-10T14:38:34.123334 #504881] INFO -- : [683/885] 545763=test_assembler I, [2024-05-10T14:38:34.124859 #504881] INFO -- : [684/885] 545763=test_files_ext I, [2024-05-10T14:38:34.133134 #504881] INFO -- : [685/885] 545763=test_random I, [2024-05-10T14:38:34.163641 #504881] INFO -- : [686/885] 545763=dispatcher_test I, [2024-05-10T14:38:34.174168 #504881] INFO -- : [687/885] 545763=test_eval_history I, [2024-05-10T14:38:34.192684 #504881] INFO -- : [688/885] 545763=test_unicode I, [2024-05-10T14:38:34.205027 #504881] INFO -- : [689/885] 545763=test_trace I, [2024-05-10T14:38:34.219829 #504881] INFO -- : [690/885] 545763=test_gem_path_support I, [2024-05-10T14:38:34.272713 #504881] INFO -- : [691/885] 545763=test_arity I, [2024-05-10T14:38:34.283046 #504881] INFO -- : [692/885] 545763=test_win32ole_type_event I, [2024-05-10T14:38:34.301425 #504881] INFO -- : [693/885] 545763=test_keyword I, [2024-05-10T14:38:34.335403 #504881] INFO -- : [694/885] 545764=test_scalar_scanner I, [2024-05-10T14:38:34.351570 #504881] INFO -- : [695/885] 545764=test_lambda I, [2024-05-10T14:38:34.416900 #504881] INFO -- : [696/885] 545764=test_rb_str_dup I, [2024-05-10T14:38:34.421275 #504881] INFO -- : [697/885] 545764=test_emitter I, [2024-05-10T14:38:34.442911 #504881] INFO -- : [698/885] 545764=test_x509ext I, [2024-05-10T14:38:34.533749 #504881] INFO -- : [699/885] 545764=test_config I, [2024-05-10T14:38:34.828612 #504881] INFO -- : [700/885] 545763=test_file I, [2024-05-10T14:38:34.871657 #504881] INFO -- : [701/885] 545764=test_helper_method I, [2024-05-10T14:38:34.905070 #504881] INFO -- : [702/885] 545764=test_summary I, [2024-05-10T14:38:34.963250 #504881] INFO -- : [703/885] 545764=bom_test I, [2024-05-10T14:38:35.024545 #504881] INFO -- : [704/885] 545764=test_foreach I, [2024-05-10T14:38:35.034325 #504881] INFO -- : [705/885] 545764=test_rdoc_markup_to_html I, [2024-05-10T14:38:35.136834 #504881] INFO -- : [706/885] 545764=test_gem_resolver_installer_set I, [2024-05-10T14:38:35.400277 #504881] INFO -- : [707/885] 545764=test_append I, [2024-05-10T14:38:35.401002 #504881] INFO -- : [708/885] 545764=test_helper I, [2024-05-10T14:38:35.411091 #504881] INFO -- : [709/885] 545764=test_gem_resolver_api_set I, [2024-05-10T14:38:35.498353 #504881] INFO -- : [710/885] 545764=test_duplicate I, [2024-05-10T14:38:35.510405 #504881] INFO -- : [711/885] 545764=test_kill_ring I, [2024-05-10T14:38:35.518193 #504881] INFO -- : [712/885] 545764=test_mailto I, [2024-05-10T14:38:35.525698 #504881] INFO -- : [713/885] 545764=test_addr I, [2024-05-10T14:38:35.536086 #504881] INFO -- : [714/885] 545764=test_object I, [2024-05-10T14:38:35.541185 #504881] INFO -- : [715/885] 545764=test_member I, [2024-05-10T14:38:35.545771 #504881] INFO -- : [716/885] 545764=format_errors_test I, [2024-05-10T14:38:35.552908 #504881] INFO -- : [717/885] 545764=test_cgi_header I, [2024-05-10T14:38:35.558612 #504881] INFO -- : [718/885] 545764=test_case_options I, [2024-05-10T14:38:35.571189 #504881] INFO -- : [719/885] 545764=test_beginendblock I, [2024-05-10T14:38:35.976522 #504881] INFO -- : [720/885] 545764=test_monitor I, [2024-05-10T14:38:36.096338 #504881] INFO -- : [721/885] 545764=test_eval I, [2024-05-10T14:38:36.343814 #504881] INFO -- : [722/885] 545764=test_regexp I, [2024-05-10T14:38:40.342370 #504881] INFO -- : [723/885] 545762=test_whileuntil I, [2024-05-10T14:38:40.349400 #504881] INFO -- : [724/885] 545762=test_nofree I, [2024-05-10T14:38:40.357122 #504881] INFO -- : [725/885] 545762=test_within_pipe I, [2024-05-10T14:38:40.386378 #504881] INFO -- : [726/885] 545762=test_rdoc_normal_class I, [2024-05-10T14:38:40.485571 #504881] INFO -- : [727/885] 545762=test_pointer I, [2024-05-10T14:38:41.075680 #504881] INFO -- : [728/885] 545763=test_bug_reporter I, [2024-05-10T14:38:41.251552 #504881] INFO -- : [729/885] 545763=test_gem_installer I, [2024-05-10T14:38:42.211087 #504881] INFO -- : [730/885] 545762=test_ossl I, [2024-05-10T14:38:46.528026 #504881] INFO -- : [731/885] 545763=test_buffered_io I, [2024-05-10T14:38:46.538554 #504881] INFO -- : [732/885] 545763=compiler_test I, [2024-05-10T14:38:46.540717 #504881] INFO -- : [733/885] 545763=test_arith_seq_extract I, [2024-05-10T14:38:46.550335 #504881] INFO -- : [734/885] 545763=test_ruby_lex I, [2024-05-10T14:38:46.671020 #504881] INFO -- : [735/885] 545763=test_object_references I, [2024-05-10T14:38:46.721761 #504881] INFO -- : [736/885] 545763=test_gem_source_subpath_problem I, [2024-05-10T14:38:46.824427 #504881] INFO -- : [737/885] 545763=test_gem_source_vendor I, [2024-05-10T14:38:46.849025 #504881] INFO -- : [738/885] 545763=test_gem_resolver I, [2024-05-10T14:38:47.243282 #504881] INFO -- : [739/885] 545763=test_dln I, [2024-05-10T14:38:47.257603 #504881] INFO -- : [740/885] 545763=test_object I, [2024-05-10T14:38:47.663219 #504881] INFO -- : [741/885] 545763=test_gem_commands_exec_command I, [2024-05-10T14:38:49.076235 #504881] INFO -- : [742/885] 545763=unescape_test I, [2024-05-10T14:38:50.426252 #504881] INFO -- : [743/885] 545762=test_super I, [2024-05-10T14:38:50.492194 #504881] INFO -- : [744/885] 545763=test_color_printer I, [2024-05-10T14:38:50.508168 #504881] INFO -- : [745/885] 545763=test_gem_available_set I, [2024-05-10T14:38:50.641067 #504881] INFO -- : [746/885] 545763=test_pkg_config I, [2024-05-10T14:38:50.650383 #504881] INFO -- : [747/885] 545763=test_modify_expand I, [2024-05-10T14:38:52.029160 #504881] INFO -- : [748/885] 545763=test_convertible I, [2024-05-10T14:38:52.112917 #504881] INFO -- : [749/885] 545762=errors_test I, [2024-05-10T14:38:52.186538 #504881] INFO -- : [750/885] 545762=test_config I, [2024-05-10T14:38:52.335009 #504881] INFO -- : [751/885] 545762=test_func I, [2024-05-10T14:38:54.345523 #504881] INFO -- : [752/885] 545763=json_encoding_test I, [2024-05-10T14:38:54.349480 #504881] INFO -- : [753/885] 545763=test_vm_dump I, [2024-05-10T14:38:54.660325 #504881] INFO -- : [754/885] 545763=test_allocation I, [2024-05-10T14:38:56.677845 #504881] INFO -- : [755/885] 545763=test_ifunless I, [2024-05-10T14:38:56.693875 #504881] INFO -- : [756/885] 545763=test_gem_console_ui I, [2024-05-10T14:38:56.702443 #504881] INFO -- : [757/885] 545763=test_insns_leaf I, [2024-05-10T14:38:56.912288 #504881] INFO -- : [758/885] 545763=test_readpartial I, [2024-05-10T14:38:57.140716 #504881] INFO -- : [759/885] 545763=test_rdoc_parser_ruby I, [2024-05-10T14:38:57.258186 #504881] INFO -- : [760/885] 545762=test_httpresponse I, [2024-05-10T14:38:57.303044 #504881] INFO -- : [761/885] 545762=test_x509req I, [2024-05-10T14:38:57.329584 #504881] INFO -- : [762/885] 545762=test_pattern_key_name_check I, [2024-05-10T14:38:57.337932 #504881] INFO -- : [763/885] 545762=test_profile_frames I, [2024-05-10T14:38:57.529611 #504881] INFO -- : [764/885] 545762=test_transcode I, [2024-05-10T14:38:57.723968 #504881] INFO -- : [765/885] 545762=test_refinement I, [2024-05-10T14:38:59.182944 #504881] INFO -- : [766/885] 545763=test_debug I, [2024-05-10T14:38:59.228935 #504881] INFO -- : [767/885] 545763=test_gem_commands_cleanup_command I, [2024-05-10T14:38:59.880122 #504881] INFO -- : [768/885] 545763=test_class2name I, [2024-05-10T14:38:59.891953 #504881] INFO -- : [769/885] 545763=test_notimplement I, [2024-05-10T14:38:59.906936 #504881] INFO -- : [770/885] 545763=test_cgi_session I, [2024-05-10T14:39:00.016561 #504881] INFO -- : [771/885] 545763=test_c_union_entity I, [2024-05-10T14:39:00.213852 #504881] INFO -- : [772/885] 545763=test_dns I, [2024-05-10T14:39:00.673940 #504881] INFO -- : [773/885] 545763=test_x509crl I, [2024-05-10T14:39:00.775459 #504881] INFO -- : [774/885] 545763=test_rdoc_markup_heading I, [2024-05-10T14:39:00.784781 #504881] INFO -- : [775/885] 545763=test_flip I, [2024-05-10T14:39:00.881183 #504881] INFO -- : [776/885] 545763=test_io_console I, [2024-05-10T14:39:01.787867 #504881] INFO -- : [777/885] 545762=test_compile_prism I, [2024-05-10T14:39:02.149513 #504881] INFO -- : [778/885] 545762=test_helper I, [2024-05-10T14:39:02.156565 #504881] INFO -- : [779/885] 545762=test_win32ole_event I, [2024-05-10T14:39:02.221652 #504881] INFO -- : [780/885] 545762=test_rdoc_markup_formatter I, [2024-05-10T14:39:02.288517 #504881] INFO -- : [781/885] 545762=test_gem_commands_uninstall_command I, [2024-05-10T14:39:03.087976 #504881] INFO -- : [782/885] 545762=test_gem_ext_cmake_builder I, [2024-05-10T14:39:03.098875 #504881] INFO -- : [783/885] 545762=test_digest_extend I, [2024-05-10T14:39:03.137107 #504881] INFO -- : [784/885] 545762=test_last_thread I, [2024-05-10T14:39:03.488504 #504881] INFO -- : [785/885] 545763=test_thread_fd_close I, [2024-05-10T14:39:03.497746 #504881] INFO -- : [786/885] 545763=test_getopts I, [2024-05-10T14:39:03.530908 #504881] INFO -- : [787/885] 545763=test_fips I, [2024-05-10T14:39:03.773163 #504881] INFO -- : [788/885] 545763=test_alias I, [2024-05-10T14:39:03.907888 #504881] INFO -- : [789/885] 545763=test_emitter I, [2024-05-10T14:39:04.078840 #504881] INFO -- : [790/885] 545763=test_have_func I, [2024-05-10T14:39:04.175084 #504881] INFO -- : [791/885] 545762=test_date_marshal I, [2024-05-10T14:39:04.185559 #504881] INFO -- : [792/885] 545762=test_date_new I, [2024-05-10T14:39:04.206722 #504881] INFO -- : [793/885] 545762=test_gem_commands_list_command I, [2024-05-10T14:39:04.228386 #504881] INFO -- : [794/885] 545762=test_gem_resolver_local_specification I, [2024-05-10T14:39:04.256644 #504881] INFO -- : [795/885] 545762=test_configuration I, [2024-05-10T14:39:04.363356 #504881] INFO -- : [796/885] 545762=test_gem_commands_search_command I, [2024-05-10T14:39:04.391929 #504881] INFO -- : [797/885] 545762=test_symbol I, [2024-05-10T14:39:04.822171 #504881] INFO -- : [798/885] 545764=test_coder I, [2024-05-10T14:39:04.843799 #504881] INFO -- : [799/885] 545764=test_rdoc_servlet I, [2024-05-10T14:39:05.013912 #504881] INFO -- : [800/885] 545764=test_gem_commands_contents_command I, [2024-05-10T14:39:05.113920 #504881] INFO -- : [801/885] 545763=test_udp I, [2024-05-10T14:39:05.124828 #504881] INFO -- : [802/885] 545763=test_context I, [2024-05-10T14:39:05.143477 #504881] INFO -- : [803/885] 545764=test_formatter I, [2024-05-10T14:39:05.154257 #504881] INFO -- : [804/885] 545764=test_integer I, [2024-05-10T14:39:05.225485 #504881] INFO -- : [805/885] 545763=test_unix I, [2024-05-10T14:39:05.292063 #504881] INFO -- : [806/885] 545763=test_rbconfig I, [2024-05-10T14:39:05.303494 #504881] INFO -- : [807/885] 545763=test_num2int I, [2024-05-10T14:39:05.324814 #504881] INFO -- : [808/885] 545763=test_range I, [2024-05-10T14:39:06.138078 #504881] INFO -- : [809/885] 545763=test_gem_commands_signin_command I, [2024-05-10T14:39:06.376950 #504881] INFO -- : [810/885] 545763=test_extlibs I, [2024-05-10T14:39:07.736688 #504881] INFO -- : [811/885] 545764=test_iter_break I, [2024-05-10T14:39:07.747044 #504881] INFO -- : [812/885] 545764=test_rdoc_markup_include I, [2024-05-10T14:39:07.769671 #504881] INFO -- : [813/885] 545764=test_enum I, [2024-05-10T14:39:07.910968 #504881] INFO -- : [814/885] 545763=test_require I, [2024-05-10T14:39:08.775432 #504881] INFO -- : [815/885] 545764=test_recursion I, [2024-05-10T14:39:08.785244 #504881] INFO -- : [816/885] 545764=test_stream I, [2024-05-10T14:39:08.825916 #504881] INFO -- : [817/885] 545764=test_ractor I, [2024-05-10T14:39:08.853358 #504881] INFO -- : [818/885] 545764=test_trick I, [2024-05-10T14:39:09.339927 #504881] INFO -- : [819/885] 545763=test_address_resolve I, [2024-05-10T14:39:09.358532 #504881] INFO -- : [820/885] 545763=test_rdoc_attr I, [2024-05-10T14:39:09.376107 #504881] INFO -- : [821/885] 545763=test_locale I, [2024-05-10T14:39:09.421680 #504881] INFO -- : [822/885] 545763=test_ts I, [2024-05-10T14:39:09.693103 #504881] INFO -- : [823/885] 545763=test_registry I, [2024-05-10T14:39:09.720000 #504881] INFO -- : [824/885] 545763=test_gem I, [2024-05-10T14:39:10.526321 #504881] INFO -- : [825/885] 545762=test_ansi_without_terminfo I, [2024-05-10T14:39:10.544739 #504881] INFO -- : [826/885] 545762=json_generator_test I, [2024-05-10T14:39:10.656233 #504881] INFO -- : [827/885] 545762=test_ractor I, [2024-05-10T14:39:10.666040 #504881] INFO -- : [828/885] 545762=test_parser I, [2024-05-10T14:39:10.684928 #504881] INFO -- : [829/885] 545762=test_rdoc_markup_to_label I, [2024-05-10T14:39:10.805798 #504881] INFO -- : [830/885] 545762=test_gem_resolver_best_set I, [2024-05-10T14:39:10.960436 #504881] INFO -- : [831/885] 545762=test_cgi_core I, [2024-05-10T14:39:10.976674 #504881] INFO -- : [832/885] 545762=test_enc_str_buf_cat I, [2024-05-10T14:39:10.977123 #504881] INFO -- : [833/885] 545762=newline_test I, [2024-05-10T14:39:11.059726 #504881] INFO -- : [834/885] 545762=test_bignum I, [2024-05-10T14:39:11.378910 #504881] INFO -- : [835/885] 545764=test_rdoc_markup_hard_break I, [2024-05-10T14:39:11.388432 #504881] INFO -- : [836/885] 545764=test_nesting_parser I, [2024-05-10T14:39:11.410555 #504881] INFO -- : [837/885] 545764=ractor_test I, [2024-05-10T14:39:11.471284 #504881] INFO -- : [838/885] 545764=test_ancdata I, [2024-05-10T14:39:11.476256 #504881] INFO -- : [839/885] 545764=test_marshal I, [2024-05-10T14:39:12.282071 #504881] INFO -- : [840/885] 545763=test_gem_resolver_conflict I, [2024-05-10T14:39:12.380912 #504881] INFO -- : [841/885] 545763=test_ractor I, [2024-05-10T14:39:12.654401 #504881] INFO -- : [842/885] 545763=test_ssl I, [2024-05-10T14:39:12.742304 #504881] INFO -- : [843/885] 545763=test_scheduler I, [2024-05-10T14:39:12.821513 #504881] INFO -- : [844/885] 545764=test_gem_commands_help_command I, [2024-05-10T14:39:12.895539 #504881] INFO -- : [845/885] 545764=test_data I, [2024-05-10T14:39:12.900762 #504881] INFO -- : [846/885] 545764=test_bug-14834 I, [2024-05-10T14:39:12.914438 #504881] INFO -- : [847/885] 545763=test_terminfo I, [2024-05-10T14:39:12.934237 #504881] INFO -- : [848/885] 545763=test_socket I, [2024-05-10T14:39:12.992447 #504881] INFO -- : [849/885] 545764=test_inlinecache I, [2024-05-10T14:39:13.046128 #504881] INFO -- : [850/885] 545764=test_thread I, [2024-05-10T14:39:13.874473 #504881] INFO -- : [851/885] 545763=test_time_tz I, [2024-05-10T14:39:14.056720 #504881] INFO -- : [852/885] 545763=test_addrinfo I, [2024-05-10T14:39:14.078484 #504881] INFO -- : Leaked file descriptor: TestSocketAddrinfo#test_addrinfo_timeout: 11 # I, [2024-05-10T14:39:14.112993 #504881] INFO -- : COMMAND PID USER FD TYPE DEVICE SIZE/OFF NODE NAME I, [2024-05-10T14:39:14.113052 #504881] INFO -- : ruby 545763 opc 11u unix 0x0000000000000000 0t0 2921425131 type=STREAM I, [2024-05-10T14:39:14.217927 #504881] INFO -- : [853/885] 545763=test_to_ruby I, [2024-05-10T14:39:14.238351 #504881] INFO -- : [854/885] 545763=test_windows_1251 I, [2024-05-10T14:39:14.254514 #504881] INFO -- : [855/885] 545763=test_gem_ext_builder I, [2024-05-10T14:39:14.699720 #504881] INFO -- : [856/885] 545762=test_history I, [2024-05-10T14:39:14.821141 #504881] INFO -- : [857/885] 545762=test_to_ary_concat I, [2024-05-10T14:39:15.315264 #504881] INFO -- : [858/885] 545763=test_reline I, [2024-05-10T14:39:15.462836 #504881] INFO -- : [859/885] 545763=test_gem_commands_build_command I, [2024-05-10T14:39:15.883879 #504881] INFO -- : [860/885] 545763=test_call I, [2024-05-10T14:39:16.081137 #504881] INFO -- : [861/885] 545763=test_ellipsize I, [2024-05-10T14:39:16.144151 #504881] INFO -- : [862/885] 545763=test_project_sanity I, [2024-05-10T14:39:16.154345 #504881] INFO -- : [863/885] 545763=test_symbol I, [2024-05-10T14:39:16.167209 #504881] INFO -- : [864/885] 545763=location_test I, [2024-05-10T14:39:16.218014 #504881] INFO -- : [865/885] 545763=test_chilled I, [2024-05-10T14:39:16.229241 #504881] INFO -- : [866/885] 545763=test_delegate I, [2024-05-10T14:39:16.296863 #504881] INFO -- : [867/885] 545763=test_ensured I, [2024-05-10T14:39:16.307113 #504881] INFO -- : [868/885] 545763=test_rdoc_markup I, [2024-05-10T14:39:16.330297 #504881] INFO -- : [869/885] 545763=test_key_stroke I, [2024-05-10T14:39:16.353142 #504881] INFO -- : [870/885] 545763=test_euc_jp I, [2024-05-10T14:39:16.362182 #504881] INFO -- : [871/885] 545763=test_alias_and_anchor I, [2024-05-10T14:39:16.426791 #504881] INFO -- : [872/885] 545763=test_popen_deadlock I, [2024-05-10T14:39:16.927618 #504881] INFO -- : [873/885] 545763=test_time I, [2024-05-10T14:39:17.085147 #504881] INFO -- : [874/885] 545763=ruby_api_test I, [2024-05-10T14:39:17.242704 #504881] INFO -- : [875/885] 545763=test_gem_resolver_index_set I, [2024-05-10T14:39:18.934201 #504881] INFO -- : [876/885] 545763=test_sleep I, [2024-05-10T14:39:18.948922 #504881] INFO -- : [877/885] 545762=test_webauthn_listener_response I, [2024-05-10T14:39:18.970391 #504881] INFO -- : [878/885] 545762=test_folderitem2_invokeverb I, [2024-05-10T14:39:18.977372 #504881] INFO -- : [879/885] 545762=test_interned_str I, [2024-05-10T14:39:18.984339 #504881] INFO -- : [880/885] 545762=constant_path_node_test I, [2024-05-10T14:39:18.993733 #504881] INFO -- : [881/885] 545762=test_set_len I, [2024-05-10T14:39:19.024604 #504881] INFO -- : [882/885] 545762=test_pattern_matching I, [2024-05-10T14:39:19.426399 #504881] INFO -- : [883/885] 545762=test_gc I, [2024-05-10T14:39:21.877410 #504881] INFO -- : [884/885] 545764=test_gem_request_set I, [2024-05-10T14:39:22.300094 #504881] INFO -- : [885/885] 545763=test_gem_bundler_version_finder I, [2024-05-10T14:39:28.738060 #504881] INFO -- : Finished tests in 198.025510s, 132.9374 tests/s, 47213.3868 assertions/s. E, [2024-05-10T14:39:28.738216 #504881] ERROR -- : Children under /tmp/rubytest.5210pu: E, [2024-05-10T14:39:28.738361 #504881] ERROR -- : * drwx------ 2 6 2024-05-10 14:36:40 +0000 d20240510-545763-r2xpul/ E, [2024-05-10T14:39:28.738519 #504881] ERROR -- : * drwx------ 2 6 2024-05-10 14:36:40 +0000 d20240510-545763-xeouv1/ E, [2024-05-10T14:39:28.738547 #504881] ERROR -- : * drwx------ 2 6 2024-05-10 14:36:40 +0000 d20240510-545763-54h9dk/ E, [2024-05-10T14:39:28.738594 #504881] ERROR -- : * drwx------ 2 6 2024-05-10 14:36:40 +0000 d20240510-545763-tjquxn/ E, [2024-05-10T14:39:28.738633 #504881] ERROR -- : * drwx------ 2 6 2024-05-10 14:36:40 +0000 d20240510-545763-y4suhw/ E, [2024-05-10T14:39:28.738676 #504881] ERROR -- : * drwx------ 4 28 2024-05-10 14:38:16 +0000 gem_rebuild20240510-545764-oqod23/ E, [2024-05-10T14:39:28.738708 #504881] ERROR -- : * drwxrwxr-x 2 40 2024-05-10 14:38:16 +0000 old/ E, [2024-05-10T14:39:28.738738 #504881] ERROR -- : * -rw-rw-r-- 1 4096 2024-05-10 14:38:16 +0000 rebuild_test_gem-1.0.0.gem E, [2024-05-10T14:39:28.738858 #504881] ERROR -- : * drwxrwxr-x 2 40 2024-05-10 14:38:16 +0000 new/ E, [2024-05-10T14:39:28.738872 #504881] ERROR -- : * -rw-rw-r-- 1 4096 2024-05-10 14:38:16 +0000 rebuild_test_gem-1.0.0.gem I, [2024-05-10T14:39:28.744605 #504881] INFO -- : 26325 tests, 9349455 assertions, 0 failures, 0 errors, 320 skips I, [2024-05-10T14:39:28.744630 #504881] INFO -- : I, [2024-05-10T14:39:28.744640 #504881] INFO -- : ruby -v: ruby 3.4.0dev (2024-05-10T13:58:09Z master 2bc309e7f3) [aarch64-linux] I, [2024-05-10T14:39:28.745425 #504881] INFO -- : $$$[end] "make yes-test-all TESTOPTS='--stderr-on-failure' TESTS='-j3'" exit with 0. I, [2024-05-10T14:39:28.745561 #504881] INFO -- : $$$[beg] make yes-test-rubyspec MSPECOPT='--error-output stderr --debug -j' TESTS='-j3' I, [2024-05-10T14:39:28.871040 #504881] INFO -- : BASERUBY = /usr/local/bin/ruby --disable=gems I, [2024-05-10T14:39:28.871113 #504881] INFO -- : CC = gcc I, [2024-05-10T14:39:28.871124 #504881] INFO -- : LD = ld I, [2024-05-10T14:39:28.871133 #504881] INFO -- : LDSHARED = gcc -shared I, [2024-05-10T14:39:28.871145 #504881] INFO -- : CFLAGS = -O3 -fno-fast-math -ggdb3 -Wall -Wextra -Wdeprecated-declarations -Wdiv-by-zero -Wduplicated-cond -Wimplicit-function-declaration -Wimplicit-int -Wpointer-arith -Wwrite-strings -Wold-style-definition -Wimplicit-fallthrough=0 -Wmissing-noreturn -Wno-cast-function-type -Wno-constant-logical-operand -Wno-long-long -Wno-missing-field-initializers -Wno-overlength-strings -Wno-packed-bitfield-compat -Wno-parentheses-equality -Wno-self-assign -Wno-tautological-compare -Wno-unused-parameter -Wno-unused-value -Wsuggest-attribute=format -Wsuggest-attribute=noreturn -Wunused-variable -Wmisleading-indentation -Wundef I, [2024-05-10T14:39:28.871156 #504881] INFO -- : XCFLAGS = -U_FORTIFY_SOURCE -D_FORTIFY_SOURCE=2 -fstack-protector-strong -msign-return-address=all -fno-strict-overflow -fvisibility=hidden -fexcess-precision=standard -DRUBY_EXPORT -fPIE -I. -I.ext/include/aarch64-linux -I/home/opc/ruby/src/master/include -I/home/opc/ruby/src/master -I/home/opc/ruby/src/master/prism -I/home/opc/ruby/src/master/enc/unicode/15.0.0 I, [2024-05-10T14:39:28.871165 #504881] INFO -- : CPPFLAGS = I, [2024-05-10T14:39:28.871173 #504881] INFO -- : DLDFLAGS = -Wl,--compress-debug-sections=zlib -fstack-protector-strong -pie I, [2024-05-10T14:39:28.871183 #504881] INFO -- : SOLIBS = -lz -lrt -lrt -ldl -lcrypt -lm -lpthread I, [2024-05-10T14:39:28.871192 #504881] INFO -- : LANG = en_US.UTF-8 I, [2024-05-10T14:39:28.871200 #504881] INFO -- : LC_ALL = I, [2024-05-10T14:39:28.871208 #504881] INFO -- : LC_CTYPE = I, [2024-05-10T14:39:28.871216 #504881] INFO -- : MFLAGS = I, [2024-05-10T14:39:28.871224 #504881] INFO -- : RUSTC = rustc I, [2024-05-10T14:39:28.871232 #504881] INFO -- : YJIT_RUSTC_ARGS = --crate-name=yjit --crate-type=staticlib --edition=2021 -g -C lto=thin -C opt-level=3 -C overflow-checks=on '--out-dir=/home/opc/ruby/build/master/yjit/target/release/' /home/opc/ruby/src/master/yjit/src/lib.rs I, [2024-05-10T14:39:28.871899 #504881] INFO -- : gcc (GCC) 8.5.0 20210514 (Red Hat 8.5.0-10.1.0.1) I, [2024-05-10T14:39:28.871915 #504881] INFO -- : Copyright (C) 2018 Free Software Foundation, Inc. I, [2024-05-10T14:39:28.871924 #504881] INFO -- : This is free software; see the source for copying conditions. There is NO I, [2024-05-10T14:39:28.871933 #504881] INFO -- : warranty; not even for MERCHANTABILITY or FITNESS FOR A PARTICULAR PURPOSE. I, [2024-05-10T14:39:28.871942 #504881] INFO -- : I, [2024-05-10T14:39:28.874080 #504881] INFO -- : generating enc.mk I, [2024-05-10T14:39:29.109501 #504881] INFO -- : generating encdb.h I, [2024-05-10T14:39:29.146129 #504881] INFO -- : encdb.h unchanged I, [2024-05-10T14:39:29.147273 #504881] INFO -- : making enc I, [2024-05-10T14:39:29.174394 #504881] INFO -- : make[1]: Entering directory '/home/opc/ruby/build/master' I, [2024-05-10T14:39:29.174425 #504881] INFO -- : make[1]: Nothing to be done for 'enc'. I, [2024-05-10T14:39:29.174436 #504881] INFO -- : make[1]: Leaving directory '/home/opc/ruby/build/master' I, [2024-05-10T14:39:29.175195 #504881] INFO -- : making srcs under enc I, [2024-05-10T14:39:29.216800 #504881] INFO -- : make[1]: Entering directory '/home/opc/ruby/build/master' I, [2024-05-10T14:39:29.217042 #504881] INFO -- : make[1]: Nothing to be done for 'srcs'. I, [2024-05-10T14:39:29.217057 #504881] INFO -- : make[1]: Leaving directory '/home/opc/ruby/build/master' I, [2024-05-10T14:39:29.217933 #504881] INFO -- : generating transdb.h I, [2024-05-10T14:39:29.371082 #504881] INFO -- : transdb.h unchanged I, [2024-05-10T14:39:29.372391 #504881] INFO -- : making trans I, [2024-05-10T14:39:29.420525 #504881] INFO -- : make[1]: Entering directory '/home/opc/ruby/build/master' I, [2024-05-10T14:39:29.420602 #504881] INFO -- : make[1]: Nothing to be done for 'trans'. I, [2024-05-10T14:39:29.420619 #504881] INFO -- : make[1]: Leaving directory '/home/opc/ruby/build/master' I, [2024-05-10T14:39:29.421284 #504881] INFO -- : making encs I, [2024-05-10T14:39:29.473320 #504881] INFO -- : make[1]: Entering directory '/home/opc/ruby/build/master' I, [2024-05-10T14:39:29.473386 #504881] INFO -- : make[1]: Nothing to be done for 'encs'. I, [2024-05-10T14:39:29.473397 #504881] INFO -- : make[1]: Leaving directory '/home/opc/ruby/build/master' I, [2024-05-10T14:39:29.475520 #504881] INFO -- : generating makefiles ext/configure-ext.mk I, [2024-05-10T14:39:29.515085 #504881] INFO -- : ext/configure-ext.mk updated I, [2024-05-10T14:39:29.518680 #504881] INFO -- : make[1]: Entering directory '/home/opc/ruby/build/master' I, [2024-05-10T14:39:31.559742 #504881] INFO -- : make[1]: Leaving directory '/home/opc/ruby/build/master' I, [2024-05-10T14:39:31.560485 #504881] INFO -- : generating makefile exts.mk I, [2024-05-10T14:39:31.618827 #504881] INFO -- : exts.mk unchanged I, [2024-05-10T14:39:31.623707 #504881] INFO -- : make[1]: Entering directory '/home/opc/ruby/build/master' I, [2024-05-10T14:39:31.920967 #504881] INFO -- : make[2]: Entering directory '/home/opc/ruby/build/master/ext/coverage' I, [2024-05-10T14:39:31.925620 #504881] INFO -- : make[2]: Leaving directory '/home/opc/ruby/build/master/ext/coverage' I, [2024-05-10T14:39:31.931194 #504881] INFO -- : make[2]: Entering directory '/home/opc/ruby/build/master/ext/date' I, [2024-05-10T14:39:31.936460 #504881] INFO -- : make[2]: Leaving directory '/home/opc/ruby/build/master/ext/date' I, [2024-05-10T14:39:31.939775 #504881] INFO -- : make[2]: Entering directory '/home/opc/ruby/build/master/ext/digest' I, [2024-05-10T14:39:31.948464 #504881] INFO -- : make[2]: Leaving directory '/home/opc/ruby/build/master/ext/digest' I, [2024-05-10T14:39:31.971000 #504881] INFO -- : make[2]: Entering directory '/home/opc/ruby/build/master/ext/digest/sha2' I, [2024-05-10T14:39:31.975868 #504881] INFO -- : make[2]: Leaving directory '/home/opc/ruby/build/master/ext/digest/sha2' I, [2024-05-10T14:39:31.993885 #504881] INFO -- : make[2]: Entering directory '/home/opc/ruby/build/master/ext/fiddle' I, [2024-05-10T14:39:32.003983 #504881] INFO -- : make[2]: Leaving directory '/home/opc/ruby/build/master/ext/fiddle' I, [2024-05-10T14:39:32.008127 #504881] INFO -- : make[2]: Entering directory '/home/opc/ruby/build/master/ext/io/console' I, [2024-05-10T14:39:32.012337 #504881] INFO -- : make[2]: Leaving directory '/home/opc/ruby/build/master/ext/io/console' I, [2024-05-10T14:39:32.022888 #504881] INFO -- : make[2]: Entering directory '/home/opc/ruby/build/master/ext/json' I, [2024-05-10T14:39:32.032192 #504881] INFO -- : make[2]: Leaving directory '/home/opc/ruby/build/master/ext/json' I, [2024-05-10T14:39:32.044997 #504881] INFO -- : make[2]: Entering directory '/home/opc/ruby/build/master/ext/monitor' I, [2024-05-10T14:39:32.049163 #504881] INFO -- : make[2]: Leaving directory '/home/opc/ruby/build/master/ext/monitor' I, [2024-05-10T14:39:32.055133 #504881] INFO -- : make[2]: Entering directory '/home/opc/ruby/build/master/ext/objspace' I, [2024-05-10T14:39:32.061038 #504881] INFO -- : make[2]: Leaving directory '/home/opc/ruby/build/master/ext/objspace' I, [2024-05-10T14:39:32.079814 #504881] INFO -- : make[2]: Entering directory '/home/opc/ruby/build/master/ext/openssl' I, [2024-05-10T14:39:32.101276 #504881] INFO -- : make[2]: Leaving directory '/home/opc/ruby/build/master/ext/openssl' I, [2024-05-10T14:39:32.105451 #504881] INFO -- : make[2]: Entering directory '/home/opc/ruby/build/master/ext/pathname' I, [2024-05-10T14:39:32.109710 #504881] INFO -- : make[2]: Leaving directory '/home/opc/ruby/build/master/ext/pathname' I, [2024-05-10T14:39:32.115945 #504881] INFO -- : make[2]: Entering directory '/home/opc/ruby/build/master/ext/psych' I, [2024-05-10T14:39:32.137070 #504881] INFO -- : make[2]: Leaving directory '/home/opc/ruby/build/master/ext/psych' I, [2024-05-10T14:39:32.141476 #504881] INFO -- : make[2]: Entering directory '/home/opc/ruby/build/master/ext/pty' I, [2024-05-10T14:39:32.145644 #504881] INFO -- : make[2]: Leaving directory '/home/opc/ruby/build/master/ext/pty' I, [2024-05-10T14:39:32.158918 #504881] INFO -- : make[2]: Entering directory '/home/opc/ruby/build/master/ext/ripper' I, [2024-05-10T14:39:32.166527 #504881] INFO -- : make[2]: Leaving directory '/home/opc/ruby/build/master/ext/ripper' I, [2024-05-10T14:39:32.168389 #504881] INFO -- : make[2]: Entering directory '/home/opc/ruby/build/master/ext/rubyvm' I, [2024-05-10T14:39:32.171748 #504881] INFO -- : make[2]: Leaving directory '/home/opc/ruby/build/master/ext/rubyvm' I, [2024-05-10T14:39:32.183685 #504881] INFO -- : make[2]: Entering directory '/home/opc/ruby/build/master/ext/socket' I, [2024-05-10T14:39:32.194274 #504881] INFO -- : make[2]: Leaving directory '/home/opc/ruby/build/master/ext/socket' I, [2024-05-10T14:39:32.210355 #504881] INFO -- : make[2]: Entering directory '/home/opc/ruby/build/master/.bundle/gems/bigdecimal-3.1.7/ext/bigdecimal' I, [2024-05-10T14:39:32.240385 #504881] INFO -- : make[2]: Leaving directory '/home/opc/ruby/build/master/.bundle/gems/bigdecimal-3.1.7/ext/bigdecimal' I, [2024-05-10T14:39:32.242999 #504881] INFO -- : make[2]: Entering directory '/home/opc/ruby/build/master/.bundle/gems/bigdecimal-3.1.8/ext/bigdecimal' I, [2024-05-10T14:39:32.272755 #504881] INFO -- : make[2]: Leaving directory '/home/opc/ruby/build/master/.bundle/gems/bigdecimal-3.1.8/ext/bigdecimal' I, [2024-05-10T14:39:32.275324 #504881] INFO -- : make[2]: Entering directory '/home/opc/ruby/build/master/.bundle/gems/debug-1.9.2/ext/debug' I, [2024-05-10T14:39:32.305938 #504881] INFO -- : make[2]: Leaving directory '/home/opc/ruby/build/master/.bundle/gems/debug-1.9.2/ext/debug' I, [2024-05-10T14:39:32.308519 #504881] INFO -- : make[2]: Entering directory '/home/opc/ruby/build/master/.bundle/gems/nkf-0.2.0/ext/nkf' I, [2024-05-10T14:39:32.338677 #504881] INFO -- : make[2]: Leaving directory '/home/opc/ruby/build/master/.bundle/gems/nkf-0.2.0/ext/nkf' I, [2024-05-10T14:39:32.341226 #504881] INFO -- : make[2]: Entering directory '/home/opc/ruby/build/master/.bundle/gems/racc-1.7.3/ext/racc/cparse' I, [2024-05-10T14:39:32.371665 #504881] INFO -- : make[2]: Leaving directory '/home/opc/ruby/build/master/.bundle/gems/racc-1.7.3/ext/racc/cparse' I, [2024-05-10T14:39:32.374736 #504881] INFO -- : make[2]: Entering directory '/home/opc/ruby/build/master/.bundle/gems/rbs-3.4.4/ext/rbs_extension' I, [2024-05-10T14:39:32.405229 #504881] INFO -- : make[2]: Leaving directory '/home/opc/ruby/build/master/.bundle/gems/rbs-3.4.4/ext/rbs_extension' I, [2024-05-10T14:39:32.407801 #504881] INFO -- : make[2]: Entering directory '/home/opc/ruby/build/master/.bundle/gems/syslog-0.1.2/ext/syslog' I, [2024-05-10T14:39:32.438073 #504881] INFO -- : make[2]: Leaving directory '/home/opc/ruby/build/master/.bundle/gems/syslog-0.1.2/ext/syslog' I, [2024-05-10T14:39:32.476049 #504881] INFO -- : make[2]: Entering directory '/home/opc/ruby/build/master' I, [2024-05-10T14:39:32.560325 #504881] INFO -- : make[2]: 'ruby' is up to date. I, [2024-05-10T14:39:32.560415 #504881] INFO -- : make[2]: Leaving directory '/home/opc/ruby/build/master' I, [2024-05-10T14:39:32.560517 #504881] INFO -- : make[1]: Leaving directory '/home/opc/ruby/build/master' I, [2024-05-10T14:39:32.564911 #504881] INFO -- : make[1]: Entering directory '/home/opc/ruby/build/master' I, [2024-05-10T14:39:32.564956 #504881] INFO -- : make[1]: Nothing to be done for 'note'. I, [2024-05-10T14:39:32.564968 #504881] INFO -- : make[1]: Leaving directory '/home/opc/ruby/build/master' E, [2024-05-10T14:39:32.640027 #504881] ERROR -- : $ /home/opc/ruby/build/master/miniruby -I/home/opc/ruby/src/master/lib /home/opc/ruby/src/master/tool/runruby.rb --archdir=/home/opc/ruby/build/master --extout=.ext -- /home/opc/ruby/src/master/spec/mspec/bin/mspec-run -B /home/opc/ruby/src/master/spec/default.mspec --error-output stderr --debug -fy -o /tmp/rubytest.b164tz/1-mspec-multi-0 E, [2024-05-10T14:39:32.640407 #504881] ERROR -- : $ /home/opc/ruby/build/master/miniruby -I/home/opc/ruby/src/master/lib /home/opc/ruby/src/master/tool/runruby.rb --archdir=/home/opc/ruby/build/master --extout=.ext -- /home/opc/ruby/src/master/spec/mspec/bin/mspec-run -B /home/opc/ruby/src/master/spec/default.mspec --error-output stderr --debug -fy -o /tmp/rubytest.b164tz/2-mspec-multi-1 E, [2024-05-10T14:39:32.640719 #504881] ERROR -- : $ /home/opc/ruby/build/master/miniruby -I/home/opc/ruby/src/master/lib /home/opc/ruby/src/master/tool/runruby.rb --archdir=/home/opc/ruby/build/master --extout=.ext -- /home/opc/ruby/src/master/spec/mspec/bin/mspec-run -B /home/opc/ruby/src/master/spec/default.mspec --error-output stderr --debug -fy -o /tmp/rubytest.b164tz/3-mspec-multi-2 I, [2024-05-10T14:39:32.768931 #504881] INFO -- : ruby 3.4.0dev (2024-05-10T13:58:09Z master 2bc309e7f3) [aarch64-linux] I, [2024-05-10T14:39:38.067990 #504881] INFO -- : 0 ......................................................................... I, [2024-05-10T14:39:40.472455 #504881] INFO -- : 73 ......................................................................... I, [2024-05-10T14:39:40.667832 #504881] INFO -- : 146 ......................................................................... I, [2024-05-10T14:39:40.959431 #504881] INFO -- : 219 ......................................................................... I, [2024-05-10T14:39:41.123555 #504881] INFO -- : 292 ......................................................................... I, [2024-05-10T14:39:41.363922 #504881] INFO -- : 365 ......................................................................... I, [2024-05-10T14:39:41.484543 #504881] INFO -- : 438 ......................................................................... I, [2024-05-10T14:39:41.543993 #504881] INFO -- : 511 ......................................................................... I, [2024-05-10T14:39:41.605443 #504881] INFO -- : 584 ......................................................................... I, [2024-05-10T14:39:42.212175 #504881] INFO -- : 657 ......................................................................... I, [2024-05-10T14:39:42.313619 #504881] INFO -- : 730 ......................................................................... I, [2024-05-10T14:39:42.360715 #504881] INFO -- : 803 ......................................................................... I, [2024-05-10T14:39:42.562609 #504881] INFO -- : 876 ......................................................................... I, [2024-05-10T14:39:42.668465 #504881] INFO -- : 949 ......................................................................... I, [2024-05-10T14:39:43.302946 #504881] INFO -- : 1022 ......................................................................... I, [2024-05-10T14:39:45.598209 #504881] INFO -- : 1095 ......................................................................... I, [2024-05-10T14:39:46.456625 #504881] INFO -- : 1168 ......................................................................... I, [2024-05-10T14:39:46.607673 #504881] INFO -- : 1241 ......................................................................... I, [2024-05-10T14:39:46.785987 #504881] INFO -- : 1314 ......................................................................... I, [2024-05-10T14:39:46.876550 #504881] INFO -- : 1387 ......................................................................... I, [2024-05-10T14:39:48.934262 #504881] INFO -- : 1460 ......................................................................... I, [2024-05-10T14:39:52.300383 #504881] INFO -- : 1533 ......................................................................... I, [2024-05-10T14:39:52.449081 #504881] INFO -- : 1606 ......................................................................... I, [2024-05-10T14:39:53.263237 #504881] INFO -- : 1679 ......................................................................... I, [2024-05-10T14:39:53.491112 #504881] INFO -- : 1752 ......................................................................... I, [2024-05-10T14:39:53.750175 #504881] INFO -- : 1825 ......................................................................... I, [2024-05-10T14:39:54.071585 #504881] INFO -- : 1898 ......................................................................... I, [2024-05-10T14:39:54.483758 #504881] INFO -- : 1971 ......................................................................... I, [2024-05-10T14:39:54.996736 #504881] INFO -- : 2044 ......................................................................... I, [2024-05-10T14:39:55.075417 #504881] INFO -- : 2117 ......................................................................... I, [2024-05-10T14:39:55.135073 #504881] INFO -- : 2190 ......................................................................... I, [2024-05-10T14:39:55.183085 #504881] INFO -- : 2263 ......................................................................... I, [2024-05-10T14:39:55.229112 #504881] INFO -- : 2336 ......................................................................... I, [2024-05-10T14:39:55.321390 #504881] INFO -- : 2409 ......................................................................... I, [2024-05-10T14:39:55.585166 #504881] INFO -- : 2482 ......................................................................... I, [2024-05-10T14:39:55.697950 #504881] INFO -- : 2555 ......................................................................... I, [2024-05-10T14:39:56.990556 #504881] INFO -- : 2628 ......................................................................... I, [2024-05-10T14:39:57.156742 #504881] INFO -- : 2701 ......................................................................... I, [2024-05-10T14:39:57.305605 #504881] INFO -- : 2774 ......................................................................... I, [2024-05-10T14:39:57.627661 #504881] INFO -- : 2847 ......................................................................... I, [2024-05-10T14:39:57.895052 #504881] INFO -- : 2920 ......................................................................... I, [2024-05-10T14:39:57.998844 #504881] INFO -- : 2993 ......................................................................... I, [2024-05-10T14:39:58.070779 #504881] INFO -- : 3066 ......................................................................... I, [2024-05-10T14:39:58.121955 #504881] INFO -- : 3139 ......................................................................... I, [2024-05-10T14:39:58.185568 #504881] INFO -- : 3212 ......................................................................... I, [2024-05-10T14:39:58.260445 #504881] INFO -- : 3285 ......................................................................... I, [2024-05-10T14:40:02.097447 #504881] INFO -- : 3358 ........................................................................ I, [2024-05-10T14:40:02.097518 #504881] INFO -- : I, [2024-05-10T14:40:02.097529 #504881] INFO -- : Finished in 29.457211 seconds I, [2024-05-10T14:40:02.097538 #504881] INFO -- : I, [2024-05-10T14:40:02.097547 #504881] INFO -- : 3429 files, 32607 examples, 195614 expectations, 0 failures, 0 errors, 0 tagged I, [2024-05-10T14:40:02.098855 #504881] INFO -- : $$$[end] "make yes-test-rubyspec MSPECOPT='--error-output stderr --debug -j' TESTS='-j3'" exit with 0.