# Logfile created on 2024-05-09 12:55:02 +0000 by logger.rb/v1.5.3 I, [2024-05-09T12:55:02.863395 #3782525] INFO -- : #, @formatter=nil, @logdev=#, @binmode=false, @mon_data=#, @mon_data_owner_object_id=860>>> I, [2024-05-09T12:55:02.863723 #3782525] INFO -- : $$$[beg] make update-unicode -j3 I, [2024-05-09T12:55:02.952764 #3782525] INFO -- : Downloading Unicode emoji 15.0 files... I, [2024-05-09T12:55:02.952974 #3782525] INFO -- : Downloading Unicode emoji 15.0 files... I, [2024-05-09T12:55:02.953256 #3782525] INFO -- : Downloading Unicode emoji 15.0 files... I, [2024-05-09T12:55:03.029702 #3782525] INFO -- : made symlink emoji/15.0/emoji-sequences.txt to /home/opc/ruby/src/master/.downloaded-cache/emoji/15.0/emoji-sequences.txt I, [2024-05-09T12:55:03.031191 #3782525] INFO -- : downloading emoji/15.0/emoji-test.txt ... /home/opc/ruby/src/master/enc/unicode/data/emoji/15.0/emoji-sequences.txt already exists I, [2024-05-09T12:55:03.036081 #3782525] INFO -- : downloading emoji/15.0/emoji-test.txt ... /home/opc/ruby/src/master/enc/unicode/data/emoji/15.0/emoji-sequences.txt already exists E, [2024-05-09T12:55:03.507572 #3782525] ERROR -- : /home/opc/ruby/src/master/tool/downloader.rb:302:in `rescue in download': failed to download emoji/15.0/emoji-test.txt (RuntimeError) E, [2024-05-09T12:55:03.507638 #3782525] ERROR -- : OpenURI::HTTPError: 403 Forbidden: https://www.unicode.org/Public/emoji/15.0/emoji-test.txt E, [2024-05-09T12:55:03.507650 #3782525] ERROR -- : from /home/opc/ruby/src/master/tool/downloader.rb:201:in `download' E, [2024-05-09T12:55:03.507660 #3782525] ERROR -- : from /home/opc/ruby/src/master/tool/downloader.rb:136:in `download' E, [2024-05-09T12:55:03.507669 #3782525] ERROR -- : from /home/opc/ruby/src/master/tool/downloader.rb:482:in `block in
' E, [2024-05-09T12:55:03.507678 #3782525] ERROR -- : from /home/opc/ruby/src/master/tool/downloader.rb:465:in `each' E, [2024-05-09T12:55:03.507687 #3782525] ERROR -- : from /home/opc/ruby/src/master/tool/downloader.rb:465:in `
' E, [2024-05-09T12:55:03.507695 #3782525] ERROR -- : /usr/local/lib/ruby/3.2.0/open-uri.rb:369:in `open_http': 403 Forbidden (OpenURI::HTTPError) E, [2024-05-09T12:55:03.507704 #3782525] ERROR -- : from /usr/local/lib/ruby/3.2.0/open-uri.rb:760:in `buffer_open' E, [2024-05-09T12:55:03.507713 #3782525] ERROR -- : from /usr/local/lib/ruby/3.2.0/open-uri.rb:214:in `block in open_loop' E, [2024-05-09T12:55:03.507722 #3782525] ERROR -- : from /usr/local/lib/ruby/3.2.0/open-uri.rb:212:in `catch' E, [2024-05-09T12:55:03.507730 #3782525] ERROR -- : from /usr/local/lib/ruby/3.2.0/open-uri.rb:212:in `open_loop' E, [2024-05-09T12:55:03.507739 #3782525] ERROR -- : from /usr/local/lib/ruby/3.2.0/open-uri.rb:153:in `open_uri' E, [2024-05-09T12:55:03.507747 #3782525] ERROR -- : from /usr/local/lib/ruby/3.2.0/open-uri.rb:740:in `open' E, [2024-05-09T12:55:03.507760 #3782525] ERROR -- : from /usr/local/lib/ruby/3.2.0/open-uri.rb:748:in `read' E, [2024-05-09T12:55:03.507768 #3782525] ERROR -- : from /home/opc/ruby/src/master/tool/downloader.rb:247:in `block in download' E, [2024-05-09T12:55:03.507777 #3782525] ERROR -- : from /home/opc/ruby/src/master/tool/downloader.rb:378:in `with_retry' E, [2024-05-09T12:55:03.507785 #3782525] ERROR -- : from /home/opc/ruby/src/master/tool/downloader.rb:246:in `download' E, [2024-05-09T12:55:03.507794 #3782525] ERROR -- : from /home/opc/ruby/src/master/tool/downloader.rb:136:in `download' E, [2024-05-09T12:55:03.507802 #3782525] ERROR -- : from /home/opc/ruby/src/master/tool/downloader.rb:482:in `block in
' E, [2024-05-09T12:55:03.507811 #3782525] ERROR -- : from /home/opc/ruby/src/master/tool/downloader.rb:465:in `each' E, [2024-05-09T12:55:03.507819 #3782525] ERROR -- : from /home/opc/ruby/src/master/tool/downloader.rb:465:in `
' E, [2024-05-09T12:55:03.507926 #3782525] ERROR -- : /home/opc/ruby/src/master/tool/downloader.rb:302:in `rescue in download': failed to download emoji/15.0/emoji-test.txt (RuntimeError) E, [2024-05-09T12:55:03.507943 #3782525] ERROR -- : OpenURI::HTTPError: 403 Forbidden: https://www.unicode.org/Public/emoji/15.0/emoji-test.txt E, [2024-05-09T12:55:03.507953 #3782525] ERROR -- : from /home/opc/ruby/src/master/tool/downloader.rb:201:in `download' E, [2024-05-09T12:55:03.507962 #3782525] ERROR -- : from /home/opc/ruby/src/master/tool/downloader.rb:136:in `download' E, [2024-05-09T12:55:03.507971 #3782525] ERROR -- : from /home/opc/ruby/src/master/tool/downloader.rb:482:in `block in
' E, [2024-05-09T12:55:03.507980 #3782525] ERROR -- : from /home/opc/ruby/src/master/tool/downloader.rb:465:in `each' E, [2024-05-09T12:55:03.507988 #3782525] ERROR -- : from /home/opc/ruby/src/master/tool/downloader.rb:465:in `
' E, [2024-05-09T12:55:03.507996 #3782525] ERROR -- : /usr/local/lib/ruby/3.2.0/open-uri.rb:369:in `open_http': 403 Forbidden (OpenURI::HTTPError) E, [2024-05-09T12:55:03.508005 #3782525] ERROR -- : from /usr/local/lib/ruby/3.2.0/open-uri.rb:760:in `buffer_open' E, [2024-05-09T12:55:03.508013 #3782525] ERROR -- : from /usr/local/lib/ruby/3.2.0/open-uri.rb:214:in `block in open_loop' E, [2024-05-09T12:55:03.508022 #3782525] ERROR -- : from /usr/local/lib/ruby/3.2.0/open-uri.rb:212:in `catch' E, [2024-05-09T12:55:03.508030 #3782525] ERROR -- : from /usr/local/lib/ruby/3.2.0/open-uri.rb:212:in `open_loop' E, [2024-05-09T12:55:03.508038 #3782525] ERROR -- : from /usr/local/lib/ruby/3.2.0/open-uri.rb:153:in `open_uri' E, [2024-05-09T12:55:03.508046 #3782525] ERROR -- : from /usr/local/lib/ruby/3.2.0/open-uri.rb:740:in `open' E, [2024-05-09T12:55:03.508055 #3782525] ERROR -- : from /usr/local/lib/ruby/3.2.0/open-uri.rb:748:in `read' E, [2024-05-09T12:55:03.508063 #3782525] ERROR -- : from /home/opc/ruby/src/master/tool/downloader.rb:247:in `block in download' E, [2024-05-09T12:55:03.508072 #3782525] ERROR -- : from /home/opc/ruby/src/master/tool/downloader.rb:378:in `with_retry' E, [2024-05-09T12:55:03.508081 #3782525] ERROR -- : from /home/opc/ruby/src/master/tool/downloader.rb:246:in `download' E, [2024-05-09T12:55:03.508090 #3782525] ERROR -- : from /home/opc/ruby/src/master/tool/downloader.rb:136:in `download' E, [2024-05-09T12:55:03.508098 #3782525] ERROR -- : from /home/opc/ruby/src/master/tool/downloader.rb:482:in `block in
' E, [2024-05-09T12:55:03.508107 #3782525] ERROR -- : from /home/opc/ruby/src/master/tool/downloader.rb:465:in `each' E, [2024-05-09T12:55:03.508115 #3782525] ERROR -- : from /home/opc/ruby/src/master/tool/downloader.rb:465:in `
' E, [2024-05-09T12:55:03.510659 #3782525] ERROR -- : make: *** [uncommon.mk:1765: /home/opc/ruby/src/master/enc/unicode/data/emoji/15.0/emoji-test.txt] Error 1 E, [2024-05-09T12:55:03.510698 #3782525] ERROR -- : make: *** Waiting for unfinished jobs.... E, [2024-05-09T12:55:03.510935 #3782525] ERROR -- : make: *** [uncommon.mk:1765: /home/opc/ruby/src/master/enc/unicode/data/emoji/15.0/emoji-zwj-sequences.txt] Error 1 E, [2024-05-09T12:55:03.550158 #3782525] ERROR -- : /home/opc/ruby/src/master/tool/downloader.rb:302:in `rescue in download': failed to download emoji/15.0/emoji-test.txt (RuntimeError) E, [2024-05-09T12:55:03.550226 #3782525] ERROR -- : OpenURI::HTTPError: 403 Forbidden: https://www.unicode.org/Public/emoji/15.0/emoji-test.txt E, [2024-05-09T12:55:03.550238 #3782525] ERROR -- : from /home/opc/ruby/src/master/tool/downloader.rb:201:in `download' E, [2024-05-09T12:55:03.550248 #3782525] ERROR -- : from /home/opc/ruby/src/master/tool/downloader.rb:136:in `download' E, [2024-05-09T12:55:03.550256 #3782525] ERROR -- : from /home/opc/ruby/src/master/tool/downloader.rb:482:in `block in
' E, [2024-05-09T12:55:03.550265 #3782525] ERROR -- : from /home/opc/ruby/src/master/tool/downloader.rb:465:in `each' E, [2024-05-09T12:55:03.550274 #3782525] ERROR -- : from /home/opc/ruby/src/master/tool/downloader.rb:465:in `
' E, [2024-05-09T12:55:03.550283 #3782525] ERROR -- : /usr/local/lib/ruby/3.2.0/open-uri.rb:369:in `open_http': 403 Forbidden (OpenURI::HTTPError) E, [2024-05-09T12:55:03.550292 #3782525] ERROR -- : from /usr/local/lib/ruby/3.2.0/open-uri.rb:760:in `buffer_open' E, [2024-05-09T12:55:03.550300 #3782525] ERROR -- : from /usr/local/lib/ruby/3.2.0/open-uri.rb:214:in `block in open_loop' E, [2024-05-09T12:55:03.550309 #3782525] ERROR -- : from /usr/local/lib/ruby/3.2.0/open-uri.rb:212:in `catch' E, [2024-05-09T12:55:03.550318 #3782525] ERROR -- : from /usr/local/lib/ruby/3.2.0/open-uri.rb:212:in `open_loop' E, [2024-05-09T12:55:03.550326 #3782525] ERROR -- : from /usr/local/lib/ruby/3.2.0/open-uri.rb:153:in `open_uri' E, [2024-05-09T12:55:03.550335 #3782525] ERROR -- : from /usr/local/lib/ruby/3.2.0/open-uri.rb:740:in `open' E, [2024-05-09T12:55:03.550344 #3782525] ERROR -- : from /usr/local/lib/ruby/3.2.0/open-uri.rb:748:in `read' E, [2024-05-09T12:55:03.550352 #3782525] ERROR -- : from /home/opc/ruby/src/master/tool/downloader.rb:247:in `block in download' E, [2024-05-09T12:55:03.550361 #3782525] ERROR -- : from /home/opc/ruby/src/master/tool/downloader.rb:378:in `with_retry' E, [2024-05-09T12:55:03.550370 #3782525] ERROR -- : from /home/opc/ruby/src/master/tool/downloader.rb:246:in `download' E, [2024-05-09T12:55:03.550378 #3782525] ERROR -- : from /home/opc/ruby/src/master/tool/downloader.rb:136:in `download' E, [2024-05-09T12:55:03.550387 #3782525] ERROR -- : from /home/opc/ruby/src/master/tool/downloader.rb:482:in `block in
' E, [2024-05-09T12:55:03.550396 #3782525] ERROR -- : from /home/opc/ruby/src/master/tool/downloader.rb:465:in `each' E, [2024-05-09T12:55:03.550404 #3782525] ERROR -- : from /home/opc/ruby/src/master/tool/downloader.rb:465:in `
' E, [2024-05-09T12:55:03.553653 #3782525] ERROR -- : make: *** [uncommon.mk:1765: /home/opc/ruby/src/master/enc/unicode/data/emoji/15.0/emoji-sequences.txt] Error 1 E, [2024-05-09T12:55:03.553698 #3782525] ERROR -- : make: *** Deleting file '/home/opc/ruby/src/master/enc/unicode/data/emoji/15.0/emoji-sequences.txt' I, [2024-05-09T12:55:03.553743 #3782525] INFO -- : downloading emoji/15.0/emoji-test.txt ... I, [2024-05-09T12:55:03.554004 #3782525] INFO -- : $$$[end] "make update-unicode -j3" exit with 512. I, [2024-05-09T12:55:03.554047 #3782525] INFO -- : $$$[beg] make update-download -j3 I, [2024-05-09T12:55:03.725596 #3782525] INFO -- : tool/config.guess already exists I, [2024-05-09T12:55:03.725667 #3782525] INFO -- : tool/config.sub already exists I, [2024-05-09T12:55:03.728514 #3782525] INFO -- : Update minitest to ea9caafc0754b1d6236a490d59e624b53209734a I, [2024-05-09T12:55:03.728763 #3782525] INFO -- : Update power_assert to 84e85124c5014a139af39161d484156cfe87a9ed I, [2024-05-09T12:55:03.728875 #3782525] INFO -- : Update rbs to ba7872795d5de04adb8ff500c0e6afdc81a041dd I, [2024-05-09T12:55:03.732265 #3782525] INFO -- : echo ea9caafc0754b1d6236a490d59e624b53209734a | /bin/sh /home/opc/ruby/src/master/tool/ifchange /home/opc/ruby/src/master/.bundle/.timestamp/minitest.revision - I, [2024-05-09T12:55:03.732468 #3782525] INFO -- : echo 84e85124c5014a139af39161d484156cfe87a9ed | /bin/sh /home/opc/ruby/src/master/tool/ifchange /home/opc/ruby/src/master/.bundle/.timestamp/power_assert.revision - I, [2024-05-09T12:55:03.732636 #3782525] INFO -- : echo ba7872795d5de04adb8ff500c0e6afdc81a041dd | /bin/sh /home/opc/ruby/src/master/tool/ifchange /home/opc/ruby/src/master/.bundle/.timestamp/rbs.revision - I, [2024-05-09T12:55:03.739856 #3782525] INFO -- : /home/opc/ruby/src/master/.bundle/.timestamp/power_assert.revision unchanged I, [2024-05-09T12:55:03.739912 #3782525] INFO -- : /home/opc/ruby/src/master/.bundle/.timestamp/minitest.revision unchanged I, [2024-05-09T12:55:03.740890 #3782525] INFO -- : /home/opc/ruby/src/master/.bundle/.timestamp/rbs.revision unchanged I, [2024-05-09T12:55:03.742386 #3782525] INFO -- : Update typeprof to b19a6416da3a05d57fadd6ffdadb382b6d236ca5 I, [2024-05-09T12:55:03.746170 #3782525] INFO -- : echo b19a6416da3a05d57fadd6ffdadb382b6d236ca5 | /bin/sh /home/opc/ruby/src/master/tool/ifchange /home/opc/ruby/src/master/.bundle/.timestamp/typeprof.revision - I, [2024-05-09T12:55:03.753616 #3782525] INFO -- : /home/opc/ruby/src/master/.bundle/.timestamp/typeprof.revision unchanged I, [2024-05-09T12:55:03.829590 #3782525] INFO -- : Building power_assert@84e85124c5014a139af39161d484156cfe87a9ed to /home/opc/ruby/src/master/gems/power_assert-2.0.3.gem I, [2024-05-09T12:55:03.939067 #3782525] INFO -- : Successfully built RubyGem I, [2024-05-09T12:55:03.939123 #3782525] INFO -- : Name: power_assert I, [2024-05-09T12:55:03.939135 #3782525] INFO -- : Version: 2.0.4dev I, [2024-05-09T12:55:03.939145 #3782525] INFO -- : File: power_assert-2.0.4dev.gem I, [2024-05-09T12:55:04.020804 #3782525] INFO -- : $$$[end] "make update-download -j3" exit with 0. I, [2024-05-09T12:55:04.020894 #3782525] INFO -- : $$$[beg] make update-rubyspec -j3 I, [2024-05-09T12:55:04.110301 #3782525] INFO -- : make: Nothing to be done for 'update-rubyspec'. I, [2024-05-09T12:55:04.110429 #3782525] INFO -- : $$$[end] "make update-rubyspec -j3" exit with 0. I, [2024-05-09T12:55:04.110473 #3782525] INFO -- : $$$[beg] make update-src -j3 I, [2024-05-09T12:55:05.111917 #3782525] INFO -- : Already up to date. I, [2024-05-09T12:55:05.127050 #3782525] INFO -- : Latest commit hash = 74c911dfa9 I, [2024-05-09T12:55:05.127668 #3782525] INFO -- : $$$[end] "make update-src -j3" exit with 0. I, [2024-05-09T12:55:05.127714 #3782525] INFO -- : $$$[beg] make after-update -j3 I, [2024-05-09T12:55:05.230707 #3782525] INFO -- : generating /home/opc/ruby/src/master/ext/ripper/eventids2table.c I, [2024-05-09T12:55:05.237426 #3782525] INFO -- : make[1]: Entering directory '/home/opc/ruby/src/master/ext/ripper' I, [2024-05-09T12:55:05.237470 #3782525] INFO -- : make[1]: Nothing to be done for 'src'. I, [2024-05-09T12:55:05.237481 #3782525] INFO -- : make[1]: Leaving directory '/home/opc/ruby/src/master/ext/ripper' I, [2024-05-09T12:55:05.268351 #3782525] INFO -- : /home/opc/ruby/src/master/revision.h updated I, [2024-05-09T12:55:05.269648 #3782525] INFO -- : generating aarch64-linux-fake.rb I, [2024-05-09T12:55:05.326932 #3782525] INFO -- : aarch64-linux-fake.rb updated I, [2024-05-09T12:55:05.328589 #3782525] INFO -- : generating enc.mk I, [2024-05-09T12:55:05.557347 #3782525] INFO -- : making srcs under enc I, [2024-05-09T12:55:05.599967 #3782525] INFO -- : make[1]: Entering directory '/home/opc/ruby/build/master' I, [2024-05-09T12:55:05.600015 #3782525] INFO -- : make[1]: Nothing to be done for 'srcs'. I, [2024-05-09T12:55:05.600027 #3782525] INFO -- : make[1]: Leaving directory '/home/opc/ruby/build/master' I, [2024-05-09T12:55:05.680578 #3782525] INFO -- : Update minitest to ea9caafc0754b1d6236a490d59e624b53209734a I, [2024-05-09T12:55:05.680727 #3782525] INFO -- : Update power_assert to 84e85124c5014a139af39161d484156cfe87a9ed I, [2024-05-09T12:55:05.681004 #3782525] INFO -- : Update rbs to ba7872795d5de04adb8ff500c0e6afdc81a041dd I, [2024-05-09T12:55:05.684212 #3782525] INFO -- : echo ea9caafc0754b1d6236a490d59e624b53209734a | /bin/sh /home/opc/ruby/src/master/tool/ifchange /home/opc/ruby/src/master/.bundle/.timestamp/minitest.revision - I, [2024-05-09T12:55:05.684329 #3782525] INFO -- : echo 84e85124c5014a139af39161d484156cfe87a9ed | /bin/sh /home/opc/ruby/src/master/tool/ifchange /home/opc/ruby/src/master/.bundle/.timestamp/power_assert.revision - I, [2024-05-09T12:55:05.684574 #3782525] INFO -- : echo ba7872795d5de04adb8ff500c0e6afdc81a041dd | /bin/sh /home/opc/ruby/src/master/tool/ifchange /home/opc/ruby/src/master/.bundle/.timestamp/rbs.revision - I, [2024-05-09T12:55:05.690309 #3782525] INFO -- : /home/opc/ruby/src/master/.bundle/.timestamp/power_assert.revision unchanged I, [2024-05-09T12:55:05.690369 #3782525] INFO -- : /home/opc/ruby/src/master/.bundle/.timestamp/rbs.revision unchanged I, [2024-05-09T12:55:05.690381 #3782525] INFO -- : /home/opc/ruby/src/master/.bundle/.timestamp/minitest.revision unchanged I, [2024-05-09T12:55:05.693926 #3782525] INFO -- : Update typeprof to b19a6416da3a05d57fadd6ffdadb382b6d236ca5 I, [2024-05-09T12:55:05.701568 #3782525] INFO -- : echo b19a6416da3a05d57fadd6ffdadb382b6d236ca5 | /bin/sh /home/opc/ruby/src/master/tool/ifchange /home/opc/ruby/src/master/.bundle/.timestamp/typeprof.revision - I, [2024-05-09T12:55:05.707177 #3782525] INFO -- : /home/opc/ruby/src/master/.bundle/.timestamp/typeprof.revision unchanged I, [2024-05-09T12:55:05.783102 #3782525] INFO -- : Building power_assert@84e85124c5014a139af39161d484156cfe87a9ed to /home/opc/ruby/src/master/gems/power_assert-2.0.3.gem I, [2024-05-09T12:55:05.893509 #3782525] INFO -- : Successfully built RubyGem I, [2024-05-09T12:55:05.893566 #3782525] INFO -- : Name: power_assert I, [2024-05-09T12:55:05.893577 #3782525] INFO -- : Version: 2.0.4dev I, [2024-05-09T12:55:05.893586 #3782525] INFO -- : File: power_assert-2.0.4dev.gem I, [2024-05-09T12:55:05.895719 #3782525] INFO -- : Extracting bundle gem power_assert-2.0.3... I, [2024-05-09T12:55:05.991508 #3782525] INFO -- : Try with hash version of bundled gems instead of gems/power_assert-2.0.3.gem. We don't use this gem with release version of Ruby. I, [2024-05-09T12:55:06.001599 #3782525] INFO -- : Unpacked gems/power_assert-2.0.4dev.gem I, [2024-05-09T12:55:06.003401 #3782525] INFO -- : $$$[end] "make after-update -j3" exit with 0. I, [2024-05-09T12:55:06.003535 #3782525] INFO -- : $$$[beg] make miniruby -j3 I, [2024-05-09T12:55:06.091197 #3782525] INFO -- : BASERUBY = /usr/local/bin/ruby --disable=gems I, [2024-05-09T12:55:06.091325 #3782525] INFO -- : CC = gcc I, [2024-05-09T12:55:06.091366 #3782525] INFO -- : LD = ld I, [2024-05-09T12:55:06.091377 #3782525] INFO -- : LDSHARED = gcc -shared I, [2024-05-09T12:55:06.091390 #3782525] INFO -- : CFLAGS = -O3 -fno-fast-math -ggdb3 -Wall -Wextra -Wdeprecated-declarations -Wdiv-by-zero -Wduplicated-cond -Wimplicit-function-declaration -Wimplicit-int -Wpointer-arith -Wwrite-strings -Wold-style-definition -Wimplicit-fallthrough=0 -Wmissing-noreturn -Wno-cast-function-type -Wno-constant-logical-operand -Wno-long-long -Wno-missing-field-initializers -Wno-overlength-strings -Wno-packed-bitfield-compat -Wno-parentheses-equality -Wno-self-assign -Wno-tautological-compare -Wno-unused-parameter -Wno-unused-value -Wsuggest-attribute=format -Wsuggest-attribute=noreturn -Wunused-variable -Wmisleading-indentation -Wundef I, [2024-05-09T12:55:06.091400 #3782525] INFO -- : XCFLAGS = -U_FORTIFY_SOURCE -D_FORTIFY_SOURCE=2 -fstack-protector-strong -msign-return-address=all -fno-strict-overflow -fvisibility=hidden -fexcess-precision=standard -DRUBY_EXPORT -fPIE -I. -I.ext/include/aarch64-linux -I/home/opc/ruby/src/master/include -I/home/opc/ruby/src/master -I/home/opc/ruby/src/master/prism -I/home/opc/ruby/src/master/enc/unicode/15.0.0 I, [2024-05-09T12:55:06.091410 #3782525] INFO -- : CPPFLAGS = I, [2024-05-09T12:55:06.091418 #3782525] INFO -- : DLDFLAGS = -Wl,--compress-debug-sections=zlib -fstack-protector-strong -pie I, [2024-05-09T12:55:06.091431 #3782525] INFO -- : SOLIBS = -lz -lrt -lrt -ldl -lcrypt -lm -lpthread I, [2024-05-09T12:55:06.091439 #3782525] INFO -- : LANG = en_US.UTF-8 I, [2024-05-09T12:55:06.091468 #3782525] INFO -- : LC_ALL = I, [2024-05-09T12:55:06.091509 #3782525] INFO -- : LC_CTYPE = I, [2024-05-09T12:55:06.091520 #3782525] INFO -- : MFLAGS = -j3 --jobserver-auth=4,5 I, [2024-05-09T12:55:06.091528 #3782525] INFO -- : RUSTC = rustc I, [2024-05-09T12:55:06.091536 #3782525] INFO -- : YJIT_RUSTC_ARGS = --crate-name=yjit --crate-type=staticlib --edition=2021 -g -C lto=thin -C opt-level=3 -C overflow-checks=on '--out-dir=/home/opc/ruby/build/master/yjit/target/release/' /home/opc/ruby/src/master/yjit/src/lib.rs I, [2024-05-09T12:55:06.092234 #3782525] INFO -- : gcc (GCC) 8.5.0 20210514 (Red Hat 8.5.0-10.1.0.1) I, [2024-05-09T12:55:06.092251 #3782525] INFO -- : Copyright (C) 2018 Free Software Foundation, Inc. I, [2024-05-09T12:55:06.092262 #3782525] INFO -- : This is free software; see the source for copying conditions. There is NO I, [2024-05-09T12:55:06.092271 #3782525] INFO -- : warranty; not even for MERCHANTABILITY or FITNESS FOR A PARTICULAR PURPOSE. I, [2024-05-09T12:55:06.092279 #3782525] INFO -- : I, [2024-05-09T12:55:06.116993 #3782525] INFO -- : compiling /home/opc/ruby/src/master/version.c I, [2024-05-09T12:55:06.256986 #3782525] INFO -- : linking miniruby I, [2024-05-09T12:55:07.131714 #3782525] INFO -- : $$$[end] "make miniruby -j3" exit with 0. I, [2024-05-09T12:55:07.131881 #3782525] INFO -- : $$$[beg] make ruby -j3 I, [2024-05-09T12:55:07.219130 #3782525] INFO -- : BASERUBY = /usr/local/bin/ruby --disable=gems I, [2024-05-09T12:55:07.219198 #3782525] INFO -- : CC = gcc I, [2024-05-09T12:55:07.219210 #3782525] INFO -- : LD = ld I, [2024-05-09T12:55:07.219220 #3782525] INFO -- : LDSHARED = gcc -shared I, [2024-05-09T12:55:07.219232 #3782525] INFO -- : CFLAGS = -O3 -fno-fast-math -ggdb3 -Wall -Wextra -Wdeprecated-declarations -Wdiv-by-zero -Wduplicated-cond -Wimplicit-function-declaration -Wimplicit-int -Wpointer-arith -Wwrite-strings -Wold-style-definition -Wimplicit-fallthrough=0 -Wmissing-noreturn -Wno-cast-function-type -Wno-constant-logical-operand -Wno-long-long -Wno-missing-field-initializers -Wno-overlength-strings -Wno-packed-bitfield-compat -Wno-parentheses-equality -Wno-self-assign -Wno-tautological-compare -Wno-unused-parameter -Wno-unused-value -Wsuggest-attribute=format -Wsuggest-attribute=noreturn -Wunused-variable -Wmisleading-indentation -Wundef I, [2024-05-09T12:55:07.219242 #3782525] INFO -- : XCFLAGS = -U_FORTIFY_SOURCE -D_FORTIFY_SOURCE=2 -fstack-protector-strong -msign-return-address=all -fno-strict-overflow -fvisibility=hidden -fexcess-precision=standard -DRUBY_EXPORT -fPIE -I. -I.ext/include/aarch64-linux -I/home/opc/ruby/src/master/include -I/home/opc/ruby/src/master -I/home/opc/ruby/src/master/prism -I/home/opc/ruby/src/master/enc/unicode/15.0.0 I, [2024-05-09T12:55:07.219251 #3782525] INFO -- : CPPFLAGS = I, [2024-05-09T12:55:07.219260 #3782525] INFO -- : DLDFLAGS = -Wl,--compress-debug-sections=zlib -fstack-protector-strong -pie I, [2024-05-09T12:55:07.219269 #3782525] INFO -- : SOLIBS = -lz -lrt -lrt -ldl -lcrypt -lm -lpthread I, [2024-05-09T12:55:07.219277 #3782525] INFO -- : LANG = en_US.UTF-8 I, [2024-05-09T12:55:07.219286 #3782525] INFO -- : LC_ALL = I, [2024-05-09T12:55:07.219294 #3782525] INFO -- : LC_CTYPE = I, [2024-05-09T12:55:07.219302 #3782525] INFO -- : MFLAGS = -j3 --jobserver-auth=4,5 I, [2024-05-09T12:55:07.219311 #3782525] INFO -- : RUSTC = rustc I, [2024-05-09T12:55:07.219319 #3782525] INFO -- : YJIT_RUSTC_ARGS = --crate-name=yjit --crate-type=staticlib --edition=2021 -g -C lto=thin -C opt-level=3 -C overflow-checks=on '--out-dir=/home/opc/ruby/build/master/yjit/target/release/' /home/opc/ruby/src/master/yjit/src/lib.rs I, [2024-05-09T12:55:07.220052 #3782525] INFO -- : gcc (GCC) 8.5.0 20210514 (Red Hat 8.5.0-10.1.0.1) I, [2024-05-09T12:55:07.220086 #3782525] INFO -- : Copyright (C) 2018 Free Software Foundation, Inc. I, [2024-05-09T12:55:07.220101 #3782525] INFO -- : This is free software; see the source for copying conditions. There is NO I, [2024-05-09T12:55:07.220111 #3782525] INFO -- : warranty; not even for MERCHANTABILITY or FITNESS FOR A PARTICULAR PURPOSE. I, [2024-05-09T12:55:07.220120 #3782525] INFO -- : I, [2024-05-09T12:55:07.397866 #3782525] INFO -- : builtin_binary.inc updated I, [2024-05-09T12:55:07.401067 #3782525] INFO -- : c5234a9416e4f20f175185e840b25b0f08674d14078ed7083f37e655458e3ca9 builtin_binary.inc I, [2024-05-09T12:55:07.402119 #3782525] INFO -- : compiling /home/opc/ruby/src/master/builtin.c I, [2024-05-09T12:55:07.719518 #3782525] INFO -- : linking static-library libruby-static.a I, [2024-05-09T12:55:10.170625 #3782525] INFO -- : linking ruby I, [2024-05-09T12:55:11.088106 #3782525] INFO -- : $$$[end] "make ruby -j3" exit with 0. I, [2024-05-09T12:55:11.088289 #3782525] INFO -- : $$$[beg] make all -j3 I, [2024-05-09T12:55:11.175958 #3782525] INFO -- : BASERUBY = /usr/local/bin/ruby --disable=gems I, [2024-05-09T12:55:11.176024 #3782525] INFO -- : CC = gcc I, [2024-05-09T12:55:11.176035 #3782525] INFO -- : LD = ld I, [2024-05-09T12:55:11.176047 #3782525] INFO -- : LDSHARED = gcc -shared I, [2024-05-09T12:55:11.176057 #3782525] INFO -- : CFLAGS = -O3 -fno-fast-math -ggdb3 -Wall -Wextra -Wdeprecated-declarations -Wdiv-by-zero -Wduplicated-cond -Wimplicit-function-declaration -Wimplicit-int -Wpointer-arith -Wwrite-strings -Wold-style-definition -Wimplicit-fallthrough=0 -Wmissing-noreturn -Wno-cast-function-type -Wno-constant-logical-operand -Wno-long-long -Wno-missing-field-initializers -Wno-overlength-strings -Wno-packed-bitfield-compat -Wno-parentheses-equality -Wno-self-assign -Wno-tautological-compare -Wno-unused-parameter -Wno-unused-value -Wsuggest-attribute=format -Wsuggest-attribute=noreturn -Wunused-variable -Wmisleading-indentation -Wundef I, [2024-05-09T12:55:11.176067 #3782525] INFO -- : XCFLAGS = -U_FORTIFY_SOURCE -D_FORTIFY_SOURCE=2 -fstack-protector-strong -msign-return-address=all -fno-strict-overflow -fvisibility=hidden -fexcess-precision=standard -DRUBY_EXPORT -fPIE -I. -I.ext/include/aarch64-linux -I/home/opc/ruby/src/master/include -I/home/opc/ruby/src/master -I/home/opc/ruby/src/master/prism -I/home/opc/ruby/src/master/enc/unicode/15.0.0 I, [2024-05-09T12:55:11.176076 #3782525] INFO -- : CPPFLAGS = I, [2024-05-09T12:55:11.176084 #3782525] INFO -- : DLDFLAGS = -Wl,--compress-debug-sections=zlib -fstack-protector-strong -pie I, [2024-05-09T12:55:11.176093 #3782525] INFO -- : SOLIBS = -lz -lrt -lrt -ldl -lcrypt -lm -lpthread I, [2024-05-09T12:55:11.176102 #3782525] INFO -- : LANG = en_US.UTF-8 I, [2024-05-09T12:55:11.176110 #3782525] INFO -- : LC_ALL = I, [2024-05-09T12:55:11.176118 #3782525] INFO -- : LC_CTYPE = I, [2024-05-09T12:55:11.176126 #3782525] INFO -- : MFLAGS = -j3 --jobserver-auth=4,5 I, [2024-05-09T12:55:11.176135 #3782525] INFO -- : RUSTC = rustc I, [2024-05-09T12:55:11.176143 #3782525] INFO -- : YJIT_RUSTC_ARGS = --crate-name=yjit --crate-type=staticlib --edition=2021 -g -C lto=thin -C opt-level=3 -C overflow-checks=on '--out-dir=/home/opc/ruby/build/master/yjit/target/release/' /home/opc/ruby/src/master/yjit/src/lib.rs I, [2024-05-09T12:55:11.176934 #3782525] INFO -- : gcc (GCC) 8.5.0 20210514 (Red Hat 8.5.0-10.1.0.1) I, [2024-05-09T12:55:11.176972 #3782525] INFO -- : Copyright (C) 2018 Free Software Foundation, Inc. I, [2024-05-09T12:55:11.176983 #3782525] INFO -- : This is free software; see the source for copying conditions. There is NO I, [2024-05-09T12:55:11.176993 #3782525] INFO -- : warranty; not even for MERCHANTABILITY or FITNESS FOR A PARTICULAR PURPOSE. I, [2024-05-09T12:55:11.177002 #3782525] INFO -- : I, [2024-05-09T12:55:11.210706 #3782525] INFO -- : generating encdb.h I, [2024-05-09T12:55:11.212082 #3782525] INFO -- : generating enc.mk I, [2024-05-09T12:55:11.248423 #3782525] INFO -- : encdb.h unchanged I, [2024-05-09T12:55:11.454824 #3782525] INFO -- : making srcs under enc I, [2024-05-09T12:55:11.454893 #3782525] INFO -- : making enc I, [2024-05-09T12:55:11.482186 #3782525] INFO -- : make[1]: Entering directory '/home/opc/ruby/build/master' I, [2024-05-09T12:55:11.482246 #3782525] INFO -- : make[1]: Nothing to be done for 'enc'. I, [2024-05-09T12:55:11.482257 #3782525] INFO -- : make[1]: Leaving directory '/home/opc/ruby/build/master' I, [2024-05-09T12:55:11.496692 #3782525] INFO -- : make[1]: Entering directory '/home/opc/ruby/build/master' I, [2024-05-09T12:55:11.496746 #3782525] INFO -- : make[1]: Nothing to be done for 'srcs'. I, [2024-05-09T12:55:11.496757 #3782525] INFO -- : make[1]: Leaving directory '/home/opc/ruby/build/master' I, [2024-05-09T12:55:11.497692 #3782525] INFO -- : generating transdb.h I, [2024-05-09T12:55:11.640439 #3782525] INFO -- : transdb.h unchanged I, [2024-05-09T12:55:11.641841 #3782525] INFO -- : generating makefiles ext/configure-ext.mk I, [2024-05-09T12:55:11.641967 #3782525] INFO -- : making trans I, [2024-05-09T12:55:11.682032 #3782525] INFO -- : ext/configure-ext.mk updated I, [2024-05-09T12:55:11.685279 #3782525] INFO -- : make[1]: Entering directory '/home/opc/ruby/build/master' I, [2024-05-09T12:55:11.690502 #3782525] INFO -- : make[1]: Entering directory '/home/opc/ruby/build/master' I, [2024-05-09T12:55:11.690562 #3782525] INFO -- : make[1]: Nothing to be done for 'trans'. I, [2024-05-09T12:55:11.690574 #3782525] INFO -- : make[1]: Leaving directory '/home/opc/ruby/build/master' I, [2024-05-09T12:55:12.380139 #3782525] INFO -- : making encs I, [2024-05-09T12:55:12.427301 #3782525] INFO -- : make[1]: Leaving directory '/home/opc/ruby/build/master' I, [2024-05-09T12:55:12.427987 #3782525] INFO -- : generating makefile exts.mk I, [2024-05-09T12:55:12.438477 #3782525] INFO -- : make[1]: Entering directory '/home/opc/ruby/build/master' I, [2024-05-09T12:55:12.438543 #3782525] INFO -- : make[1]: Nothing to be done for 'encs'. I, [2024-05-09T12:55:12.438554 #3782525] INFO -- : make[1]: Leaving directory '/home/opc/ruby/build/master' I, [2024-05-09T12:55:12.488048 #3782525] INFO -- : exts.mk unchanged I, [2024-05-09T12:55:12.492907 #3782525] INFO -- : make[1]: Entering directory '/home/opc/ruby/build/master' I, [2024-05-09T12:55:12.599506 #3782525] INFO -- : make[2]: Entering directory '/home/opc/ruby/build/master/ext/digest' I, [2024-05-09T12:55:12.599665 #3782525] INFO -- : make[2]: Entering directory '/home/opc/ruby/build/master/ext/coverage' I, [2024-05-09T12:55:12.600483 #3782525] INFO -- : make[2]: Entering directory '/home/opc/ruby/build/master/ext/date' I, [2024-05-09T12:55:12.605326 #3782525] INFO -- : make[2]: Leaving directory '/home/opc/ruby/build/master/ext/coverage' I, [2024-05-09T12:55:12.606088 #3782525] INFO -- : make[2]: Leaving directory '/home/opc/ruby/build/master/ext/date' I, [2024-05-09T12:55:12.608234 #3782525] INFO -- : make[2]: Leaving directory '/home/opc/ruby/build/master/ext/digest' I, [2024-05-09T12:55:12.615110 #3782525] INFO -- : make[2]: Entering directory '/home/opc/ruby/build/master/ext/fiddle' I, [2024-05-09T12:55:12.617513 #3782525] INFO -- : make[2]: Entering directory '/home/opc/ruby/build/master/ext/io/console' I, [2024-05-09T12:55:12.619928 #3782525] INFO -- : make[2]: Leaving directory '/home/opc/ruby/build/master/ext/io/console' I, [2024-05-09T12:55:12.622504 #3782525] INFO -- : make[2]: Entering directory '/home/opc/ruby/build/master/ext/json' I, [2024-05-09T12:55:12.625417 #3782525] INFO -- : make[2]: Leaving directory '/home/opc/ruby/build/master/ext/fiddle' I, [2024-05-09T12:55:12.627006 #3782525] INFO -- : make[2]: Entering directory '/home/opc/ruby/build/master/ext/monitor' I, [2024-05-09T12:55:12.630584 #3782525] INFO -- : make[2]: Leaving directory '/home/opc/ruby/build/master/ext/monitor' I, [2024-05-09T12:55:12.631470 #3782525] INFO -- : make[2]: Entering directory '/home/opc/ruby/build/master/ext/objspace' I, [2024-05-09T12:55:12.635299 #3782525] INFO -- : make[2]: Leaving directory '/home/opc/ruby/build/master/ext/json' I, [2024-05-09T12:55:12.639483 #3782525] INFO -- : make[2]: Entering directory '/home/opc/ruby/build/master/ext/pathname' I, [2024-05-09T12:55:12.640577 #3782525] INFO -- : make[2]: Leaving directory '/home/opc/ruby/build/master/ext/objspace' I, [2024-05-09T12:55:12.646685 #3782525] INFO -- : make[2]: Leaving directory '/home/opc/ruby/build/master/ext/pathname' I, [2024-05-09T12:55:12.647580 #3782525] INFO -- : make[2]: Entering directory '/home/opc/ruby/build/master/ext/psych' I, [2024-05-09T12:55:12.651034 #3782525] INFO -- : make[2]: Entering directory '/home/opc/ruby/build/master/ext/pty' I, [2024-05-09T12:55:12.651160 #3782525] INFO -- : make[2]: Entering directory '/home/opc/ruby/build/master/ext/openssl' I, [2024-05-09T12:55:12.659930 #3782525] INFO -- : make[2]: Leaving directory '/home/opc/ruby/build/master/ext/pty' I, [2024-05-09T12:55:12.669510 #3782525] INFO -- : make[2]: Leaving directory '/home/opc/ruby/build/master/ext/psych' I, [2024-05-09T12:55:12.671439 #3782525] INFO -- : make[2]: Entering directory '/home/opc/ruby/build/master/ext/rubyvm' I, [2024-05-09T12:55:12.672861 #3782525] INFO -- : make[2]: Leaving directory '/home/opc/ruby/build/master/ext/openssl' I, [2024-05-09T12:55:12.674033 #3782525] INFO -- : make[2]: Entering directory '/home/opc/ruby/build/master/ext/ripper' I, [2024-05-09T12:55:12.675817 #3782525] INFO -- : make[2]: Leaving directory '/home/opc/ruby/build/master/ext/rubyvm' I, [2024-05-09T12:55:12.683265 #3782525] INFO -- : make[2]: Leaving directory '/home/opc/ruby/build/master/ext/ripper' I, [2024-05-09T12:55:12.685815 #3782525] INFO -- : make[2]: Entering directory '/home/opc/ruby/build/master/ext/socket' I, [2024-05-09T12:55:12.687206 #3782525] INFO -- : make[2]: Entering directory '/home/opc/ruby/build/master/.bundle/gems/bigdecimal-3.1.7/ext/bigdecimal' I, [2024-05-09T12:55:12.690826 #3782525] INFO -- : make[2]: Entering directory '/home/opc/ruby/build/master/.bundle/gems/bigdecimal-3.1.8/ext/bigdecimal' I, [2024-05-09T12:55:12.696674 #3782525] INFO -- : make[2]: Leaving directory '/home/opc/ruby/build/master/ext/socket' I, [2024-05-09T12:55:12.699878 #3782525] INFO -- : make[2]: Entering directory '/home/opc/ruby/build/master/.bundle/gems/debug-1.9.2/ext/debug' I, [2024-05-09T12:55:12.720456 #3782525] INFO -- : make[2]: Leaving directory '/home/opc/ruby/build/master/.bundle/gems/bigdecimal-3.1.7/ext/bigdecimal' I, [2024-05-09T12:55:12.723011 #3782525] INFO -- : make[2]: Entering directory '/home/opc/ruby/build/master/.bundle/gems/nkf-0.2.0/ext/nkf' I, [2024-05-09T12:55:12.724219 #3782525] INFO -- : make[2]: Leaving directory '/home/opc/ruby/build/master/.bundle/gems/bigdecimal-3.1.8/ext/bigdecimal' I, [2024-05-09T12:55:12.729643 #3782525] INFO -- : make[2]: Entering directory '/home/opc/ruby/build/master/.bundle/gems/racc-1.7.3/ext/racc/cparse' I, [2024-05-09T12:55:12.731879 #3782525] INFO -- : make[2]: Leaving directory '/home/opc/ruby/build/master/.bundle/gems/debug-1.9.2/ext/debug' I, [2024-05-09T12:55:12.734769 #3782525] INFO -- : make[2]: Entering directory '/home/opc/ruby/build/master/.bundle/gems/rbs-3.4.4/ext/rbs_extension' I, [2024-05-09T12:55:12.753802 #3782525] INFO -- : make[2]: Leaving directory '/home/opc/ruby/build/master/.bundle/gems/nkf-0.2.0/ext/nkf' I, [2024-05-09T12:55:12.756622 #3782525] INFO -- : make[2]: Entering directory '/home/opc/ruby/build/master/.bundle/gems/syslog-0.1.2/ext/syslog' I, [2024-05-09T12:55:12.762566 #3782525] INFO -- : make[2]: Leaving directory '/home/opc/ruby/build/master/.bundle/gems/racc-1.7.3/ext/racc/cparse' I, [2024-05-09T12:55:12.765453 #3782525] INFO -- : make[2]: Leaving directory '/home/opc/ruby/build/master/.bundle/gems/rbs-3.4.4/ext/rbs_extension' I, [2024-05-09T12:55:12.779016 #3782525] INFO -- : make[2]: Entering directory '/home/opc/ruby/build/master/ext/digest/sha2' I, [2024-05-09T12:55:12.784014 #3782525] INFO -- : make[2]: Leaving directory '/home/opc/ruby/build/master/ext/digest/sha2' I, [2024-05-09T12:55:12.787853 #3782525] INFO -- : make[2]: Leaving directory '/home/opc/ruby/build/master/.bundle/gems/syslog-0.1.2/ext/syslog' I, [2024-05-09T12:55:12.826440 #3782525] INFO -- : make[2]: Entering directory '/home/opc/ruby/build/master' I, [2024-05-09T12:55:12.911391 #3782525] INFO -- : make[2]: 'ruby' is up to date. I, [2024-05-09T12:55:12.911471 #3782525] INFO -- : make[2]: Leaving directory '/home/opc/ruby/build/master' I, [2024-05-09T12:55:12.911637 #3782525] INFO -- : make[1]: Leaving directory '/home/opc/ruby/build/master' I, [2024-05-09T12:55:12.916253 #3782525] INFO -- : make[1]: Entering directory '/home/opc/ruby/build/master' I, [2024-05-09T12:55:12.916300 #3782525] INFO -- : make[1]: Nothing to be done for 'note'. I, [2024-05-09T12:55:12.916311 #3782525] INFO -- : make[1]: Leaving directory '/home/opc/ruby/build/master' I, [2024-05-09T12:55:12.916646 #3782525] INFO -- : $$$[end] "make all -j3" exit with 0. I, [2024-05-09T12:55:12.916779 #3782525] INFO -- : $$$[beg] make install -j3 I, [2024-05-09T12:55:13.011726 #3782525] INFO -- : Update minitest to ea9caafc0754b1d6236a490d59e624b53209734a I, [2024-05-09T12:55:13.011794 #3782525] INFO -- : Update power_assert to 84e85124c5014a139af39161d484156cfe87a9ed I, [2024-05-09T12:55:13.012274 #3782525] INFO -- : Update rbs to ba7872795d5de04adb8ff500c0e6afdc81a041dd I, [2024-05-09T12:55:13.015188 #3782525] INFO -- : echo 84e85124c5014a139af39161d484156cfe87a9ed | /bin/sh /home/opc/ruby/src/master/tool/ifchange /home/opc/ruby/src/master/.bundle/.timestamp/power_assert.revision - I, [2024-05-09T12:55:13.015420 #3782525] INFO -- : echo ea9caafc0754b1d6236a490d59e624b53209734a | /bin/sh /home/opc/ruby/src/master/tool/ifchange /home/opc/ruby/src/master/.bundle/.timestamp/minitest.revision - I, [2024-05-09T12:55:13.016034 #3782525] INFO -- : echo ba7872795d5de04adb8ff500c0e6afdc81a041dd | /bin/sh /home/opc/ruby/src/master/tool/ifchange /home/opc/ruby/src/master/.bundle/.timestamp/rbs.revision - I, [2024-05-09T12:55:13.021097 #3782525] INFO -- : /home/opc/ruby/src/master/.bundle/.timestamp/power_assert.revision unchanged I, [2024-05-09T12:55:13.022672 #3782525] INFO -- : /home/opc/ruby/src/master/.bundle/.timestamp/minitest.revision unchanged I, [2024-05-09T12:55:13.023580 #3782525] INFO -- : /home/opc/ruby/src/master/.bundle/.timestamp/rbs.revision unchanged I, [2024-05-09T12:55:13.023873 #3782525] INFO -- : Update typeprof to b19a6416da3a05d57fadd6ffdadb382b6d236ca5 I, [2024-05-09T12:55:13.032900 #3782525] INFO -- : BASERUBY = /usr/local/bin/ruby --disable=gems I, [2024-05-09T12:55:13.032958 #3782525] INFO -- : CC = gcc I, [2024-05-09T12:55:13.032969 #3782525] INFO -- : LD = ld I, [2024-05-09T12:55:13.032981 #3782525] INFO -- : LDSHARED = gcc -shared I, [2024-05-09T12:55:13.032992 #3782525] INFO -- : CFLAGS = -O3 -fno-fast-math -ggdb3 -Wall -Wextra -Wdeprecated-declarations -Wdiv-by-zero -Wduplicated-cond -Wimplicit-function-declaration -Wimplicit-int -Wpointer-arith -Wwrite-strings -Wold-style-definition -Wimplicit-fallthrough=0 -Wmissing-noreturn -Wno-cast-function-type -Wno-constant-logical-operand -Wno-long-long -Wno-missing-field-initializers -Wno-overlength-strings -Wno-packed-bitfield-compat -Wno-parentheses-equality -Wno-self-assign -Wno-tautological-compare -Wno-unused-parameter -Wno-unused-value -Wsuggest-attribute=format -Wsuggest-attribute=noreturn -Wunused-variable -Wmisleading-indentation -Wundef I, [2024-05-09T12:55:13.033002 #3782525] INFO -- : XCFLAGS = -U_FORTIFY_SOURCE -D_FORTIFY_SOURCE=2 -fstack-protector-strong -msign-return-address=all -fno-strict-overflow -fvisibility=hidden -fexcess-precision=standard -DRUBY_EXPORT -fPIE -I. -I.ext/include/aarch64-linux -I/home/opc/ruby/src/master/include -I/home/opc/ruby/src/master -I/home/opc/ruby/src/master/prism -I/home/opc/ruby/src/master/enc/unicode/15.0.0 I, [2024-05-09T12:55:13.033011 #3782525] INFO -- : CPPFLAGS = I, [2024-05-09T12:55:13.033019 #3782525] INFO -- : DLDFLAGS = -Wl,--compress-debug-sections=zlib -fstack-protector-strong -pie I, [2024-05-09T12:55:13.033066 #3782525] INFO -- : SOLIBS = -lz -lrt -lrt -ldl -lcrypt -lm -lpthread I, [2024-05-09T12:55:13.033078 #3782525] INFO -- : LANG = en_US.UTF-8 I, [2024-05-09T12:55:13.033089 #3782525] INFO -- : LC_ALL = I, [2024-05-09T12:55:13.033098 #3782525] INFO -- : LC_CTYPE = I, [2024-05-09T12:55:13.033106 #3782525] INFO -- : MFLAGS = -j3 --jobserver-auth=4,5 I, [2024-05-09T12:55:13.033114 #3782525] INFO -- : RUSTC = rustc I, [2024-05-09T12:55:13.033122 #3782525] INFO -- : YJIT_RUSTC_ARGS = --crate-name=yjit --crate-type=staticlib --edition=2021 -g -C lto=thin -C opt-level=3 -C overflow-checks=on '--out-dir=/home/opc/ruby/build/master/yjit/target/release/' /home/opc/ruby/src/master/yjit/src/lib.rs I, [2024-05-09T12:55:13.057200 #3782525] INFO -- : echo b19a6416da3a05d57fadd6ffdadb382b6d236ca5 | /bin/sh /home/opc/ruby/src/master/tool/ifchange /home/opc/ruby/src/master/.bundle/.timestamp/typeprof.revision - I, [2024-05-09T12:55:13.058143 #3782525] INFO -- : gcc (GCC) 8.5.0 20210514 (Red Hat 8.5.0-10.1.0.1) I, [2024-05-09T12:55:13.058182 #3782525] INFO -- : Copyright (C) 2018 Free Software Foundation, Inc. I, [2024-05-09T12:55:13.058192 #3782525] INFO -- : This is free software; see the source for copying conditions. There is NO I, [2024-05-09T12:55:13.058202 #3782525] INFO -- : warranty; not even for MERCHANTABILITY or FITNESS FOR A PARTICULAR PURPOSE. I, [2024-05-09T12:55:13.058211 #3782525] INFO -- : I, [2024-05-09T12:55:13.058789 #3782525] INFO -- : generating encdb.h I, [2024-05-09T12:55:13.059383 #3782525] INFO -- : generating enc.mk I, [2024-05-09T12:55:13.062736 #3782525] INFO -- : /home/opc/ruby/src/master/.bundle/.timestamp/typeprof.revision unchanged I, [2024-05-09T12:55:13.101683 #3782525] INFO -- : encdb.h unchanged I, [2024-05-09T12:55:13.194437 #3782525] INFO -- : Building power_assert@84e85124c5014a139af39161d484156cfe87a9ed to /home/opc/ruby/src/master/gems/power_assert-2.0.3.gem I, [2024-05-09T12:55:13.299822 #3782525] INFO -- : making srcs under enc I, [2024-05-09T12:55:13.299924 #3782525] INFO -- : making enc I, [2024-05-09T12:55:13.311276 #3782525] INFO -- : Successfully built RubyGem I, [2024-05-09T12:55:13.311326 #3782525] INFO -- : Name: power_assert I, [2024-05-09T12:55:13.311337 #3782525] INFO -- : Version: 2.0.4dev I, [2024-05-09T12:55:13.311347 #3782525] INFO -- : File: power_assert-2.0.4dev.gem I, [2024-05-09T12:55:13.313881 #3782525] INFO -- : Extracting bundle gem power_assert-2.0.3... I, [2024-05-09T12:55:13.328048 #3782525] INFO -- : make[1]: Entering directory '/home/opc/ruby/build/master' I, [2024-05-09T12:55:13.328104 #3782525] INFO -- : make[1]: Nothing to be done for 'enc'. I, [2024-05-09T12:55:13.328115 #3782525] INFO -- : make[1]: Leaving directory '/home/opc/ruby/build/master' I, [2024-05-09T12:55:13.343347 #3782525] INFO -- : make[1]: Entering directory '/home/opc/ruby/build/master' I, [2024-05-09T12:55:13.343409 #3782525] INFO -- : make[1]: Nothing to be done for 'srcs'. I, [2024-05-09T12:55:13.343421 #3782525] INFO -- : make[1]: Leaving directory '/home/opc/ruby/build/master' I, [2024-05-09T12:55:13.344255 #3782525] INFO -- : generating transdb.h I, [2024-05-09T12:55:13.413423 #3782525] INFO -- : Try with hash version of bundled gems instead of gems/power_assert-2.0.3.gem. We don't use this gem with release version of Ruby. I, [2024-05-09T12:55:13.424708 #3782525] INFO -- : Unpacked gems/power_assert-2.0.4dev.gem I, [2024-05-09T12:55:13.493850 #3782525] INFO -- : transdb.h unchanged I, [2024-05-09T12:55:13.495273 #3782525] INFO -- : generating makefiles ext/configure-ext.mk I, [2024-05-09T12:55:13.495430 #3782525] INFO -- : making trans I, [2024-05-09T12:55:13.534908 #3782525] INFO -- : ext/configure-ext.mk unchanged I, [2024-05-09T12:55:13.538123 #3782525] INFO -- : make[1]: Entering directory '/home/opc/ruby/build/master' I, [2024-05-09T12:55:13.544314 #3782525] INFO -- : make[1]: Entering directory '/home/opc/ruby/build/master' I, [2024-05-09T12:55:13.544381 #3782525] INFO -- : make[1]: Nothing to be done for 'trans'. I, [2024-05-09T12:55:13.544392 #3782525] INFO -- : make[1]: Leaving directory '/home/opc/ruby/build/master' I, [2024-05-09T12:55:14.240150 #3782525] INFO -- : making encs I, [2024-05-09T12:55:14.292872 #3782525] INFO -- : make[1]: Leaving directory '/home/opc/ruby/build/master' I, [2024-05-09T12:55:14.293013 #3782525] INFO -- : make[1]: Entering directory '/home/opc/ruby/build/master' I, [2024-05-09T12:55:14.293102 #3782525] INFO -- : make[1]: Nothing to be done for 'encs'. I, [2024-05-09T12:55:14.293114 #3782525] INFO -- : make[1]: Leaving directory '/home/opc/ruby/build/master' I, [2024-05-09T12:55:14.293573 #3782525] INFO -- : generating makefile exts.mk I, [2024-05-09T12:55:14.352106 #3782525] INFO -- : exts.mk unchanged I, [2024-05-09T12:55:14.356921 #3782525] INFO -- : make[1]: Entering directory '/home/opc/ruby/build/master' I, [2024-05-09T12:55:14.465935 #3782525] INFO -- : make[2]: Entering directory '/home/opc/ruby/build/master/ext/coverage' I, [2024-05-09T12:55:14.467325 #3782525] INFO -- : make[2]: Entering directory '/home/opc/ruby/build/master/ext/date' I, [2024-05-09T12:55:14.467696 #3782525] INFO -- : make[2]: Entering directory '/home/opc/ruby/build/master/ext/digest' I, [2024-05-09T12:55:14.471333 #3782525] INFO -- : make[2]: Leaving directory '/home/opc/ruby/build/master/ext/coverage' I, [2024-05-09T12:55:14.472635 #3782525] INFO -- : make[2]: Leaving directory '/home/opc/ruby/build/master/ext/date' I, [2024-05-09T12:55:14.476404 #3782525] INFO -- : make[2]: Leaving directory '/home/opc/ruby/build/master/ext/digest' I, [2024-05-09T12:55:14.482138 #3782525] INFO -- : make[2]: Entering directory '/home/opc/ruby/build/master/ext/io/console' I, [2024-05-09T12:55:14.483555 #3782525] INFO -- : make[2]: Entering directory '/home/opc/ruby/build/master/ext/fiddle' I, [2024-05-09T12:55:14.488627 #3782525] INFO -- : make[2]: Leaving directory '/home/opc/ruby/build/master/ext/io/console' I, [2024-05-09T12:55:14.489001 #3782525] INFO -- : make[2]: Entering directory '/home/opc/ruby/build/master/ext/json' I, [2024-05-09T12:55:14.492479 #3782525] INFO -- : make[2]: Entering directory '/home/opc/ruby/build/master/ext/monitor' I, [2024-05-09T12:55:14.493150 #3782525] INFO -- : make[2]: Leaving directory '/home/opc/ruby/build/master/ext/fiddle' I, [2024-05-09T12:55:14.496558 #3782525] INFO -- : make[2]: Leaving directory '/home/opc/ruby/build/master/ext/monitor' I, [2024-05-09T12:55:14.498660 #3782525] INFO -- : make[2]: Leaving directory '/home/opc/ruby/build/master/ext/json' I, [2024-05-09T12:55:14.499587 #3782525] INFO -- : make[2]: Entering directory '/home/opc/ruby/build/master/ext/objspace' I, [2024-05-09T12:55:14.502799 #3782525] INFO -- : make[2]: Entering directory '/home/opc/ruby/build/master/ext/pathname' I, [2024-05-09T12:55:14.505773 #3782525] INFO -- : make[2]: Leaving directory '/home/opc/ruby/build/master/ext/objspace' I, [2024-05-09T12:55:14.507224 #3782525] INFO -- : make[2]: Leaving directory '/home/opc/ruby/build/master/ext/pathname' I, [2024-05-09T12:55:14.511559 #3782525] INFO -- : make[2]: Entering directory '/home/opc/ruby/build/master/ext/pty' I, [2024-05-09T12:55:14.512323 #3782525] INFO -- : make[2]: Entering directory '/home/opc/ruby/build/master/ext/psych' I, [2024-05-09T12:55:14.515483 #3782525] INFO -- : make[2]: Entering directory '/home/opc/ruby/build/master/ext/openssl' I, [2024-05-09T12:55:14.517952 #3782525] INFO -- : make[2]: Leaving directory '/home/opc/ruby/build/master/ext/pty' I, [2024-05-09T12:55:14.530788 #3782525] INFO -- : make[2]: Leaving directory '/home/opc/ruby/build/master/ext/psych' I, [2024-05-09T12:55:14.532120 #3782525] INFO -- : make[2]: Entering directory '/home/opc/ruby/build/master/ext/ripper' I, [2024-05-09T12:55:14.532707 #3782525] INFO -- : make[2]: Entering directory '/home/opc/ruby/build/master/ext/rubyvm' I, [2024-05-09T12:55:14.536216 #3782525] INFO -- : make[2]: Leaving directory '/home/opc/ruby/build/master/ext/rubyvm' I, [2024-05-09T12:55:14.538596 #3782525] INFO -- : make[2]: Leaving directory '/home/opc/ruby/build/master/ext/openssl' I, [2024-05-09T12:55:14.539916 #3782525] INFO -- : make[2]: Leaving directory '/home/opc/ruby/build/master/ext/ripper' I, [2024-05-09T12:55:14.546691 #3782525] INFO -- : make[2]: Entering directory '/home/opc/ruby/build/master/.bundle/gems/bigdecimal-3.1.7/ext/bigdecimal' I, [2024-05-09T12:55:14.549221 #3782525] INFO -- : make[2]: Entering directory '/home/opc/ruby/build/master/ext/socket' I, [2024-05-09T12:55:14.550488 #3782525] INFO -- : make[2]: Entering directory '/home/opc/ruby/build/master/.bundle/gems/bigdecimal-3.1.8/ext/bigdecimal' I, [2024-05-09T12:55:14.561129 #3782525] INFO -- : make[2]: Leaving directory '/home/opc/ruby/build/master/ext/socket' I, [2024-05-09T12:55:14.563686 #3782525] INFO -- : make[2]: Entering directory '/home/opc/ruby/build/master/.bundle/gems/debug-1.9.2/ext/debug' I, [2024-05-09T12:55:14.577754 #3782525] INFO -- : make[2]: Leaving directory '/home/opc/ruby/build/master/.bundle/gems/bigdecimal-3.1.7/ext/bigdecimal' I, [2024-05-09T12:55:14.580226 #3782525] INFO -- : make[2]: Entering directory '/home/opc/ruby/build/master/.bundle/gems/nkf-0.2.0/ext/nkf' I, [2024-05-09T12:55:14.583198 #3782525] INFO -- : make[2]: Leaving directory '/home/opc/ruby/build/master/.bundle/gems/bigdecimal-3.1.8/ext/bigdecimal' I, [2024-05-09T12:55:14.585771 #3782525] INFO -- : make[2]: Entering directory '/home/opc/ruby/build/master/.bundle/gems/racc-1.7.3/ext/racc/cparse' I, [2024-05-09T12:55:14.597603 #3782525] INFO -- : make[2]: Leaving directory '/home/opc/ruby/build/master/.bundle/gems/debug-1.9.2/ext/debug' I, [2024-05-09T12:55:14.600628 #3782525] INFO -- : make[2]: Entering directory '/home/opc/ruby/build/master/.bundle/gems/rbs-3.4.4/ext/rbs_extension' I, [2024-05-09T12:55:14.611614 #3782525] INFO -- : make[2]: Leaving directory '/home/opc/ruby/build/master/.bundle/gems/nkf-0.2.0/ext/nkf' I, [2024-05-09T12:55:14.614377 #3782525] INFO -- : make[2]: Entering directory '/home/opc/ruby/build/master/.bundle/gems/syslog-0.1.2/ext/syslog' I, [2024-05-09T12:55:14.617000 #3782525] INFO -- : make[2]: Leaving directory '/home/opc/ruby/build/master/.bundle/gems/racc-1.7.3/ext/racc/cparse' I, [2024-05-09T12:55:14.634333 #3782525] INFO -- : make[2]: Leaving directory '/home/opc/ruby/build/master/.bundle/gems/rbs-3.4.4/ext/rbs_extension' I, [2024-05-09T12:55:14.638877 #3782525] INFO -- : make[2]: Entering directory '/home/opc/ruby/build/master/ext/digest/sha2' I, [2024-05-09T12:55:14.645558 #3782525] INFO -- : make[2]: Leaving directory '/home/opc/ruby/build/master/.bundle/gems/syslog-0.1.2/ext/syslog' I, [2024-05-09T12:55:14.647245 #3782525] INFO -- : make[2]: Leaving directory '/home/opc/ruby/build/master/ext/digest/sha2' I, [2024-05-09T12:55:14.685695 #3782525] INFO -- : make[2]: Entering directory '/home/opc/ruby/build/master' I, [2024-05-09T12:55:14.767930 #3782525] INFO -- : make[2]: 'ruby' is up to date. I, [2024-05-09T12:55:14.768005 #3782525] INFO -- : make[2]: Leaving directory '/home/opc/ruby/build/master' I, [2024-05-09T12:55:14.768133 #3782525] INFO -- : make[1]: Leaving directory '/home/opc/ruby/build/master' I, [2024-05-09T12:55:14.772598 #3782525] INFO -- : make[1]: Entering directory '/home/opc/ruby/build/master' I, [2024-05-09T12:55:14.772640 #3782525] INFO -- : make[1]: Nothing to be done for 'note'. I, [2024-05-09T12:55:14.772651 #3782525] INFO -- : make[1]: Leaving directory '/home/opc/ruby/build/master' I, [2024-05-09T12:55:14.772697 #3782525] INFO -- : ./miniruby -I/home/opc/ruby/src/master/lib -I. -I.ext/common /home/opc/ruby/src/master/tool/runruby.rb --extout=.ext -- --disable-gems -r./aarch64-linux-fake /home/opc/ruby/src/master/tool/rbinstall.rb --make="make" --dest-dir="" --extout=".ext" --ext-build-dir="./ext" --mflags="-j3 --jobserver-auth=4,5" --make-flags=" -j3 --jobserver-auth=4,5" --data-mode=0644 --prog-mode=0755 --installed-list .installed.list --mantype="doc" --gnumake --install=all --exclude=doc I, [2024-05-09T12:55:14.921537 #3782525] INFO -- : Installing to I, [2024-05-09T12:55:14.921599 #3782525] INFO -- : installing binary commands: /home/opc/ruby/install/master/bin I, [2024-05-09T12:55:14.933305 #3782525] INFO -- : installing base libraries: /home/opc/ruby/install/master/lib I, [2024-05-09T12:55:14.933799 #3782525] INFO -- : installing arch files: /home/opc/ruby/install/master/lib/ruby/3.4.0+0/aarch64-linux I, [2024-05-09T12:55:14.933908 #3782525] INFO -- : installing pkgconfig data: /home/opc/ruby/install/master/lib/pkgconfig I, [2024-05-09T12:55:14.933966 #3782525] INFO -- : installing extension objects: /home/opc/ruby/install/master/lib/ruby/3.4.0+0/aarch64-linux I, [2024-05-09T12:55:14.946336 #3782525] INFO -- : installing extension objects: /home/opc/ruby/install/master/lib/ruby/site_ruby/3.4.0+0/aarch64-linux I, [2024-05-09T12:55:14.946378 #3782525] INFO -- : installing extension objects: /home/opc/ruby/install/master/lib/ruby/vendor_ruby/3.4.0+0/aarch64-linux I, [2024-05-09T12:55:14.946486 #3782525] INFO -- : installing extension headers: /home/opc/ruby/install/master/include/ruby-3.4.0+0/aarch64-linux I, [2024-05-09T12:55:14.946751 #3782525] INFO -- : installing extension scripts: /home/opc/ruby/install/master/lib/ruby/3.4.0+0 I, [2024-05-09T12:55:14.954442 #3782525] INFO -- : installing extension scripts: /home/opc/ruby/install/master/lib/ruby/site_ruby/3.4.0+0 I, [2024-05-09T12:55:14.954469 #3782525] INFO -- : installing extension scripts: /home/opc/ruby/install/master/lib/ruby/vendor_ruby/3.4.0+0 I, [2024-05-09T12:55:14.954481 #3782525] INFO -- : installing extension headers: /home/opc/ruby/install/master/include/ruby-3.4.0+0/ruby I, [2024-05-09T12:55:14.954580 #3782525] INFO -- : installing command scripts: /home/opc/ruby/install/master/bin I, [2024-05-09T12:55:14.954725 #3782525] INFO -- : installing library scripts: /home/opc/ruby/install/master/lib/ruby/3.4.0+0 I, [2024-05-09T12:55:15.037472 #3782525] INFO -- : installing common headers: /home/opc/ruby/install/master/include/ruby-3.4.0+0 I, [2024-05-09T12:55:15.053130 #3782525] INFO -- : installing manpages: /home/opc/ruby/install/master/share/man/man1 I, [2024-05-09T12:55:15.053541 #3782525] INFO -- : installing default gems from lib: /home/opc/ruby/install/master/lib/ruby/gems/3.4.0+0 I, [2024-05-09T12:55:15.093237 #3782525] INFO -- : benchmark 0.3.0 I, [2024-05-09T12:55:15.107505 #3782525] INFO -- : bundler 2.6.0.dev I, [2024-05-09T12:55:15.113744 #3782525] INFO -- : cgi 0.4.1 I, [2024-05-09T12:55:15.115793 #3782525] INFO -- : delegate 0.3.1 I, [2024-05-09T12:55:15.117703 #3782525] INFO -- : did_you_mean 1.6.3 I, [2024-05-09T12:55:15.119475 #3782525] INFO -- : english 0.8.0 I, [2024-05-09T12:55:15.120587 #3782525] INFO -- : erb 4.0.4 I, [2024-05-09T12:55:15.123166 #3782525] INFO -- : error_highlight 0.6.0 I, [2024-05-09T12:55:15.124240 #3782525] INFO -- : fileutils 1.7.2 I, [2024-05-09T12:55:15.125398 #3782525] INFO -- : find 0.2.0 I, [2024-05-09T12:55:15.126471 #3782525] INFO -- : forwardable 1.3.3 I, [2024-05-09T12:55:15.127539 #3782525] INFO -- : ipaddr 1.2.6 I, [2024-05-09T12:55:15.128629 #3782525] INFO -- : irb 1.13.1 I, [2024-05-09T12:55:15.131169 #3782525] INFO -- : logger 1.6.0 I, [2024-05-09T12:55:15.132254 #3782525] INFO -- : net-http 0.4.1 I, [2024-05-09T12:55:15.133459 #3782525] INFO -- : net-protocol 0.2.2 I, [2024-05-09T12:55:15.134581 #3782525] INFO -- : open-uri 0.4.1 I, [2024-05-09T12:55:15.135718 #3782525] INFO -- : open3 0.2.1 I, [2024-05-09T12:55:15.136852 #3782525] INFO -- : optparse 0.5.0 I, [2024-05-09T12:55:15.138025 #3782525] INFO -- : ostruct 0.6.0 I, [2024-05-09T12:55:15.139070 #3782525] INFO -- : pp 0.5.0 I, [2024-05-09T12:55:15.140193 #3782525] INFO -- : prettyprint 0.2.0 I, [2024-05-09T12:55:15.141350 #3782525] INFO -- : prism 0.28.0 I, [2024-05-09T12:55:15.142496 #3782525] INFO -- : pstore 0.1.3 I, [2024-05-09T12:55:15.143568 #3782525] INFO -- : rdoc 6.6.3.1 I, [2024-05-09T12:55:15.148882 #3782525] INFO -- : readline 0.0.4 I, [2024-05-09T12:55:15.150021 #3782525] INFO -- : reline 0.5.6 I, [2024-05-09T12:55:15.151166 #3782525] INFO -- : resolv 0.4.0 I, [2024-05-09T12:55:15.152274 #3782525] INFO -- : ruby2_keywords 0.0.5 I, [2024-05-09T12:55:15.153441 #3782525] INFO -- : securerandom 0.3.1 I, [2024-05-09T12:55:15.154524 #3782525] INFO -- : set 1.1.0 I, [2024-05-09T12:55:15.155628 #3782525] INFO -- : shellwords 0.2.0 I, [2024-05-09T12:55:15.156771 #3782525] INFO -- : singleton 0.2.0 I, [2024-05-09T12:55:15.157907 #3782525] INFO -- : syntax_suggest 2.0.0 I, [2024-05-09T12:55:15.160519 #3782525] INFO -- : tempfile 0.2.1 I, [2024-05-09T12:55:15.161703 #3782525] INFO -- : time 0.3.0 I, [2024-05-09T12:55:15.162814 #3782525] INFO -- : timeout 0.4.1 I, [2024-05-09T12:55:15.163901 #3782525] INFO -- : tmpdir 0.2.0 I, [2024-05-09T12:55:15.165099 #3782525] INFO -- : tsort 0.2.0 I, [2024-05-09T12:55:15.166207 #3782525] INFO -- : un 0.3.0 I, [2024-05-09T12:55:15.167288 #3782525] INFO -- : uri 0.13.0 I, [2024-05-09T12:55:15.168441 #3782525] INFO -- : weakref 0.1.3 I, [2024-05-09T12:55:15.169627 #3782525] INFO -- : yaml 0.3.0 I, [2024-05-09T12:55:15.170522 #3782525] INFO -- : installing default gems from ext: /home/opc/ruby/install/master/lib/ruby/gems/3.4.0+0 I, [2024-05-09T12:55:15.181456 #3782525] INFO -- : date 3.3.4 I, [2024-05-09T12:55:15.182590 #3782525] INFO -- : digest 3.1.1 I, [2024-05-09T12:55:15.183870 #3782525] INFO -- : etc 1.4.3 I, [2024-05-09T12:55:15.185062 #3782525] INFO -- : fcntl 1.1.0 I, [2024-05-09T12:55:15.186204 #3782525] INFO -- : fiddle 1.1.3 I, [2024-05-09T12:55:15.187301 #3782525] INFO -- : io-console 0.7.2 I, [2024-05-09T12:55:15.188390 #3782525] INFO -- : io-nonblock 0.3.0 I, [2024-05-09T12:55:15.189554 #3782525] INFO -- : io-wait 0.3.1 I, [2024-05-09T12:55:15.190617 #3782525] INFO -- : json 2.7.2 I, [2024-05-09T12:55:15.193339 #3782525] INFO -- : openssl 3.2.0 I, [2024-05-09T12:55:15.194471 #3782525] INFO -- : pathname 0.3.0 I, [2024-05-09T12:55:15.195611 #3782525] INFO -- : psych 5.1.2 I, [2024-05-09T12:55:15.196853 #3782525] INFO -- : stringio 3.1.1 I, [2024-05-09T12:55:15.198042 #3782525] INFO -- : strscan 3.1.1 I, [2024-05-09T12:55:15.199119 #3782525] INFO -- : zlib 3.1.0 I, [2024-05-09T12:55:15.200015 #3782525] INFO -- : installing bundled gems: /home/opc/ruby/install/master/lib/ruby/gems/3.4.0+0 I, [2024-05-09T12:55:15.200702 #3782525] INFO -- : minitest 5.22.3 I, [2024-05-09T12:55:15.214500 #3782525] INFO -- : rake 13.2.1 I, [2024-05-09T12:55:15.230503 #3782525] INFO -- : test-unit 3.6.2 I, [2024-05-09T12:55:15.246666 #3782525] INFO -- : rexml 3.2.6 I, [2024-05-09T12:55:15.260566 #3782525] INFO -- : rss 0.3.0 I, [2024-05-09T12:55:15.275370 #3782525] INFO -- : net-ftp 0.3.4 I, [2024-05-09T12:55:15.281021 #3782525] INFO -- : net-imap 0.4.11 I, [2024-05-09T12:55:15.292706 #3782525] INFO -- : net-pop 0.1.2 I, [2024-05-09T12:55:15.295163 #3782525] INFO -- : net-smtp 0.5.0 I, [2024-05-09T12:55:15.298520 #3782525] INFO -- : matrix 0.4.2 I, [2024-05-09T12:55:15.304525 #3782525] INFO -- : prime 0.1.2 I, [2024-05-09T12:55:15.315377 #3782525] INFO -- : rbs 3.4.4 I, [2024-05-09T12:55:15.416629 #3782525] INFO -- : typeprof 0.21.11 I, [2024-05-09T12:55:15.430048 #3782525] INFO -- : debug 1.9.2 I, [2024-05-09T12:55:15.442117 #3782525] INFO -- : racc 1.7.3 I, [2024-05-09T12:55:15.453486 #3782525] INFO -- : mutex_m 0.2.0 I, [2024-05-09T12:55:15.456175 #3782525] INFO -- : getoptlong 0.2.1 I, [2024-05-09T12:55:15.460717 #3782525] INFO -- : base64 0.2.0 I, [2024-05-09T12:55:15.463062 #3782525] INFO -- : bigdecimal 3.1.8 I, [2024-05-09T12:55:15.468644 #3782525] INFO -- : observer 0.1.2 I, [2024-05-09T12:55:15.471660 #3782525] INFO -- : abbrev 0.1.2 I, [2024-05-09T12:55:15.474448 #3782525] INFO -- : resolv-replace 0.1.1 I, [2024-05-09T12:55:15.478525 #3782525] INFO -- : rinda 0.2.0 I, [2024-05-09T12:55:15.481845 #3782525] INFO -- : drb 2.2.1 I, [2024-05-09T12:55:15.486652 #3782525] INFO -- : nkf 0.2.0 I, [2024-05-09T12:55:15.493065 #3782525] INFO -- : syslog 0.1.2 I, [2024-05-09T12:55:15.497352 #3782525] INFO -- : csv 3.3.0 I, [2024-05-09T12:55:15.509668 #3782525] INFO -- : installing bundled gem cache: /home/opc/ruby/install/master/lib/ruby/gems/3.4.0+0/cache I, [2024-05-09T12:55:15.511397 #3782525] INFO -- : skipped bundled gems: I, [2024-05-09T12:55:15.511422 #3782525] INFO -- : power_assert-2.0.4dev.gem not found in bundled_gems I, [2024-05-09T12:55:15.514583 #3782525] INFO -- : $$$[end] "make install -j3" exit with 0. I, [2024-05-09T12:55:15.514731 #3782525] INFO -- : $$$[beg] make yes-btest TESTOPTS='-q -j3' I, [2024-05-09T12:55:40.351652 #3782525] INFO -- : PASS all 1936 tests E, [2024-05-09T12:55:40.353422 #3782525] ERROR -- : I, [2024-05-09T12:55:40.353540 #3782525] INFO -- : $$$[end] "make yes-btest TESTOPTS='-q -j3'" exit with 0. I, [2024-05-09T12:55:40.353671 #3782525] INFO -- : $$$[beg] make yes-test-basic TESTS='-j3' I, [2024-05-09T12:55:40.446719 #3782525] INFO -- : BASERUBY = /usr/local/bin/ruby --disable=gems I, [2024-05-09T12:55:40.446794 #3782525] INFO -- : CC = gcc I, [2024-05-09T12:55:40.446805 #3782525] INFO -- : LD = ld I, [2024-05-09T12:55:40.446814 #3782525] INFO -- : LDSHARED = gcc -shared I, [2024-05-09T12:55:40.448238 #3782525] INFO -- : CFLAGS = -O3 -fno-fast-math -ggdb3 -Wall -Wextra -Wdeprecated-declarations -Wdiv-by-zero -Wduplicated-cond -Wimplicit-function-declaration -Wimplicit-int -Wpointer-arith -Wwrite-strings -Wold-style-definition -Wimplicit-fallthrough=0 -Wmissing-noreturn -Wno-cast-function-type -Wno-constant-logical-operand -Wno-long-long -Wno-missing-field-initializers -Wno-overlength-strings -Wno-packed-bitfield-compat -Wno-parentheses-equality -Wno-self-assign -Wno-tautological-compare -Wno-unused-parameter -Wno-unused-value -Wsuggest-attribute=format -Wsuggest-attribute=noreturn -Wunused-variable -Wmisleading-indentation -Wundef I, [2024-05-09T12:55:40.448256 #3782525] INFO -- : XCFLAGS = -U_FORTIFY_SOURCE -D_FORTIFY_SOURCE=2 -fstack-protector-strong -msign-return-address=all -fno-strict-overflow -fvisibility=hidden -fexcess-precision=standard -DRUBY_EXPORT -fPIE -I. -I.ext/include/aarch64-linux -I/home/opc/ruby/src/master/include -I/home/opc/ruby/src/master -I/home/opc/ruby/src/master/prism -I/home/opc/ruby/src/master/enc/unicode/15.0.0 I, [2024-05-09T12:55:40.448265 #3782525] INFO -- : CPPFLAGS = I, [2024-05-09T12:55:40.448274 #3782525] INFO -- : DLDFLAGS = -Wl,--compress-debug-sections=zlib -fstack-protector-strong -pie I, [2024-05-09T12:55:40.448283 #3782525] INFO -- : SOLIBS = -lz -lrt -lrt -ldl -lcrypt -lm -lpthread I, [2024-05-09T12:55:40.448291 #3782525] INFO -- : LANG = en_US.UTF-8 I, [2024-05-09T12:55:40.448299 #3782525] INFO -- : LC_ALL = I, [2024-05-09T12:55:40.448307 #3782525] INFO -- : LC_CTYPE = I, [2024-05-09T12:55:40.448315 #3782525] INFO -- : MFLAGS = I, [2024-05-09T12:55:40.448323 #3782525] INFO -- : RUSTC = rustc I, [2024-05-09T12:55:40.448332 #3782525] INFO -- : YJIT_RUSTC_ARGS = --crate-name=yjit --crate-type=staticlib --edition=2021 -g -C lto=thin -C opt-level=3 -C overflow-checks=on '--out-dir=/home/opc/ruby/build/master/yjit/target/release/' /home/opc/ruby/src/master/yjit/src/lib.rs I, [2024-05-09T12:55:40.448340 #3782525] INFO -- : gcc (GCC) 8.5.0 20210514 (Red Hat 8.5.0-10.1.0.1) I, [2024-05-09T12:55:40.448349 #3782525] INFO -- : Copyright (C) 2018 Free Software Foundation, Inc. I, [2024-05-09T12:55:40.448357 #3782525] INFO -- : This is free software; see the source for copying conditions. There is NO I, [2024-05-09T12:55:40.448365 #3782525] INFO -- : warranty; not even for MERCHANTABILITY or FITNESS FOR A PARTICULAR PURPOSE. I, [2024-05-09T12:55:40.448373 #3782525] INFO -- : I, [2024-05-09T12:55:40.602990 #3782525] INFO -- : Checking leaked global symbols...none I, [2024-05-09T12:55:40.655289 #3782525] INFO -- : /home/opc/ruby/src/master/basictest/test.rb:assignment ....................................................................................................................................................................................................................................................................................................................................................................................OK 372 I, [2024-05-09T12:55:40.655362 #3782525] INFO -- : /home/opc/ruby/src/master/basictest/test.rb:condition ..OK 2 I, [2024-05-09T12:55:40.655377 #3782525] INFO -- : /home/opc/ruby/src/master/basictest/test.rb:if/unless ...OK 3 I, [2024-05-09T12:55:40.655430 #3782525] INFO -- : /home/opc/ruby/src/master/basictest/test.rb:case .....OK 5 I, [2024-05-09T12:55:40.655994 #3782525] INFO -- : /home/opc/ruby/src/master/basictest/test.rb:while/until ........OK 8 I, [2024-05-09T12:55:40.656112 #3782525] INFO -- : /home/opc/ruby/src/master/basictest/test.rb:exception ..........OK 10 I, [2024-05-09T12:55:40.656764 #3782525] INFO -- : /home/opc/ruby/src/master/basictest/test.rb:array .......................................OK 39 I, [2024-05-09T12:55:40.656999 #3782525] INFO -- : /home/opc/ruby/src/master/basictest/test.rb:hash ...........................OK 27 I, [2024-05-09T12:55:40.658655 #3782525] INFO -- : /home/opc/ruby/src/master/basictest/test.rb:iterator ...........................................................................................................OK 107 I, [2024-05-09T12:55:40.659375 #3782525] INFO -- : /home/opc/ruby/src/master/basictest/test.rb:float ................................................................................OK 80 I, [2024-05-09T12:55:40.662948 #3782525] INFO -- : /home/opc/ruby/src/master/basictest/test.rb:bignum ...............................OK 31 I, [2024-05-09T12:55:40.664552 #3782525] INFO -- : /home/opc/ruby/src/master/basictest/test.rb:string & char ..............................................................OK 62 I, [2024-05-09T12:55:40.664630 #3782525] INFO -- : /home/opc/ruby/src/master/basictest/test.rb:assignment ..........OK 10 I, [2024-05-09T12:55:40.664700 #3782525] INFO -- : /home/opc/ruby/src/master/basictest/test.rb:call ......OK 6 I, [2024-05-09T12:55:40.664892 #3782525] INFO -- : /home/opc/ruby/src/master/basictest/test.rb:proc .........OK 9 I, [2024-05-09T12:55:40.765155 #3782525] INFO -- : /home/opc/ruby/src/master/basictest/test.rb:signal ..OK 2 I, [2024-05-09T12:55:40.766766 #3782525] INFO -- : /home/opc/ruby/src/master/basictest/test.rb:eval ...........................OK 27 I, [2024-05-09T12:55:40.898245 #3782525] INFO -- : /home/opc/ruby/src/master/basictest/test.rb:system ........OK 8 I, [2024-05-09T12:55:40.898313 #3782525] INFO -- : /home/opc/ruby/src/master/basictest/test.rb:const .....OK 5 I, [2024-05-09T12:55:40.898415 #3782525] INFO -- : /home/opc/ruby/src/master/basictest/test.rb:clone .....OK 5 I, [2024-05-09T12:55:40.898595 #3782525] INFO -- : /home/opc/ruby/src/master/basictest/test.rb:marshal ....OK 4 I, [2024-05-09T12:55:40.898671 #3782525] INFO -- : /home/opc/ruby/src/master/basictest/test.rb:pack ....OK 4 I, [2024-05-09T12:55:40.898702 #3782525] INFO -- : /home/opc/ruby/src/master/basictest/test.rb:math ..OK 2 I, [2024-05-09T12:55:40.898791 #3782525] INFO -- : /home/opc/ruby/src/master/basictest/test.rb:struct ......OK 6 I, [2024-05-09T12:55:40.898957 #3782525] INFO -- : /home/opc/ruby/src/master/basictest/test.rb:variable ............OK 12 I, [2024-05-09T12:55:40.898998 #3782525] INFO -- : /home/opc/ruby/src/master/basictest/test.rb:trace ...OK 3 I, [2024-05-09T12:55:40.899148 #3782525] INFO -- : /home/opc/ruby/src/master/basictest/test.rb:defined? ............OK 12 I, [2024-05-09T12:55:40.899234 #3782525] INFO -- : /home/opc/ruby/src/master/basictest/test.rb:alias ......OK 6 I, [2024-05-09T12:55:40.899751 #3782525] INFO -- : /home/opc/ruby/src/master/basictest/test.rb:path .......................OK 23 I, [2024-05-09T12:55:40.967242 #3782525] INFO -- : /home/opc/ruby/src/master/basictest/test.rb:gc ....OK 4 I, [2024-05-09T12:55:40.969179 #3782525] INFO -- : I, [2024-05-09T12:55:40.969216 #3782525] INFO -- : test succeeded I, [2024-05-09T12:55:40.969773 #3782525] INFO -- : $$$[end] "make yes-test-basic TESTS='-j3'" exit with 0. I, [2024-05-09T12:55:40.969967 #3782525] INFO -- : $$$[beg] make yes-test-all TESTOPTS='--stderr-on-failure' TESTS='-j3' I, [2024-05-09T12:55:41.094773 #3782525] INFO -- : BASERUBY = /usr/local/bin/ruby --disable=gems I, [2024-05-09T12:55:41.094850 #3782525] INFO -- : CC = gcc I, [2024-05-09T12:55:41.094862 #3782525] INFO -- : LD = ld I, [2024-05-09T12:55:41.094874 #3782525] INFO -- : LDSHARED = gcc -shared I, [2024-05-09T12:55:41.094885 #3782525] INFO -- : CFLAGS = -O3 -fno-fast-math -ggdb3 -Wall -Wextra -Wdeprecated-declarations -Wdiv-by-zero -Wduplicated-cond -Wimplicit-function-declaration -Wimplicit-int -Wpointer-arith -Wwrite-strings -Wold-style-definition -Wimplicit-fallthrough=0 -Wmissing-noreturn -Wno-cast-function-type -Wno-constant-logical-operand -Wno-long-long -Wno-missing-field-initializers -Wno-overlength-strings -Wno-packed-bitfield-compat -Wno-parentheses-equality -Wno-self-assign -Wno-tautological-compare -Wno-unused-parameter -Wno-unused-value -Wsuggest-attribute=format -Wsuggest-attribute=noreturn -Wunused-variable -Wmisleading-indentation -Wundef I, [2024-05-09T12:55:41.094895 #3782525] INFO -- : XCFLAGS = -U_FORTIFY_SOURCE -D_FORTIFY_SOURCE=2 -fstack-protector-strong -msign-return-address=all -fno-strict-overflow -fvisibility=hidden -fexcess-precision=standard -DRUBY_EXPORT -fPIE -I. -I.ext/include/aarch64-linux -I/home/opc/ruby/src/master/include -I/home/opc/ruby/src/master -I/home/opc/ruby/src/master/prism -I/home/opc/ruby/src/master/enc/unicode/15.0.0 I, [2024-05-09T12:55:41.094905 #3782525] INFO -- : CPPFLAGS = I, [2024-05-09T12:55:41.094914 #3782525] INFO -- : DLDFLAGS = -Wl,--compress-debug-sections=zlib -fstack-protector-strong -pie I, [2024-05-09T12:55:41.094924 #3782525] INFO -- : SOLIBS = -lz -lrt -lrt -ldl -lcrypt -lm -lpthread I, [2024-05-09T12:55:41.094933 #3782525] INFO -- : LANG = en_US.UTF-8 I, [2024-05-09T12:55:41.094941 #3782525] INFO -- : LC_ALL = I, [2024-05-09T12:55:41.094950 #3782525] INFO -- : LC_CTYPE = I, [2024-05-09T12:55:41.094958 #3782525] INFO -- : MFLAGS = I, [2024-05-09T12:55:41.094967 #3782525] INFO -- : RUSTC = rustc I, [2024-05-09T12:55:41.094975 #3782525] INFO -- : YJIT_RUSTC_ARGS = --crate-name=yjit --crate-type=staticlib --edition=2021 -g -C lto=thin -C opt-level=3 -C overflow-checks=on '--out-dir=/home/opc/ruby/build/master/yjit/target/release/' /home/opc/ruby/src/master/yjit/src/lib.rs I, [2024-05-09T12:55:41.095776 #3782525] INFO -- : gcc (GCC) 8.5.0 20210514 (Red Hat 8.5.0-10.1.0.1) I, [2024-05-09T12:55:41.095816 #3782525] INFO -- : Copyright (C) 2018 Free Software Foundation, Inc. I, [2024-05-09T12:55:41.095827 #3782525] INFO -- : This is free software; see the source for copying conditions. There is NO I, [2024-05-09T12:55:41.095837 #3782525] INFO -- : warranty; not even for MERCHANTABILITY or FITNESS FOR A PARTICULAR PURPOSE. I, [2024-05-09T12:55:41.095846 #3782525] INFO -- : I, [2024-05-09T12:55:41.097811 #3782525] INFO -- : generating enc.mk I, [2024-05-09T12:55:41.336159 #3782525] INFO -- : generating encdb.h I, [2024-05-09T12:55:41.372464 #3782525] INFO -- : encdb.h unchanged I, [2024-05-09T12:55:41.373673 #3782525] INFO -- : making enc I, [2024-05-09T12:55:41.400936 #3782525] INFO -- : make[1]: Entering directory '/home/opc/ruby/build/master' I, [2024-05-09T12:55:41.400999 #3782525] INFO -- : make[1]: Nothing to be done for 'enc'. I, [2024-05-09T12:55:41.401010 #3782525] INFO -- : make[1]: Leaving directory '/home/opc/ruby/build/master' I, [2024-05-09T12:55:41.401726 #3782525] INFO -- : making srcs under enc I, [2024-05-09T12:55:41.443357 #3782525] INFO -- : make[1]: Entering directory '/home/opc/ruby/build/master' I, [2024-05-09T12:55:41.443452 #3782525] INFO -- : make[1]: Nothing to be done for 'srcs'. I, [2024-05-09T12:55:41.443472 #3782525] INFO -- : make[1]: Leaving directory '/home/opc/ruby/build/master' I, [2024-05-09T12:55:41.444465 #3782525] INFO -- : generating transdb.h I, [2024-05-09T12:55:41.586663 #3782525] INFO -- : transdb.h unchanged I, [2024-05-09T12:55:41.587999 #3782525] INFO -- : making trans I, [2024-05-09T12:55:41.636431 #3782525] INFO -- : make[1]: Entering directory '/home/opc/ruby/build/master' I, [2024-05-09T12:55:41.636547 #3782525] INFO -- : make[1]: Nothing to be done for 'trans'. I, [2024-05-09T12:55:41.636571 #3782525] INFO -- : make[1]: Leaving directory '/home/opc/ruby/build/master' I, [2024-05-09T12:55:41.637282 #3782525] INFO -- : making encs I, [2024-05-09T12:55:41.689493 #3782525] INFO -- : make[1]: Entering directory '/home/opc/ruby/build/master' I, [2024-05-09T12:55:41.689543 #3782525] INFO -- : make[1]: Nothing to be done for 'encs'. I, [2024-05-09T12:55:41.689554 #3782525] INFO -- : make[1]: Leaving directory '/home/opc/ruby/build/master' I, [2024-05-09T12:55:41.691556 #3782525] INFO -- : generating makefiles ext/configure-ext.mk I, [2024-05-09T12:55:41.732116 #3782525] INFO -- : ext/configure-ext.mk updated I, [2024-05-09T12:55:41.735266 #3782525] INFO -- : make[1]: Entering directory '/home/opc/ruby/build/master' I, [2024-05-09T12:55:43.780893 #3782525] INFO -- : make[1]: Leaving directory '/home/opc/ruby/build/master' I, [2024-05-09T12:55:43.781648 #3782525] INFO -- : generating makefile exts.mk I, [2024-05-09T12:55:43.840077 #3782525] INFO -- : exts.mk unchanged I, [2024-05-09T12:55:43.844913 #3782525] INFO -- : make[1]: Entering directory '/home/opc/ruby/build/master' I, [2024-05-09T12:55:44.141346 #3782525] INFO -- : make[2]: Entering directory '/home/opc/ruby/build/master/ext/coverage' I, [2024-05-09T12:55:44.146058 #3782525] INFO -- : make[2]: Leaving directory '/home/opc/ruby/build/master/ext/coverage' I, [2024-05-09T12:55:44.151551 #3782525] INFO -- : make[2]: Entering directory '/home/opc/ruby/build/master/ext/date' I, [2024-05-09T12:55:44.156903 #3782525] INFO -- : make[2]: Leaving directory '/home/opc/ruby/build/master/ext/date' I, [2024-05-09T12:55:44.160175 #3782525] INFO -- : make[2]: Entering directory '/home/opc/ruby/build/master/ext/digest' I, [2024-05-09T12:55:44.168944 #3782525] INFO -- : make[2]: Leaving directory '/home/opc/ruby/build/master/ext/digest' I, [2024-05-09T12:55:44.191641 #3782525] INFO -- : make[2]: Entering directory '/home/opc/ruby/build/master/ext/digest/sha2' I, [2024-05-09T12:55:44.196574 #3782525] INFO -- : make[2]: Leaving directory '/home/opc/ruby/build/master/ext/digest/sha2' I, [2024-05-09T12:55:44.214456 #3782525] INFO -- : make[2]: Entering directory '/home/opc/ruby/build/master/ext/fiddle' I, [2024-05-09T12:55:44.224405 #3782525] INFO -- : make[2]: Leaving directory '/home/opc/ruby/build/master/ext/fiddle' I, [2024-05-09T12:55:44.228642 #3782525] INFO -- : make[2]: Entering directory '/home/opc/ruby/build/master/ext/io/console' I, [2024-05-09T12:55:44.232843 #3782525] INFO -- : make[2]: Leaving directory '/home/opc/ruby/build/master/ext/io/console' I, [2024-05-09T12:55:44.243584 #3782525] INFO -- : make[2]: Entering directory '/home/opc/ruby/build/master/ext/json' I, [2024-05-09T12:55:44.252957 #3782525] INFO -- : make[2]: Leaving directory '/home/opc/ruby/build/master/ext/json' I, [2024-05-09T12:55:44.265992 #3782525] INFO -- : make[2]: Entering directory '/home/opc/ruby/build/master/ext/monitor' I, [2024-05-09T12:55:44.270147 #3782525] INFO -- : make[2]: Leaving directory '/home/opc/ruby/build/master/ext/monitor' I, [2024-05-09T12:55:44.276053 #3782525] INFO -- : make[2]: Entering directory '/home/opc/ruby/build/master/ext/objspace' I, [2024-05-09T12:55:44.282263 #3782525] INFO -- : make[2]: Leaving directory '/home/opc/ruby/build/master/ext/objspace' I, [2024-05-09T12:55:44.301044 #3782525] INFO -- : make[2]: Entering directory '/home/opc/ruby/build/master/ext/openssl' I, [2024-05-09T12:55:44.322712 #3782525] INFO -- : make[2]: Leaving directory '/home/opc/ruby/build/master/ext/openssl' I, [2024-05-09T12:55:44.326891 #3782525] INFO -- : make[2]: Entering directory '/home/opc/ruby/build/master/ext/pathname' I, [2024-05-09T12:55:44.331094 #3782525] INFO -- : make[2]: Leaving directory '/home/opc/ruby/build/master/ext/pathname' I, [2024-05-09T12:55:44.337403 #3782525] INFO -- : make[2]: Entering directory '/home/opc/ruby/build/master/ext/psych' I, [2024-05-09T12:55:44.358568 #3782525] INFO -- : make[2]: Leaving directory '/home/opc/ruby/build/master/ext/psych' I, [2024-05-09T12:55:44.362971 #3782525] INFO -- : make[2]: Entering directory '/home/opc/ruby/build/master/ext/pty' I, [2024-05-09T12:55:44.367091 #3782525] INFO -- : make[2]: Leaving directory '/home/opc/ruby/build/master/ext/pty' I, [2024-05-09T12:55:44.380375 #3782525] INFO -- : make[2]: Entering directory '/home/opc/ruby/build/master/ext/ripper' I, [2024-05-09T12:55:44.388064 #3782525] INFO -- : make[2]: Leaving directory '/home/opc/ruby/build/master/ext/ripper' I, [2024-05-09T12:55:44.390019 #3782525] INFO -- : make[2]: Entering directory '/home/opc/ruby/build/master/ext/rubyvm' I, [2024-05-09T12:55:44.393350 #3782525] INFO -- : make[2]: Leaving directory '/home/opc/ruby/build/master/ext/rubyvm' I, [2024-05-09T12:55:44.405394 #3782525] INFO -- : make[2]: Entering directory '/home/opc/ruby/build/master/ext/socket' I, [2024-05-09T12:55:44.416011 #3782525] INFO -- : make[2]: Leaving directory '/home/opc/ruby/build/master/ext/socket' I, [2024-05-09T12:55:44.431479 #3782525] INFO -- : make[2]: Entering directory '/home/opc/ruby/build/master/.bundle/gems/bigdecimal-3.1.7/ext/bigdecimal' I, [2024-05-09T12:55:44.461800 #3782525] INFO -- : make[2]: Leaving directory '/home/opc/ruby/build/master/.bundle/gems/bigdecimal-3.1.7/ext/bigdecimal' I, [2024-05-09T12:55:44.464661 #3782525] INFO -- : make[2]: Entering directory '/home/opc/ruby/build/master/.bundle/gems/bigdecimal-3.1.8/ext/bigdecimal' I, [2024-05-09T12:55:44.495099 #3782525] INFO -- : make[2]: Leaving directory '/home/opc/ruby/build/master/.bundle/gems/bigdecimal-3.1.8/ext/bigdecimal' I, [2024-05-09T12:55:44.497750 #3782525] INFO -- : make[2]: Entering directory '/home/opc/ruby/build/master/.bundle/gems/debug-1.9.2/ext/debug' I, [2024-05-09T12:55:44.527750 #3782525] INFO -- : make[2]: Leaving directory '/home/opc/ruby/build/master/.bundle/gems/debug-1.9.2/ext/debug' I, [2024-05-09T12:55:44.530338 #3782525] INFO -- : make[2]: Entering directory '/home/opc/ruby/build/master/.bundle/gems/nkf-0.2.0/ext/nkf' I, [2024-05-09T12:55:44.560309 #3782525] INFO -- : make[2]: Leaving directory '/home/opc/ruby/build/master/.bundle/gems/nkf-0.2.0/ext/nkf' I, [2024-05-09T12:55:44.562819 #3782525] INFO -- : make[2]: Entering directory '/home/opc/ruby/build/master/.bundle/gems/racc-1.7.3/ext/racc/cparse' I, [2024-05-09T12:55:44.593319 #3782525] INFO -- : make[2]: Leaving directory '/home/opc/ruby/build/master/.bundle/gems/racc-1.7.3/ext/racc/cparse' I, [2024-05-09T12:55:44.596193 #3782525] INFO -- : make[2]: Entering directory '/home/opc/ruby/build/master/.bundle/gems/rbs-3.4.4/ext/rbs_extension' I, [2024-05-09T12:55:44.626133 #3782525] INFO -- : make[2]: Leaving directory '/home/opc/ruby/build/master/.bundle/gems/rbs-3.4.4/ext/rbs_extension' I, [2024-05-09T12:55:44.628668 #3782525] INFO -- : make[2]: Entering directory '/home/opc/ruby/build/master/.bundle/gems/syslog-0.1.2/ext/syslog' I, [2024-05-09T12:55:44.659007 #3782525] INFO -- : make[2]: Leaving directory '/home/opc/ruby/build/master/.bundle/gems/syslog-0.1.2/ext/syslog' I, [2024-05-09T12:55:44.696976 #3782525] INFO -- : make[2]: Entering directory '/home/opc/ruby/build/master' I, [2024-05-09T12:55:44.780513 #3782525] INFO -- : make[2]: 'ruby' is up to date. I, [2024-05-09T12:55:44.780608 #3782525] INFO -- : make[2]: Leaving directory '/home/opc/ruby/build/master' I, [2024-05-09T12:55:44.780721 #3782525] INFO -- : make[1]: Leaving directory '/home/opc/ruby/build/master' I, [2024-05-09T12:55:44.784993 #3782525] INFO -- : make[1]: Entering directory '/home/opc/ruby/build/master' I, [2024-05-09T12:55:44.785044 #3782525] INFO -- : make[1]: Nothing to be done for 'note'. I, [2024-05-09T12:55:44.785058 #3782525] INFO -- : make[1]: Leaving directory '/home/opc/ruby/build/master' I, [2024-05-09T12:55:44.898154 #3782525] INFO -- : Run options: I, [2024-05-09T12:55:44.898229 #3782525] INFO -- : --seed=51576 I, [2024-05-09T12:55:44.898241 #3782525] INFO -- : "--ruby=./miniruby -I/home/opc/ruby/src/master/lib -I. -I.ext/common /home/opc/ruby/src/master/tool/runruby.rb --extout=.ext -- --disable-gems" I, [2024-05-09T12:55:44.898251 #3782525] INFO -- : --excludes-dir=/home/opc/ruby/src/master/test/.excludes I, [2024-05-09T12:55:44.898260 #3782525] INFO -- : --name=!/memory_leak/ I, [2024-05-09T12:55:44.898269 #3782525] INFO -- : --stderr-on-failure I, [2024-05-09T12:55:44.898277 #3782525] INFO -- : -j3 I, [2024-05-09T12:55:44.898286 #3782525] INFO -- : I, [2024-05-09T12:55:44.898295 #3782525] INFO -- : # Running tests: I, [2024-05-09T12:55:44.898304 #3782525] INFO -- : I, [2024-05-09T12:55:45.026447 #3782525] INFO -- : [ 1/885] 3823422=test_rdoc_encoding I, [2024-05-09T12:55:45.029771 #3782525] INFO -- : [ 2/885] 3823421=test_win32ole_variant_outarg I, [2024-05-09T12:55:45.034919 #3782525] INFO -- : [ 3/885] 3823421=test_key_actor_vi I, [2024-05-09T12:55:45.088281 #3782525] INFO -- : [ 4/885] 3823423=test_postponed_job I, [2024-05-09T12:55:45.178179 #3782525] INFO -- : [ 5/885] 3823422=test_gem_request_set_lockfile I, [2024-05-09T12:55:45.200337 #3782525] INFO -- : [ 6/885] 3823421=test_rdoc_markdown I, [2024-05-09T12:55:45.352692 #3782525] INFO -- : [ 7/885] 3823423=test_httpresponses I, [2024-05-09T12:55:45.412865 #3782525] INFO -- : [ 8/885] 3823423=test_rdoc_constant I, [2024-05-09T12:55:45.544580 #3782525] INFO -- : [ 9/885] 3823421=test_deprecate I, [2024-05-09T12:55:45.679163 #3782525] INFO -- : [ 10/885] 3823423=test_generic I, [2024-05-09T12:55:45.719098 #3782525] INFO -- : [ 11/885] 3823423=test_rdoc_markup_to_html_snippet I, [2024-05-09T12:55:45.744011 #3782525] INFO -- : [ 12/885] 3823421=test_common I, [2024-05-09T12:55:45.800544 #3782525] INFO -- : [ 13/885] 3823423=test_require I, [2024-05-09T12:55:45.806273 #3782525] INFO -- : [ 14/885] 3823423=test_stringify_symbols I, [2024-05-09T12:55:45.821970 #3782525] INFO -- : [ 15/885] 3823423=test_objspace I, [2024-05-09T12:55:45.881448 #3782525] INFO -- : [ 16/885] 3823422=test_rdoc_text I, [2024-05-09T12:55:45.934958 #3782525] INFO -- : [ 17/885] 3823421=library_symbols_test I, [2024-05-09T12:55:45.945559 #3782525] INFO -- : [ 18/885] 3823422=test_rdoc_markup_indented_paragraph I, [2024-05-09T12:55:45.956977 #3782525] INFO -- : [ 19/885] 3823422=test_iseq_load I, [2024-05-09T12:55:46.031365 #3782525] INFO -- : [ 20/885] 3823421=test_rdoc_markup_parser I, [2024-05-09T12:55:46.117723 #3782525] INFO -- : [ 21/885] 3823421=test_stream I, [2024-05-09T12:55:46.474782 #3782525] INFO -- : [ 22/885] 3823421=test_have_library I, [2024-05-09T12:55:47.087173 #3782525] INFO -- : [ 23/885] 3823422=test_ns_spki I, [2024-05-09T12:55:47.100596 #3782525] INFO -- : [ 24/885] 3823422=test_gem_doctor I, [2024-05-09T12:55:47.113780 #3782525] INFO -- : [ 25/885] 3823421=json_fixtures_test I, [2024-05-09T12:55:47.126278 #3782525] INFO -- : [ 26/885] 3823421=test_len I, [2024-05-09T12:55:47.131051 #3782525] INFO -- : [ 27/885] 3823421=test_kwargs I, [2024-05-09T12:55:47.137722 #3782525] INFO -- : [ 28/885] 3823421=test_rdoc_parser_c I, [2024-05-09T12:55:47.167247 #3782525] INFO -- : [ 29/885] 3823422=test_pack I, [2024-05-09T12:55:47.347922 #3782525] INFO -- : [ 30/885] 3823421=test_io_wait I, [2024-05-09T12:55:47.449495 #3782525] INFO -- : [ 31/885] 3823422=parse_test I, [2024-05-09T12:55:47.680296 #3782525] INFO -- : [ 32/885] 3823421=test_tsort I, [2024-05-09T12:55:47.712074 #3782525] INFO -- : [ 33/885] 3823421=test_typeddata I, [2024-05-09T12:55:47.960447 #3782525] INFO -- : [ 34/885] 3823421=test_gem_commands_fetch_command I, [2024-05-09T12:55:48.178966 #3782525] INFO -- : [ 35/885] 3823421=test_securerandom I, [2024-05-09T12:55:48.225217 #3782525] INFO -- : [ 36/885] 3823421=test_gem_commands_outdated_command I, [2024-05-09T12:55:48.281636 #3782525] INFO -- : [ 37/885] 3823421=test_gem_dependency_list I, [2024-05-09T12:55:48.402442 #3782525] INFO -- : [ 38/885] 3823421=test_rdoc_parser_changelog I, [2024-05-09T12:55:48.468056 #3782525] INFO -- : [ 39/885] 3823421=parameters_signature_test I, [2024-05-09T12:55:48.474834 #3782525] INFO -- : [ 40/885] 3823421=redundant_return_test I, [2024-05-09T12:55:48.492048 #3782525] INFO -- : [ 41/885] 3823421=test_rand I, [2024-05-09T12:55:48.740254 #3782525] INFO -- : [ 42/885] 3823421=test_string_processing I, [2024-05-09T12:55:48.744628 #3782525] INFO -- : [ 43/885] 3823421=test_random_formatter I, [2024-05-09T12:55:48.745007 #3782525] INFO -- : [ 44/885] 3823421=test_rdoc_markup_attributes I, [2024-05-09T12:55:48.749511 #3782525] INFO -- : [ 45/885] 3823421=test_rdoc_code_object I, [2024-05-09T12:55:49.089636 #3782525] INFO -- : [ 46/885] 3823421=test_process I, [2024-05-09T12:55:50.224209 #3782525] INFO -- : [ 47/885] 3823422=test_gem_source_specific_file I, [2024-05-09T12:55:50.311431 #3782525] INFO -- : [ 48/885] 3823422=test_provider I, [2024-05-09T12:55:50.319701 #3782525] INFO -- : [ 49/885] 3823422=test_euc_kr I, [2024-05-09T12:55:50.327190 #3782525] INFO -- : [ 50/885] 3823422=test_bmethod I, [2024-05-09T12:55:50.334682 #3782525] INFO -- : [ 51/885] 3823422=test_null I, [2024-05-09T12:55:50.360527 #3782525] INFO -- : [ 52/885] 3823422=test_ractor.Leaked file descriptor: TestProcess#test_execopts_uid: 9 # I, [2024-05-09T12:55:50.386111 #3782525] INFO -- : COMMAND PID USER FD TYPE DEVICE SIZE/OFF NODE NAME I, [2024-05-09T12:55:50.386186 #3782525] INFO -- : ruby 3823421 opc 9r REG 252,0 9253600 13705411 /var/lib/sss/mc/passwd I, [2024-05-09T12:55:50.393192 #3782525] INFO -- : I, [2024-05-09T12:55:50.403563 #3782525] INFO -- : [ 53/885] 3823422=test_data I, [2024-05-09T12:55:50.411253 #3782525] INFO -- : [ 54/885] 3823422=test_memory_view I, [2024-05-09T12:55:50.434297 #3782525] INFO -- : [ 55/885] 3823422=test_multi_irb_commands I, [2024-05-09T12:55:50.445721 #3782525] INFO -- : [ 56/885] 3823422=test_pkey_dh I, [2024-05-09T12:55:51.353502 #3782525] INFO -- : Leaked file descriptor: TestProcess#test_uid_from_name: 10 # I, [2024-05-09T12:55:51.381428 #3782525] INFO -- : COMMAND PID USER FD TYPE DEVICE SIZE/OFF NODE NAME I, [2024-05-09T12:55:51.381498 #3782525] INFO -- : ruby 3823421 opc 10u unix 0x0000000000000000 0t0 2905862919 type=STREAM I, [2024-05-09T12:55:51.888050 #3782525] INFO -- : [ 57/885] 3823422=test_m17n_comb I, [2024-05-09T12:55:54.069452 #3782525] INFO -- : [ 58/885] 3823423=test_win32ole_typelib I, [2024-05-09T12:55:54.069848 #3782525] INFO -- : [ 59/885] 3823423=test_pkey I, [2024-05-09T12:55:54.077620 #3782525] INFO -- : [ 60/885] 3823422=test_external_new I, [2024-05-09T12:55:54.083574 #3782525] INFO -- : [ 61/885] 3823422=test_bigzero I, [2024-05-09T12:55:54.100586 #3782525] INFO -- : [ 62/885] 3823422=test_gem_platform I, [2024-05-09T12:55:54.104933 #3782525] INFO -- : [ 63/885] 3823423=test_gem_commands_query_command I, [2024-05-09T12:55:54.201967 #3782525] INFO -- : [ 64/885] 3823422=test_gem_unsatisfiable_dependency_error I, [2024-05-09T12:55:54.218983 #3782525] INFO -- : [ 65/885] 3823422=test_literal I, [2024-05-09T12:55:54.762556 #3782525] INFO -- : [ 66/885] 3823422=test_thread I, [2024-05-09T12:55:54.898332 #3782525] INFO -- : [ 67/885] 3823423=test_config I, [2024-05-09T12:55:54.948546 #3782525] INFO -- : [ 68/885] 3823423=test_complex2 I, [2024-05-09T12:55:54.956881 #3782525] INFO -- : [ 69/885] 3823423=test_gem_security_signer I, [2024-05-09T12:55:54.995149 #3782525] INFO -- : [ 70/885] 3823422=test_gem_util I, [2024-05-09T12:55:55.081117 #3782525] INFO -- : [ 71/885] 3823423=test_input_method I, [2024-05-09T12:55:55.144577 #3782525] INFO -- : [ 72/885] 3823422=test_io I, [2024-05-09T12:55:55.187886 #3782525] INFO -- : [ 73/885] 3823423=test_rdoc_i18n_text I, [2024-05-09T12:55:55.196897 #3782525] INFO -- : [ 74/885] 3823423=test_rdoc_context_section I, [2024-05-09T12:55:55.207579 #3782525] INFO -- : [ 75/885] 3823423=test_io_buffer I, [2024-05-09T12:55:55.342038 #3782525] INFO -- : [ 76/885] 3823423=test_deprecated I, [2024-05-09T12:55:55.347966 #3782525] INFO -- : [ 77/885] 3823423=test_optparse I, [2024-05-09T12:55:55.367871 #3782525] INFO -- : [ 78/885] 3823422=test_bash_completion I, [2024-05-09T12:55:55.389891 #3782525] INFO -- : [ 79/885] 3823422=test_exception I, [2024-05-09T12:55:55.447604 #3782525] INFO -- : [ 80/885] 3823423=test_files_test_2 I, [2024-05-09T12:55:57.400957 #3782525] INFO -- : [ 81/885] 3823422=test_div I, [2024-05-09T12:55:57.410352 #3782525] INFO -- : [ 82/885] 3823422=test_rdoc_markup_to_html_crossref I, [2024-05-09T12:55:57.699439 #3782525] INFO -- : [ 83/885] 3823422=test_syntax I, [2024-05-09T12:55:57.983516 #3782525] INFO -- : [ 84/885] 3823423=test_scalar I, [2024-05-09T12:55:57.993644 #3782525] INFO -- : [ 85/885] 3823423=test_class_name_check I, [2024-05-09T12:55:58.018363 #3782525] INFO -- : [ 86/885] 3823423=test_basicsocket I, [2024-05-09T12:55:58.048207 #3782525] INFO -- : [ 87/885] 3823423=test_zsh_completion I, [2024-05-09T12:55:58.058232 #3782525] INFO -- : [ 88/885] 3823423=test_gem_commands_environment_command I, [2024-05-09T12:55:58.119624 #3782525] INFO -- : [ 89/885] 3823423=test_pkcs7 I, [2024-05-09T12:55:58.298879 #3782525] INFO -- : [ 90/885] 3823423=test_pack I, [2024-05-09T12:55:58.466141 #3782525] INFO -- : [ 91/885] 3823423=test_gem_commands_stale_command I, [2024-05-09T12:55:58.482052 #3782525] INFO -- : [ 92/885] 3823423=ruby_parser_test I, [2024-05-09T12:55:58.538159 #3782525] INFO -- : [ 93/885] 3823423=test_rdoc_markup_to_tt_only I, [2024-05-09T12:55:58.663687 #3782525] INFO -- : [ 94/885] 3823423=test_date_strftime I, [2024-05-09T12:55:58.723719 #3782525] INFO -- : .Leaked file descriptor: TestProcess#test_gid_from_name: 11 # I, [2024-05-09T12:55:58.753152 #3782525] INFO -- : COMMAND PID USER FD TYPE DEVICE SIZE/OFF NODE NAME I, [2024-05-09T12:55:58.753217 #3782525] INFO -- : ruby 3823421 opc 11r REG 252,0 6940392 13705429 /var/lib/sss/mc/group I, [2024-05-09T12:55:59.008297 #3782525] INFO -- : [ 95/885] 3823423=json_parser_test I, [2024-05-09T12:55:59.063742 #3782525] INFO -- : [ 96/885] 3823423=test_ws I, [2024-05-09T12:55:59.070462 #3782525] INFO -- : [ 97/885] 3823423=test_gem_commands_cert_command I, [2024-05-09T12:56:01.141679 #3782525] INFO -- : [ 98/885] 3823423=test_singleton I, [2024-05-09T12:56:01.193605 #3782525] INFO -- : [ 99/885] 3823423=test_fstring I, [2024-05-09T12:56:01.258389 #3782525] INFO -- : [100/885] 3823423=test_numeric I, [2024-05-09T12:56:01.271045 #3782525] INFO -- : [101/885] 3823423=test_rdoc_require I, [2024-05-09T12:56:01.284522 #3782525] INFO -- : [102/885] 3823423=test_gem_ext_rake_builder I, [2024-05-09T12:56:01.890219 #3782525] INFO -- : [103/885] 3823423=test_word I, [2024-05-09T12:56:01.942468 #3782525] INFO -- : [104/885] 3823423=test_timeout I, [2024-05-09T12:56:02.706560 #3782525] INFO -- : [105/885] 3823423=test_rdoc_markup_to_bs I, [2024-05-09T12:56:02.751460 #3782525] INFO -- : [106/885] 3823423=test_key_name_check I, [2024-05-09T12:56:02.755144 #3782525] INFO -- : [107/885] 3823423=test_rdoc_markup_raw I, [2024-05-09T12:56:03.176329 #3782525] INFO -- : [108/885] 3823423=test_instrumentation_api I, [2024-05-09T12:56:03.368044 #3782525] INFO -- : [109/885] 3823422=test_weakref I, [2024-05-09T12:56:03.479175 #3782525] INFO -- : [110/885] 3823422=test_rdoc_alias I, [2024-05-09T12:56:03.517386 #3782525] INFO -- : [111/885] 3823422=test_import I, [2024-05-09T12:56:04.541891 #3782525] INFO -- : [112/885] 3823422=test_human_typo I, [2024-05-09T12:56:04.552821 #3782525] INFO -- : [113/885] 3823422=test_wait I, [2024-05-09T12:56:04.606063 #3782525] INFO -- : [114/885] 3823422=test_nil I, [2024-05-09T12:56:04.616706 #3782525] INFO -- : [115/885] 3823422=test_psych I, [2024-05-09T12:56:04.640819 #3782525] INFO -- : [116/885] 3823422=test_yaml_tree I, [2024-05-09T12:56:04.668272 #3782525] INFO -- : [117/885] 3823422=test_gem_commands_yank_command I, [2024-05-09T12:56:05.177807 #3782525] INFO -- : [118/885] 3823422=test_cstr I, [2024-05-09T12:56:05.719264 #3782525] INFO -- : [119/885] 3823423=test_command I, [2024-05-09T12:56:05.936154 #3782525] INFO -- : [120/885] 3823423=test_euc_tw I, [2024-05-09T12:56:05.945224 #3782525] INFO -- : [121/885] 3823423=test_gem_resolver_dependency_request I, [2024-05-09T12:56:05.979643 #3782525] INFO -- : [122/885] 3823423=test_big2str I, [2024-05-09T12:56:05.989808 #3782525] INFO -- : [123/885] 3823423=test_gem_resolver_specification I, [2024-05-09T12:56:06.018793 #3782525] INFO -- : [124/885] 3823423=test_pkey_dsa I, [2024-05-09T12:56:06.034773 #3782525] INFO -- : [125/885] 3823422=test_logger I, [2024-05-09T12:56:06.054101 #3782525] INFO -- : [126/885] 3823422=json_string_matching_test I, [2024-05-09T12:56:06.064732 #3782525] INFO -- : [127/885] 3823422=test_gem_config_file I, [2024-05-09T12:56:06.239581 #3782525] INFO -- : [128/885] 3823422=test_comparable I, [2024-05-09T12:56:06.250194 #3782525] INFO -- : [129/885] 3823422=test_rdoc_rdoc I, [2024-05-09T12:56:06.309425 #3782525] INFO -- : [130/885] 3823422=test_yjit_exit_locations I, [2024-05-09T12:56:06.325535 #3782525] INFO -- : [131/885] 3823422=test_rdoc_markdown_test I, [2024-05-09T12:56:07.208956 #3782525] INFO -- : [132/885] 3823421=test_io_timeout I, [2024-05-09T12:56:07.214347 #3782525] INFO -- : [133/885] 3823421=test_type_completor I, [2024-05-09T12:56:07.248580 #3782525] INFO -- : [134/885] 3823421=test_rdoc_normal_module I, [2024-05-09T12:56:07.277800 #3782525] INFO -- : [135/885] 3823421=test_io_buffer I, [2024-05-09T12:56:07.289117 #3782525] INFO -- : [136/885] 3823422=test_kdf I, [2024-05-09T12:56:07.321330 #3782525] INFO -- : [137/885] 3823421=test_ldap I, [2024-05-09T12:56:07.332440 #3782525] INFO -- : [138/885] 3823421=test_thread_queue I, [2024-05-09T12:56:07.359384 #3782525] INFO -- : [139/885] 3823422=test_passing_block I, [2024-05-09T12:56:07.369345 #3782525] INFO -- : [140/885] 3823422=test_defined I, [2024-05-09T12:56:07.436742 #3782525] INFO -- : [141/885] 3823422=test_nowrite I, [2024-05-09T12:56:07.455779 #3782525] INFO -- : [142/885] 3823422=test_tree_builder I, [2024-05-09T12:56:07.460733 #3782525] INFO -- : [143/885] 3823422=test_big5 I, [2024-05-09T12:56:07.467103 #3782525] INFO -- : [144/885] 3823422=test_date I, [2024-05-09T12:56:07.499035 #3782525] INFO -- : [145/885] 3823422=test_gem_commands_update_command I, [2024-05-09T12:56:08.839923 #3782525] INFO -- : [146/885] 3823422=test_protect I, [2024-05-09T12:56:08.853248 #3782525] INFO -- : [147/885] 3823422=test_pathname I, [2024-05-09T12:56:09.074461 #3782525] INFO -- : [148/885] 3823422=test_fnmatch I, [2024-05-09T12:56:09.115687 #3782525] INFO -- : [149/885] 3823422=test_store I, [2024-05-09T12:56:09.367947 #3782525] INFO -- : [150/885] 3823423=test_rdoc_markup_pre_process I, [2024-05-09T12:56:09.413539 #3782525] INFO -- : [151/885] 3823422=test_coverage I, [2024-05-09T12:56:09.445812 #3782525] INFO -- : [152/885] 3823423=test_tempfile I, [2024-05-09T12:56:09.635243 #3782525] INFO -- : [153/885] 3823423=test_http_request I, [2024-05-09T12:56:09.643737 #3782525] INFO -- : [154/885] 3823423=test_erb_m17n I, [2024-05-09T12:56:09.647725 #3782525] INFO -- : [155/885] 3823423=test_rdoc_generator_pot_po_entry I, [2024-05-09T12:56:09.661953 #3782525] INFO -- : [156/885] 3823423=test_timeout I, [2024-05-09T12:56:09.666882 #3782525] INFO -- : [157/885] 3823423=test_rdoc_markup_verbatim I, [2024-05-09T12:56:09.668978 #3782525] INFO -- : [158/885] 3823423=test_webauthn_poller I, [2024-05-09T12:56:09.839383 #3782525] INFO -- : [159/885] 3823423=test_date_conv I, [2024-05-09T12:56:09.848286 #3782525] INFO -- : [160/885] 3823423=test_frozen I, [2024-05-09T12:56:09.855417 #3782525] INFO -- : [161/885] 3823423=test_serialize_subclasses I, [2024-05-09T12:56:09.856769 #3782525] INFO -- : [162/885] 3823423=test_gem_resolver_index_specification I, [2024-05-09T12:56:09.928658 #3782525] INFO -- : [163/885] 3823423=test_egrep_cpp I, [2024-05-09T12:56:10.036661 #3782525] INFO -- : [164/885] 3823423=test_files_lib I, [2024-05-09T12:56:10.044946 #3782525] INFO -- : [165/885] 3823423=test_string_memory I, [2024-05-09T12:56:10.073595 #3782525] INFO -- : [166/885] 3823422=test_help I, [2024-05-09T12:56:10.079870 #3782525] INFO -- : [167/885] 3823422=test_enumerator_kw I, [2024-05-09T12:56:10.084676 #3782525] INFO -- : [168/885] 3823422=test_marshalable I, [2024-05-09T12:56:10.103507 #3782525] INFO -- : [169/885] 3823422=test_line_editor I, [2024-05-09T12:56:10.133874 #3782525] INFO -- : [170/885] 3823422=reflection_test I, [2024-05-09T12:56:10.140161 #3782525] INFO -- : [171/885] 3823423=test_string I, [2024-05-09T12:56:10.142981 #3782525] INFO -- : [172/885] 3823422=json_common_interface_test I, [2024-05-09T12:56:10.153566 #3782525] INFO -- : [173/885] 3823422=test_error_highlight I, [2024-05-09T12:56:10.172908 #3782525] INFO -- : [174/885] 3823423=test_rdoc_any_method I, [2024-05-09T12:56:10.540020 #3782525] INFO -- : [175/885] 3823423=test_function_entry I, [2024-05-09T12:56:10.541496 #3782525] INFO -- : [176/885] 3823423=test_raise I, [2024-05-09T12:56:10.544145 #3782525] INFO -- : [177/885] 3823423=test_complexrational I, [2024-05-09T12:56:10.550350 #3782525] INFO -- : [178/885] 3823423=version_test I, [2024-05-09T12:56:10.558056 #3782525] INFO -- : [179/885] 3823423=test_rat I, [2024-05-09T12:56:10.561693 #3782525] INFO -- : [180/885] 3823423=test_gem_request_connection_pools I, [2024-05-09T12:56:10.706597 #3782525] INFO -- : [181/885] 3823422=test_init I, [2024-05-09T12:56:10.994740 #3782525] INFO -- : [182/885] 3823422=test_flags I, [2024-05-09T12:56:11.527946 #3782525] INFO -- : [183/885] 3823422=test_numeric I, [2024-05-09T12:56:11.589811 #3782525] INFO -- : [184/885] 3823422=test_yamlstore I, [2024-05-09T12:56:11.607804 #3782525] INFO -- : [185/885] 3823422=test_bug-3571 I, [2024-05-09T12:56:11.612267 #3782525] INFO -- : [186/885] 3823422=test_file I, [2024-05-09T12:56:11.625425 #3782525] INFO -- : [187/885] 3823423=test_time I, [2024-05-09T12:56:11.632046 #3782525] INFO -- : [188/885] 3823422=test_capacity I, [2024-05-09T12:56:11.636788 #3782525] INFO -- : [189/885] 3823422=test_gem_commands_owner_command I, [2024-05-09T12:56:11.751431 #3782525] INFO -- : [190/885] 3823423=test_nextafter I, [2024-05-09T12:56:11.835805 #3782525] INFO -- : [191/885] 3823423=test_encoding I, [2024-05-09T12:56:12.003943 #3782525] INFO -- : [192/885] 3823423=test_hmac I, [2024-05-09T12:56:12.005672 #3782525] INFO -- : [193/885] 3823423=test_rdoc_generator_markup I, [2024-05-09T12:56:12.015941 #3782525] INFO -- : [194/885] 3823423=test_constant I, [2024-05-09T12:56:12.231200 #3782525] INFO -- : [195/885] 3823421=test_find I, [2024-05-09T12:56:12.252631 #3782525] INFO -- : [196/885] 3823421=test_pipe I, [2024-05-09T12:56:12.314188 #3782525] INFO -- : [197/885] 3823422=test_string I, [2024-05-09T12:56:12.391056 #3782525] INFO -- : [198/885] 3823421=test_macro I, [2024-05-09T12:56:12.402189 #3782525] INFO -- : [199/885] 3823421=test_gem_resolver_activation_request I, [2024-05-09T12:56:12.444873 #3782525] INFO -- : [200/885] 3823421=test_function I, [2024-05-09T12:56:12.643259 #3782525] INFO -- : [201/885] 3823421=test_gem_commands_server_command I, [2024-05-09T12:56:12.648323 #3782525] INFO -- : [202/885] 3823421=test_win32ole_method_event I, [2024-05-09T12:56:12.654834 #3782525] INFO -- : [203/885] 3823421=test_tcp I, [2024-05-09T12:56:12.769796 #3782525] INFO -- : [204/885] 3823421=parse_comments_test I, [2024-05-09T12:56:12.784824 #3782525] INFO -- : [205/885] 3823421=test_gem_name_tuple I, [2024-05-09T12:56:12.800789 #3782525] INFO -- : [206/885] 3823421=test_rdoc_markup_to_table_of_contents I, [2024-05-09T12:56:12.825262 #3782525] INFO -- : [207/885] 3823421=test_integer I, [2024-05-09T12:56:12.888167 #3782525] INFO -- : [208/885] 3823421=test_gem_requirement I, [2024-05-09T12:56:13.042630 #3782525] INFO -- : [209/885] 3823421=test_path_to_class I, [2024-05-09T12:56:13.048565 #3782525] INFO -- : [210/885] 3823421=test_enumerator I, [2024-05-09T12:56:13.101546 #3782525] INFO -- : [211/885] 3823421=test_reqarg I, [2024-05-09T12:56:13.440855 #3782525] INFO -- : [212/885] 3823421=test_frozen_error I, [2024-05-09T12:56:13.451362 #3782525] INFO -- : [213/885] 3823421=test_gem_version I, [2024-05-09T12:56:13.553203 #3782525] INFO -- : [214/885] 3823421=test_spell_checker I, [2024-05-09T12:56:13.581213 #3782525] INFO -- : [215/885] 3823421=test_gem_ext_ext_conf_builder I, [2024-05-09T12:56:14.023584 #3782525] INFO -- : [216/885] 3823423=test_resource I, [2024-05-09T12:56:14.042335 #3782525] INFO -- : [217/885] 3823423=test_gem_package_tar_reader_entry I, [2024-05-09T12:56:14.264848 #3782525] INFO -- : [218/885] 3823423=test_gem_uri I, [2024-05-09T12:56:14.301748 #3782525] INFO -- : [219/885] 3823423=test_bug-5832 I, [2024-05-09T12:56:14.306453 #3782525] INFO -- : [220/885] 3823423=test_yield_block I, [2024-05-09T12:56:14.331361 #3782525] INFO -- : [221/885] 3823423=test_c_struct_builder I, [2024-05-09T12:56:14.491194 #3782525] INFO -- : [222/885] 3823423=test_ubf_async_safe I, [2024-05-09T12:56:14.504621 #3782525] INFO -- : [223/885] 3823423=test_pstore I, [2024-05-09T12:56:14.724875 #3782525] INFO -- : [224/885] 3823423=test_win32ole_record I, [2024-05-09T12:56:14.740305 #3782525] INFO -- : [225/885] 3823423=test_rdoc_include I, [2024-05-09T12:56:14.750683 #3782525] INFO -- : [226/885] 3823421=test_gem_version_option I, [2024-05-09T12:56:14.762974 #3782525] INFO -- : [227/885] 3823423=test_date_compat I, [2024-05-09T12:56:14.771114 #3782525] INFO -- : [228/885] 3823423=test_gem_ext_cargo_builder I, [2024-05-09T12:56:14.805206 #3782525] INFO -- : [229/885] 3823421=test_console_attr I, [2024-05-09T12:56:14.819343 #3782525] INFO -- : [230/885] 3823421=test_proc I, [2024-05-09T12:56:14.835559 #3782525] INFO -- : [231/885] 3823423=test_gem_commands_unpack_command I, [2024-05-09T12:56:15.441793 #3782525] INFO -- : [232/885] 3823423=test_zlib I, [2024-05-09T12:56:15.658197 #3782525] INFO -- : [233/885] 3823421=test_rdoc_options I, [2024-05-09T12:56:15.905467 #3782525] INFO -- : [234/885] 3823421=test_cp949 I, [2024-05-09T12:56:15.910800 #3782525] INFO -- : [235/885] 3823421=test_jaro_winkler I, [2024-05-09T12:56:15.920365 #3782525] INFO -- : [236/885] 3823421=test_gem_resolver_vendor_set I, [2024-05-09T12:56:15.943135 #3782525] INFO -- : [237/885] 3823421=test_condition I, [2024-05-09T12:56:15.950460 #3782525] INFO -- : [238/885] 3823421=test_gem_dependency_resolution_error I, [2024-05-09T12:56:16.487109 #3782525] INFO -- : [239/885] 3823421=test_sleep I, [2024-05-09T12:56:18.006706 #3782525] INFO -- : [240/885] 3823421=test_mixed_unicode_escapes I, [2024-05-09T12:56:18.028736 #3782525] INFO -- : [241/885] 3823421=test_fileutils I, [2024-05-09T12:56:18.610467 #3782525] INFO -- : [242/885] 3823421=test_sorted_set I, [2024-05-09T12:56:18.747521 #3782525] INFO -- : [243/885] 3823421=test_emoji I, [2024-05-09T12:56:18.962220 #3782525] INFO -- : [244/885] 3823421=test_stack I, [2024-05-09T12:56:19.882685 #3782525] INFO -- : [245/885] 3823421=test_windows_1252 I, [2024-05-09T12:56:19.896420 #3782525] INFO -- : [246/885] 3823421=test_face I, [2024-05-09T12:56:19.941476 #3782525] INFO -- : [247/885] 3823421=test_sizeof I, [2024-05-09T12:56:20.579580 #3782525] INFO -- : [248/885] 3823423=test_date_attr I, [2024-05-09T12:56:20.599211 #3782525] INFO -- : [249/885] 3823423=test_gem_request_set_lockfile_parser I, [2024-05-09T12:56:20.805910 #3782525] INFO -- : [250/885] 3823423=test_stringchar I, [2024-05-09T12:56:20.813392 #3782525] INFO -- : [251/885] 3823423=warnings_test I, [2024-05-09T12:56:20.838114 #3782525] INFO -- : [252/885] 3823423=test_econv I, [2024-05-09T12:56:21.803064 #3782525] INFO -- : [253/885] 3823423=test_gem_install_update_options I, [2024-05-09T12:56:22.013874 #3782525] INFO -- : [254/885] 3823423=test_gem_specification I, [2024-05-09T12:56:22.448901 #3782525] INFO -- : [255/885] 3823421=test_flush I, [2024-05-09T12:56:22.456295 #3782525] INFO -- : [256/885] 3823421=test_pkey_rsa I, [2024-05-09T12:56:22.749106 #3782525] INFO -- : [257/885] 3823421=test_numhash I, [2024-05-09T12:56:22.782535 #3782525] INFO -- : [258/885] 3823421=test_system I, [2024-05-09T12:56:23.700206 #3782525] INFO -- : [259/885] 3823421=test_win32ole_variable I, [2024-05-09T12:56:23.715165 #3782525] INFO -- : [260/885] 3823421=test_parse I, [2024-05-09T12:56:24.238911 #3782525] INFO -- : [261/885] 3823421=test_rdoc_cross_reference I, [2024-05-09T12:56:24.683063 #3782525] INFO -- : [262/885] 3823421=test_rdoc_class_module I, [2024-05-09T12:56:24.782818 #3782525] INFO -- : [263/885] 3823423=test_method_cache I, [2024-05-09T12:56:24.789865 #3782525] INFO -- : [264/885] 3823423=test_case I, [2024-05-09T12:56:24.819414 #3782525] INFO -- : [265/885] 3823423=test_open-uri I, [2024-05-09T12:56:25.179546 #3782525] INFO -- : [266/885] 3823423=test_enc_associate I, [2024-05-09T12:56:25.232816 #3782525] INFO -- : [267/885] 3823421=test_enumerator I, [2024-05-09T12:56:25.697943 #3782525] INFO -- : [268/885] 3823423=test_gem_command_manager I, [2024-05-09T12:56:25.914492 #3782525] INFO -- : [269/885] 3823423=test_rdoc_context I, [2024-05-09T12:56:26.681923 #3782525] INFO -- : [270/885] 3823423=test_array I, [2024-05-09T12:56:26.717648 #3782525] INFO -- : [271/885] 3823423=ripper_test I, [2024-05-09T12:56:27.216977 #3782525] INFO -- : [272/885] 3823423=test_iso_8859 I, [2024-05-09T12:56:27.242952 #3782525] INFO -- : [273/885] 3823423=test_libs I, [2024-05-09T12:56:27.249864 #3782525] INFO -- : [274/885] 3823423=test_gc I, [2024-05-09T12:56:27.255604 #3782525] INFO -- : [275/885] 3823423=comments_test I, [2024-05-09T12:56:27.263670 #3782525] INFO -- : [276/885] 3823423=test_qsort I, [2024-05-09T12:56:27.274887 #3782525] INFO -- : [277/885] 3823423=test_math I, [2024-05-09T12:56:27.290381 #3782525] INFO -- : [278/885] 3823423=test_safe_load I, [2024-05-09T12:56:27.305749 #3782525] INFO -- : [279/885] 3823423=test_sprintf I, [2024-05-09T12:56:27.531709 #3782525] INFO -- : [280/885] 3823423=test_rdoc_parser_rd I, [2024-05-09T12:56:27.543847 #3782525] INFO -- : [281/885] 3823423=index_write_test I, [2024-05-09T12:56:27.549611 #3782525] INFO -- : [282/885] 3823423=test_const I, [2024-05-09T12:56:27.625767 #3782525] INFO -- : [283/885] 3823423=test_exit I, [2024-05-09T12:56:27.646046 #3782525] INFO -- : [284/885] 3823423=test_class I, [2024-05-09T12:56:31.190869 #3782525] INFO -- : [285/885] 3823423=test_recorder I, [2024-05-09T12:56:31.200123 #3782525] INFO -- : [286/885] 3823423=test_yaml_special_cases I, [2024-05-09T12:56:31.215089 #3782525] INFO -- : [287/885] 3823423=test_gem_commands_sources_command I, [2024-05-09T12:56:31.464476 #3782525] INFO -- : [288/885] 3823423=json_addition_test I, [2024-05-09T12:56:31.481983 #3782525] INFO -- : [289/885] 3823423=test_gem_source_list I, [2024-05-09T12:56:31.571826 #3782525] INFO -- : [290/885] 3823423=test_name_error I, [2024-05-09T12:56:31.649682 #3782525] INFO -- : [291/885] 3823423=test_framework I, [2024-05-09T12:56:31.695964 #3782525] INFO -- : [292/885] 3823423=test_weakmap I, [2024-05-09T12:56:32.152990 #3782525] INFO -- : [293/885] 3823422=test_coderange I, [2024-05-09T12:56:32.163863 #3782525] INFO -- : [294/885] 3823422=test_inadvertent_creation I, [2024-05-09T12:56:32.266027 #3782525] INFO -- : [295/885] 3823422=test_ansi_with_terminfo I, [2024-05-09T12:56:32.308007 #3782525] INFO -- : [296/885] 3823422=test_pack I, [2024-05-09T12:56:32.327954 #3782525] INFO -- : [297/885] 3823422=test_cgi_tag_helper I, [2024-05-09T12:56:32.369896 #3782525] INFO -- : [298/885] 3823422=test_pinned I, [2024-05-09T12:56:32.416417 #3782525] INFO -- : [299/885] 3823422=test_rdoc_generator_json_index I, [2024-05-09T12:56:32.446833 #3782525] INFO -- : [300/885] 3823422=test_date_time I, [2024-05-09T12:56:32.455328 #3782525] INFO -- : [301/885] 3823422=test_nil2vtempty I, [2024-05-09T12:56:32.476946 #3782525] INFO -- : [302/885] 3823422=test_gem_commands_push_command I, [2024-05-09T12:56:33.083191 #3782525] INFO -- : [303/885] 3823422=locals_test I, [2024-05-09T12:56:33.511165 #3782525] INFO -- : [304/885] 3823422=test_too_many_dummy_encodings I, [2024-05-09T12:56:33.516934 #3782525] INFO -- : [305/885] 3823422=test_method_cache I, [2024-05-09T12:56:33.535142 #3782525] INFO -- : [306/885] 3823422=test_sprintf_comb I, [2024-05-09T12:56:33.702882 #3782525] INFO -- : [307/885] 3823422=test_gem_source_local I, [2024-05-09T12:56:33.932067 #3782525] INFO -- : [308/885] 3823422=desugar_compiler_test I, [2024-05-09T12:56:33.943919 #3782525] INFO -- : [309/885] 3823422=test_internal_ivar I, [2024-05-09T12:56:33.950884 #3782525] INFO -- : [310/885] 3823422=test_win32ole I, [2024-05-09T12:56:33.958927 #3782525] INFO -- : [311/885] 3823422=test_rendering I, [2024-05-09T12:56:33.974744 #3782525] INFO -- : [312/885] 3823422=test_gem_gemcutter_utilities I, [2024-05-09T12:56:34.449084 #3782525] INFO -- : [313/885] 3823422=test_rdoc_task I, [2024-05-09T12:56:34.581419 #3782525] INFO -- : [314/885] 3823422=test_tracepoint I, [2024-05-09T12:56:34.795010 #3782525] INFO -- : [315/885] 3823422=test_settracefunc I, [2024-05-09T12:56:35.804255 #3782525] INFO -- : [316/885] 3823422=test_gem_text I, [2024-05-09T12:56:35.993474 #3782525] INFO -- : [317/885] 3823422=test_backtrace I, [2024-05-09T12:56:37.150294 #3782525] INFO -- : [318/885] 3823422=test_pty I, [2024-05-09T12:56:37.150894 #3782525] INFO -- : Leaked file descriptor: TestPTY#test_open: 10 # I, [2024-05-09T12:56:37.150928 #3782525] INFO -- : Leaked file descriptor: TestPTY#test_open: 11 # I, [2024-05-09T12:56:37.179328 #3782525] INFO -- : COMMAND PID USER FD TYPE DEVICE SIZE/OFF NODE NAME I, [2024-05-09T12:56:37.179403 #3782525] INFO -- : ruby 3823422 opc 10r REG 252,0 6940392 13705429 /var/lib/sss/mc/group I, [2024-05-09T12:56:37.179415 #3782525] INFO -- : ruby 3823422 opc 11u unix 0x0000000000000000 0t0 2905870758 type=STREAM I, [2024-05-09T12:56:37.726886 #3782525] INFO -- : [319/885] 3823422=test_gem_dependency_installer I, [2024-05-09T12:56:38.675927 #3782525] INFO -- : [320/885] 3823423=test_http I, [2024-05-09T12:56:38.681509 #3782525] INFO -- : [321/885] 3823423=parser_test I, [2024-05-09T12:56:38.700977 #3782525] INFO -- : [322/885] 3823423=test_hash I, [2024-05-09T12:56:40.350439 #3782525] INFO -- : [323/885] 3823422=encoding_test I, [2024-05-09T12:56:40.427468 #3782525] INFO -- : [324/885] 3823422=test_scan_args I, [2024-05-09T12:56:40.444196 #3782525] INFO -- : [325/885] 3823422=test_gem_commands_specification_command I, [2024-05-09T12:56:40.598724 #3782525] INFO -- : [326/885] 3823422=test_gem_commands_which_command I, [2024-05-09T12:56:40.639903 #3782525] INFO -- : [327/885] 3823422=test_gem_request I, [2024-05-09T12:56:40.909832 #3782525] INFO -- : [328/885] 3823422=test_gem_package_old I, [2024-05-09T12:56:41.081117 #3782525] INFO -- : [329/885] 3823422=test_argf I, [2024-05-09T12:56:41.147103 #3782525] INFO -- : [330/885] 3823421=test_yaml I, [2024-05-09T12:56:41.229949 #3782525] INFO -- : [331/885] 3823421=test_x509name I, [2024-05-09T12:56:41.239510 #3782525] INFO -- : [332/885] 3823421=test_gem_dependency I, [2024-05-09T12:56:41.388727 #3782525] INFO -- : [333/885] 3823421=test_yjit I, [2024-05-09T12:56:41.396694 #3782525] INFO -- : [334/885] 3823421=test_gem_uninstaller I, [2024-05-09T12:56:42.294315 #3782525] INFO -- : [335/885] 3823423=test_cclass I, [2024-05-09T12:56:42.375473 #3782525] INFO -- : [336/885] 3823423=test_m17n I, [2024-05-09T12:56:42.442863 #3782525] INFO -- : [337/885] 3823423=test_method I, [2024-05-09T12:56:42.671169 #3782525] INFO -- : [338/885] 3823421=test_filter I, [2024-05-09T12:56:42.700667 #3782525] INFO -- : [339/885] 3823421=test_parser_events I, [2024-05-09T12:56:42.781138 #3782525] INFO -- : [340/885] 3823421=test_pkcs12 I, [2024-05-09T12:56:43.529115 #3782525] INFO -- : [341/885] 3823421=test_gem_remote_fetcher I, [2024-05-09T12:56:44.728246 #3782525] INFO -- : [342/885] 3823422=test_json_tree I, [2024-05-09T12:56:44.734786 #3782525] INFO -- : [343/885] 3823422=test_koi8 I, [2024-05-09T12:56:44.739460 #3782525] INFO -- : [344/885] 3823422=test_severity I, [2024-05-09T12:56:44.752025 #3782525] INFO -- : [345/885] 3823422=test_ractor I, [2024-05-09T12:56:44.752637 #3782525] INFO -- : [346/885] 3823422=test_case I, [2024-05-09T12:56:44.767056 #3782525] INFO -- : [347/885] 3823422=test_gem_package_tar_writer I, [2024-05-09T12:56:44.923938 #3782525] INFO -- : [348/885] 3823422=test_str2big I, [2024-05-09T12:56:44.941822 #3782525] INFO -- : [349/885] 3823422=test_utf16 I, [2024-05-09T12:56:44.956953 #3782525] INFO -- : [350/885] 3823422=test_http I, [2024-05-09T12:56:45.438238 #3782525] INFO -- : [351/885] 3823421=attribute_write_test I, [2024-05-09T12:56:45.439307 #3782525] INFO -- : [352/885] 3823421=test_set I, [2024-05-09T12:56:45.454951 #3782525] INFO -- : [353/885] 3823421=test_rdoc_markup_to_rdoc I, [2024-05-09T12:56:45.506298 #3782525] INFO -- : [354/885] 3823421=test_queue I, [2024-05-09T12:56:45.516319 #3782525] INFO -- : [355/885] 3823421=test_gem_resolver_lock_specification I, [2024-05-09T12:56:45.558338 #3782525] INFO -- : [356/885] 3823421=test_boolean I, [2024-05-09T12:56:45.587866 #3782525] INFO -- : [357/885] 3823421=test_gc_compact I, [2024-05-09T12:56:48.185418 #3782525] INFO -- : [358/885] 3823421=test_rdoc_i18n_locale I, [2024-05-09T12:56:48.200661 #3782525] INFO -- : [359/885] 3823421=test_dryrun I, [2024-05-09T12:56:48.222303 #3782525] INFO -- : [360/885] 3823421=test_gem_uri_formatter I, [2024-05-09T12:56:48.242240 #3782525] INFO -- : [361/885] 3823421=test_prettyprint I, [2024-05-09T12:56:48.272389 #3782525] INFO -- : [362/885] 3823421=test_ole_methods I, [2024-05-09T12:56:48.287488 #3782525] INFO -- : [363/885] 3823421=test_cgi_util I, [2024-05-09T12:56:48.482616 #3782525] INFO -- : [364/885] 3823421=test_clone I, [2024-05-09T12:56:48.634473 #3782525] INFO -- : [365/885] 3823421=test_enc_raise I, [2024-05-09T12:56:48.698766 #3782525] INFO -- : [366/885] 3823421=test_data_error I, [2024-05-09T12:56:48.699747 #3782525] INFO -- : [367/885] 3823421=test_files_sample I, [2024-05-09T12:56:48.786754 #3782525] INFO -- : [368/885] 3823421=test_rdoc_stats I, [2024-05-09T12:56:48.935547 #3782525] INFO -- : [369/885] 3823421=test_rubyoptions I, [2024-05-09T12:56:49.377451 #3782525] INFO -- : [370/885] 3823423=test_optimization I, [2024-05-09T12:56:53.721443 #3782525] INFO -- : [371/885] 3823422=test_force_exit I, [2024-05-09T12:56:53.726255 #3782525] INFO -- : [372/885] 3823422=test_shift_jis I, [2024-05-09T12:56:53.744407 #3782525] INFO -- : [373/885] 3823422=test_rdoc_store I, [2024-05-09T12:56:54.393665 #3782525] INFO -- : [374/885] 3823422=regexp_test I, [2024-05-09T12:56:54.412382 #3782525] INFO -- : [375/885] 3823422=test_yield I, [2024-05-09T12:56:54.641446 #3782525] INFO -- : [376/885] 3823421=test_remote_fetch_error I, [2024-05-09T12:56:54.711235 #3782525] INFO -- : [377/885] 3823421=test_show_source I, [2024-05-09T12:56:54.721645 #3782525] INFO -- : [378/885] 3823421=test_case_mapping I, [2024-05-09T12:56:54.737317 #3782525] INFO -- : [379/885] 3823421=test_rational I, [2024-05-09T12:56:54.761306 #3782525] INFO -- : [380/885] 3823421=test_gem_ext_cargo_builder_unit I, [2024-05-09T12:56:54.802492 #3782525] INFO -- : [381/885] 3823421=test_ractor I, [2024-05-09T12:56:54.814403 #3782525] INFO -- : [382/885] 3823421=test_rdoc_rubygems_hook I, [2024-05-09T12:56:54.897232 #3782525] INFO -- : [383/885] 3823421=test_gem_resolver_api_specification I, [2024-05-09T12:56:54.960385 #3782525] INFO -- : [384/885] 3823421=test_webauthn_listener I, [2024-05-09T12:56:55.057357 #3782525] INFO -- : .Closed file descriptor: WebauthnListenerTest#test_wait_for_otp_code_get_request: 14 I, [2024-05-09T12:56:55.059254 #3782525] INFO -- : [385/885] 3823421=test_key_event_record I, [2024-05-09T12:56:55.075695 #3782525] INFO -- : [386/885] 3823421=test_date_parse I, [2024-05-09T12:56:55.202203 #3782525] INFO -- : [387/885] 3823421=test_mdns I, [2024-05-09T12:56:55.334086 #3782525] INFO -- : [388/885] 3823421=test_open3 I, [2024-05-09T12:56:55.780882 #3782525] INFO -- : [389/885] 3823423=test_arity I, [2024-05-09T12:56:55.790015 #3782525] INFO -- : [390/885] 3823423=test_thread I, [2024-05-09T12:56:55.800700 #3782525] INFO -- : [391/885] 3823423=test_pkey_ec I, [2024-05-09T12:56:55.822993 #3782525] INFO -- : [392/885] 3823423=test_svcb_https I, [2024-05-09T12:56:55.829163 #3782525] INFO -- : [393/885] 3823423=test_buffering I, [2024-05-09T12:56:55.833964 #3782525] INFO -- : [394/885] 3823423=test_yamldbm I, [2024-05-09T12:56:55.846279 #3782525] INFO -- : [395/885] 3823423=test_gem_spec_fetcher I, [2024-05-09T12:56:56.059292 #3782525] INFO -- : [396/885] 3823423=test_unicode_escape I, [2024-05-09T12:56:56.145447 #3782525] INFO -- : [397/885] 3823423=test_default_gems I, [2024-05-09T12:56:56.187909 #3782525] INFO -- : [398/885] 3823423=test_switch_hitter I, [2024-05-09T12:56:56.198839 #3782525] INFO -- : [399/885] 3823423=test_backtrace I, [2024-05-09T12:56:56.203554 #3782525] INFO -- : [400/885] 3823423=test_gbk I, [2024-05-09T12:56:56.215649 #3782525] INFO -- : [401/885] 3823423=test_gem_commands_dependency_command I, [2024-05-09T12:56:56.350552 #3782525] INFO -- : [402/885] 3823423=test_rdoc_method_attr I, [2024-05-09T12:56:56.589416 #3782525] INFO -- : [403/885] 3823423=test_enumerable I, [2024-05-09T12:56:56.601822 #3782525] INFO -- : [404/885] 3823423=test_set I, [2024-05-09T12:56:56.619910 #3782525] INFO -- : [405/885] 3823423=static_literals_test I, [2024-05-09T12:56:56.629956 #3782525] INFO -- : [406/885] 3823423=test_tree_spell_checker I, [2024-05-09T12:56:56.701726 #3782525] INFO -- : [407/885] 3823423=test_grapheme_breaks I, [2024-05-09T12:56:56.720080 #3782525] INFO -- : [408/885] 3823423=test_hash_create I, [2024-05-09T12:56:56.724200 #3782525] INFO -- : [409/885] 3823423=test_shapes I, [2024-05-09T12:56:56.732878 #3782525] INFO -- : [410/885] 3823423=test_did_you_mean I, [2024-05-09T12:56:56.805478 #3782525] INFO -- : [411/885] 3823423=test_rdoc_extend I, [2024-05-09T12:56:56.816802 #3782525] INFO -- : [412/885] 3823423=test_cesu8 I, [2024-05-09T12:56:56.826013 #3782525] INFO -- : [413/885] 3823423=test_storage I, [2024-05-09T12:56:56.834026 #3782525] INFO -- : [414/885] 3823423=test_err_in_callback I, [2024-05-09T12:56:56.867768 #3782525] INFO -- : [415/885] 3823423=test_method_name_check I, [2024-05-09T12:56:56.967541 #3782525] INFO -- : [416/885] 3823423=test_merge_keys I, [2024-05-09T12:56:56.982458 #3782525] INFO -- : [417/885] 3823423=test_string I, [2024-05-09T12:56:56.996745 #3782525] INFO -- : [418/885] 3823423=test_iterator I, [2024-05-09T12:56:57.098988 #3782525] INFO -- : [419/885] 3823423=test_gem_commands_install_command I, [2024-05-09T12:56:57.395421 #3782525] INFO -- : [420/885] 3823422=test_kernel I, [2024-05-09T12:56:57.892662 #3782525] INFO -- : [421/885] 3823421=test_rendering I, [2024-05-09T12:56:57.905217 #3782525] INFO -- : [422/885] 3823421=pattern_test I, [2024-05-09T12:56:57.938286 #3782525] INFO -- : [423/885] 3823421=test_gem_rdoc I, [2024-05-09T12:56:58.070641 #3782525] INFO -- : [424/885] 3823422=test_dot_dot I, [2024-05-09T12:56:58.072288 #3782525] INFO -- : [425/885] 3823422=!Nothing_to_test I, [2024-05-09T12:56:58.073875 #3782525] INFO -- : [426/885] 3823422=test_fd_setsize I, [2024-05-09T12:56:58.075339 #3782525] INFO -- : [427/885] 3823422=test_process I, [2024-05-09T12:56:58.119575 #3782525] INFO -- : [428/885] 3823422=test_forwardable I, [2024-05-09T12:56:58.123329 #3782525] INFO -- : [429/885] 3823421=test_array_create I, [2024-05-09T12:56:58.123717 #3782525] INFO -- : [430/885] 3823421=test_memory_view I, [2024-05-09T12:56:58.171059 #3782525] INFO -- : [431/885] 3823422=test_dir_m17n I, [2024-05-09T12:56:58.471618 #3782525] INFO -- : [432/885] 3823421=test_complex I, [2024-05-09T12:56:58.576307 #3782525] INFO -- : [433/885] 3823421=test_threadgroup I, [2024-05-09T12:56:59.195251 #3782525] INFO -- : [434/885] 3823423=test_undef I, [2024-05-09T12:56:59.201794 #3782525] INFO -- : [435/885] 3823423=test_rdoc_generator_darkfish I, [2024-05-09T12:56:59.323941 #3782525] INFO -- : [436/885] 3823422=test_random I, [2024-05-09T12:56:59.326967 #3782525] INFO -- : [437/885] 3823422=test_gem_resolver_lock_set I, [2024-05-09T12:56:59.364899 #3782525] INFO -- : [438/885] 3823422=test_gem_command I, [2024-05-09T12:56:59.487229 #3782525] INFO -- : [439/885] 3823422=test_asn1 I, [2024-05-09T12:56:59.526661 #3782525] INFO -- : [440/885] 3823422=test_gem_commands_open_command I, [2024-05-09T12:56:59.535325 #3782525] INFO -- : [441/885] 3823423=test_verbose I, [2024-05-09T12:56:59.559910 #3782525] INFO -- : [442/885] 3823423=test_normalize I, [2024-05-09T12:56:59.566828 #3782525] INFO -- : [443/885] 3823423=test_emoji_breaks I, [2024-05-09T12:56:59.571434 #3782525] INFO -- : [444/885] 3823423=test_assignment I, [2024-05-09T12:56:59.587070 #3782525] INFO -- : [445/885] 3823421=test_gem_update_suggestion I, [2024-05-09T12:56:59.600165 #3782525] INFO -- : [446/885] 3823422=test_basicinstructions I, [2024-05-09T12:56:59.667915 #3782525] INFO -- : [447/885] 3823422=test_utf32 I, [2024-05-09T12:56:59.676534 #3782525] INFO -- : [448/885] 3823422=test_gem_resolver_git_specification I, [2024-05-09T12:56:59.719250 #3782525] INFO -- : [449/885] 3823421=test_gem_security I, [2024-05-09T12:56:59.999105 #3782525] INFO -- : [450/885] 3823422=test_key_actor_emacs I, [2024-05-09T12:57:00.233757 #3782525] INFO -- : [451/885] 3823422=test_date_ractor I, [2024-05-09T12:57:00.337403 #3782525] INFO -- : [452/885] 3823422=test_erb I, [2024-05-09T12:57:00.400682 #3782525] INFO -- : [453/885] 3823422=test_variable I, [2024-05-09T12:57:00.500465 #3782525] INFO -- : [454/885] 3823422=test_hash I, [2024-05-09T12:57:00.521919 #3782525] INFO -- : [455/885] 3823422=test_rdoc_tom_doc I, [2024-05-09T12:57:00.597186 #3782525] INFO -- : [456/885] 3823422=test_optarg I, [2024-05-09T12:57:00.681381 #3782525] INFO -- : [457/885] 3823422=test_gem_commands_pristine_command I, [2024-05-09T12:57:00.900653 #3782525] INFO -- : [458/885] 3823423=test_gem_impossible_dependencies_error I, [2024-05-09T12:57:00.918413 #3782525] INFO -- : [459/885] 3823423=test_pp I, [2024-05-09T12:57:00.964062 #3782525] INFO -- : .Leaked file descriptor: PPTestModule::PPFileStatTest#test_nothing_raised: 11 # I, [2024-05-09T12:57:00.995526 #3782525] INFO -- : COMMAND PID USER FD TYPE DEVICE SIZE/OFF NODE NAME I, [2024-05-09T12:57:00.995594 #3782525] INFO -- : ruby 3823423 opc 11r REG 252,0 9253600 13705411 /var/lib/sss/mc/passwd I, [2024-05-09T12:57:01.061011 #3782525] INFO -- : [460/885] 3823423=test_gem_resolver_requirement_list I, [2024-05-09T12:57:01.065529 #3782525] INFO -- : [461/885] 3823423=memsize_test I, [2024-05-09T12:57:01.074726 #3782525] INFO -- : [462/885] 3823423=test_exception I, [2024-05-09T12:57:01.131692 #3782525] INFO -- : [463/885] 3823423=test_arith_seq_beg_len_step I, [2024-05-09T12:57:01.202130 #3782525] INFO -- : [464/885] 3823423=test_raise_exception I, [2024-05-09T12:57:01.720019 #3782525] INFO -- : [465/885] 3823423=test_noarg I, [2024-05-09T12:57:01.822405 #3782525] INFO -- : [466/885] 3823423=test_rdoc_markup_to_ansi I, [2024-05-09T12:57:01.869522 #3782525] INFO -- : [467/885] 3823423=test_protocol I, [2024-05-09T12:57:02.058958 #3782525] INFO -- : [468/885] 3823422=test_evaluation I, [2024-05-09T12:57:02.066359 #3782525] INFO -- : [469/885] 3823422=test_weakkeymap I, [2024-05-09T12:57:02.175179 #3782525] INFO -- : [470/885] 3823423=test_files_test I, [2024-05-09T12:57:02.192929 #3782525] INFO -- : [471/885] 3823423=test_https I, [2024-05-09T12:57:02.323842 #3782525] INFO -- : [472/885] 3823423=test_gem_commands_info_command I, [2024-05-09T12:57:02.341153 #3782525] INFO -- : [473/885] 3823423=test_object_create_start I, [2024-05-09T12:57:02.357933 #3782525] INFO -- : [474/885] 3823423=test_gem_request_set_gem_dependency_api I, [2024-05-09T12:57:02.418698 #3782525] INFO -- : [475/885] 3823422=test_name_error_extension I, [2024-05-09T12:57:02.425411 #3782525] INFO -- : [476/885] 3823422=test_irb I, [2024-05-09T12:57:02.698748 #3782525] INFO -- : [477/885] 3823422=test_rdoc_markup_paragraph I, [2024-05-09T12:57:02.705341 #3782525] INFO -- : [478/885] 3823422=test_x509cert I, [2024-05-09T12:57:02.826970 #3782525] INFO -- : [479/885] 3823422=test_require_path_check I, [2024-05-09T12:57:02.958525 #3782525] INFO -- : [480/885] 3823422=test_bn I, [2024-05-09T12:57:02.977854 #3782525] INFO -- : [481/885] 3823422=test_variable_name_check I, [2024-05-09T12:57:02.991708 #3782525] INFO -- : [482/885] 3823423=test_logdevice I, [2024-05-09T12:57:03.170622 #3782525] INFO -- : [483/885] 3823422=test_ast I, [2024-05-09T12:57:03.991323 #3782525] INFO -- : [484/885] 3823423=test_ssl_session I, [2024-05-09T12:57:04.784343 #3782525] INFO -- : [485/885] 3823423=test_gem_package_tar_header I, [2024-05-09T12:57:04.911287 #3782525] INFO -- : [486/885] 3823423=test_rational2 I, [2024-05-09T12:57:05.040094 #3782525] INFO -- : [487/885] 3823423=test_case_comprehensive I, [2024-05-09T12:57:13.892374 #3782525] INFO -- : [488/885] 3823421=test_logperiod I, [2024-05-09T12:57:13.905436 #3782525] INFO -- : [489/885] 3823421=test_placearg I, [2024-05-09T12:57:13.969318 #3782525] INFO -- : [490/885] 3823421=test_file_exhaustive I, [2024-05-09T12:57:22.568278 #3782525] INFO -- : [491/885] 3823421=test_completion I, [2024-05-09T12:57:23.196561 #3782525] INFO -- : [492/885] 3823421=parse_stream_test I, [2024-05-09T12:57:23.210995 #3782525] INFO -- : [493/885] 3823421=test_handle I, [2024-05-09T12:57:23.898513 #3782525] INFO -- : [494/885] 3823421=test_delete I, [2024-05-09T12:57:23.908729 #3782525] INFO -- : [495/885] 3823421=test_rdoc_markup_document I, [2024-05-09T12:57:23.913981 #3782525] INFO -- : [496/885] 3823421=test_gem_security_policy I, [2024-05-09T12:57:24.324702 #3782525] INFO -- : [497/885] 3823421=test_io_wait_uncommon I, [2024-05-09T12:57:24.339459 #3782525] INFO -- : [498/885] 3823421=test_gem_ci_detector I, [2024-05-09T12:57:24.353018 #3782525] INFO -- : [499/885] 3823421=test_continuation I, [2024-05-09T12:57:24.372959 #3782525] INFO -- : [500/885] 3823421=test_signal I, [2024-05-09T12:57:25.525770 #3782525] INFO -- : [501/885] 3823423=test_gem_silent_ui I, [2024-05-09T12:57:25.582264 #3782525] INFO -- : [502/885] 3823423=test_fixnum I, [2024-05-09T12:57:25.601877 #3782525] INFO -- : [503/885] 3823423=test_rdoc_single_class I, [2024-05-09T12:57:25.610795 #3782525] INFO -- : [504/885] 3823423=test_dup I, [2024-05-09T12:57:25.767480 #3782525] INFO -- : [505/885] 3823423=test_acceptable I, [2024-05-09T12:57:25.843158 #3782525] INFO -- : [506/885] 3823423=test_gem_ext_cargo_builder_link_flag_converter I, [2024-05-09T12:57:26.002594 #3782525] INFO -- : [507/885] 3823423=test_gem_local_remote_options I, [2024-05-09T12:57:26.063952 #3782525] INFO -- : [508/885] 3823423=test_rdoc_token_stream I, [2024-05-09T12:57:26.194592 #3782525] INFO -- : [509/885] 3823423=test_mutex I, [2024-05-09T12:57:26.349271 #3782525] INFO -- : [510/885] 3823421=heredoc_dedent_test I, [2024-05-09T12:57:26.359016 #3782525] INFO -- : [511/885] 3823421=test_type I, [2024-05-09T12:57:26.372568 #3782525] INFO -- : [512/885] 3823421=test_tmpdir I, [2024-05-09T12:57:26.445515 #3782525] INFO -- : [513/885] 3823421=test_struct I, [2024-05-09T12:57:27.014229 #3782525] INFO -- : [514/885] 3823421=test_ractor I, [2024-05-09T12:57:27.084790 #3782525] INFO -- : [515/885] 3823421=test_gem_resolver_installed_specification I, [2024-05-09T12:57:27.154128 #3782525] INFO -- : [516/885] 3823421=test_exception_at_throwing I, [2024-05-09T12:57:27.167604 #3782525] INFO -- : [517/885] 3823421=test_stringscanner I, [2024-05-09T12:57:27.203678 #3782525] INFO -- : [518/885] 3823421=test_fiddle I, [2024-05-09T12:57:27.213604 #3782525] INFO -- : [519/885] 3823423=json_generic_object_test I, [2024-05-09T12:57:27.217444 #3782525] INFO -- : [520/885] 3823423=test_date_arith I, [2024-05-09T12:57:27.237389 #3782525] INFO -- : [521/885] 3823423=test_gem_resolver_vendor_specification I, [2024-05-09T12:57:27.276867 #3782525] INFO -- : [522/885] 3823423=test_gem_safe_marshal I, [2024-05-09T12:57:27.352628 #3782525] INFO -- : [523/885] 3823421=test_rdoc_ri_driver I, [2024-05-09T12:57:27.753355 #3782525] INFO -- : [524/885] 3823421=test_ractor I, [2024-05-09T12:57:27.828166 #3782525] INFO -- : [525/885] 3823421=test_sexp I, [2024-05-09T12:57:27.850943 #3782525] INFO -- : [526/885] 3823421=test_httpheader I, [2024-05-09T12:57:27.892878 #3782525] INFO -- : [527/885] 3823421=test_signedness I, [2024-05-09T12:57:28.325951 #3782525] INFO -- : [528/885] 3823423=test_gem_commands_check_command I, [2024-05-09T12:57:28.420966 #3782525] INFO -- : [529/885] 3823423=test_gem_resolver_git_set I, [2024-05-09T12:57:29.012354 #3782525] INFO -- : [530/885] 3823423=test_digest I, [2024-05-09T12:57:29.695967 #3782525] INFO -- : [531/885] 3823421=test_rdoc_parser_markdown I, [2024-05-09T12:57:29.714542 #3782525] INFO -- : [532/885] 3823421=test_custom_command I, [2024-05-09T12:57:29.719801 #3782525] INFO -- : [533/885] 3823421=test_rubyvm I, [2024-05-09T12:57:29.728664 #3782525] INFO -- : [534/885] 3823421=fuzzer_test I, [2024-05-09T12:57:29.776016 #3782525] INFO -- : [535/885] 3823421=test_cparser I, [2024-05-09T12:57:29.789851 #3782525] INFO -- : [536/885] 3823423=static_inspect_test I, [2024-05-09T12:57:29.800063 #3782525] INFO -- : [537/885] 3823423=test_struct I, [2024-05-09T12:57:29.816221 #3782525] INFO -- : [538/885] 3823423=test_c_struct_entry I, [2024-05-09T12:57:30.761407 #3782525] INFO -- : [539/885] 3823423=test_config I, [2024-05-09T12:57:30.816220 #3782525] INFO -- : [540/885] 3823423=test_ostruct I, [2024-05-09T12:57:30.946656 #3782525] INFO -- : [541/885] 3823423=test_depth_first I, [2024-05-09T12:57:30.947936 #3782525] INFO -- : [542/885] 3823423=test_change_word I, [2024-05-09T12:57:30.965246 #3782525] INFO -- : [543/885] 3823423=test_gem_security_trust_dir I, [2024-05-09T12:57:31.021847 #3782525] INFO -- : [544/885] 3823423=test_module I, [2024-05-09T12:57:31.294363 #3782525] INFO -- : [545/885] 3823421=test_erb_command I, [2024-05-09T12:57:31.368794 #3782525] INFO -- : [546/885] 3823421=test_usrmarshal I, [2024-05-09T12:57:31.530126 #3782525] INFO -- : [547/885] 3823421=test_gem_validator I, [2024-05-09T12:57:31.559546 #3782525] INFO -- : [548/885] 3823421=test_gem_source_installed I, [2024-05-09T12:57:31.568280 #3782525] INFO -- : [549/885] 3823421=test_abi I, [2024-05-09T12:57:31.722207 #3782525] INFO -- : [550/885] 3823421=test_bundled_ca I, [2024-05-09T12:57:33.451727 #3782525] INFO -- : [551/885] 3823421=test_integer_comb I, [2024-05-09T12:57:35.140068 #3782525] INFO -- : [552/885] 3823423=test_load I, [2024-05-09T12:57:35.226453 #3782525] INFO -- : [553/885] 3823423=test_ssl I, [2024-05-09T12:57:36.231259 #3782525] INFO -- : [554/885] 3823421=test_gem_package_task I, [2024-05-09T12:57:36.243586 #3782525] INFO -- : [555/885] 3823421=test_lock_native_thread I, [2024-05-09T12:57:36.499308 #3782525] INFO -- : [556/885] 3823421=test_resize I, [2024-05-09T12:57:36.502960 #3782525] INFO -- : [557/885] 3823421=test_win32ole_param I, [2024-05-09T12:57:36.507670 #3782525] INFO -- : [558/885] 3823421=test_key_error I, [2024-05-09T12:57:36.587408 #3782525] INFO -- : [559/885] 3823421=test_engine I, [2024-05-09T12:57:36.984156 #3782525] INFO -- : [560/885] 3823421=test_fiber I, [2024-05-09T12:57:43.092044 #3782525] INFO -- : [561/885] 3823421=test_gem_commands_mirror I, [2024-05-09T12:57:43.101968 #3782525] INFO -- : [562/885] 3823421=test_rdoc_rd_block_parser I, [2024-05-09T12:57:43.203265 #3782525] INFO -- : [563/885] 3823421=test_x509store I, [2024-05-09T12:57:43.639126 #3782525] INFO -- : [564/885] 3823421=test_rdoc_rd I, [2024-05-09T12:57:43.653083 #3782525] INFO -- : [565/885] 3823421=test_rdoc_markup_to_markdown I, [2024-05-09T12:57:43.701196 #3782525] INFO -- : [566/885] 3823421=test_rdoc_markup_to_joined_paragraph I, [2024-05-09T12:57:43.717403 #3782525] INFO -- : [567/885] 3823421=test_rdoc_generator_pot I, [2024-05-09T12:57:43.823551 #3782525] INFO -- : [568/885] 3823421=test_require_lib I, [2024-05-09T12:57:45.615324 #3782525] INFO -- : [569/885] 3823423=test_gem_gem_runner I, [2024-05-09T12:57:45.686333 #3782525] INFO -- : [570/885] 3823423=test_metaclass I, [2024-05-09T12:57:45.698450 #3782525] INFO -- : [571/885] 3823423=test_objectspace I, [2024-05-09T12:57:46.635671 #3782525] INFO -- : [572/885] 3823421=test_require I, [2024-05-09T12:57:46.655989 #3782525] INFO -- : [573/885] 3823423=test_debugger_integration I, [2024-05-09T12:57:46.662118 #3782525] INFO -- : [574/885] 3823423=test_my_integer I, [2024-05-09T12:57:46.674357 #3782525] INFO -- : [575/885] 3823423=test_gem_resolver_composed_set I, [2024-05-09T12:57:46.696236 #3782525] INFO -- : [576/885] 3823423=test_tracer I, [2024-05-09T12:57:46.703982 #3782525] INFO -- : [577/885] 3823423=test_not I, [2024-05-09T12:57:46.705718 #3782525] INFO -- : [578/885] 3823423=test_cgi_cookie I, [2024-05-09T12:57:46.786613 #3782525] INFO -- : [579/885] 3823423=test_option I, [2024-05-09T12:57:46.874714 #3782525] INFO -- : [580/885] 3823423=test_rdoc_markup_attribute_manager I, [2024-05-09T12:57:46.905961 #3782525] INFO -- : [581/885] 3823423=test_wss I, [2024-05-09T12:57:46.917807 #3782525] INFO -- : [582/885] 3823423=test_gem_source_lock I, [2024-05-09T12:57:47.020306 #3782525] INFO -- : [583/885] 3823423=test_cipher I, [2024-05-09T12:57:47.037505 #3782525] INFO -- : [584/885] 3823423=test_update I, [2024-05-09T12:57:47.044630 #3782525] INFO -- : [585/885] 3823423=test_new I, [2024-05-09T12:57:47.055001 #3782525] INFO -- : [586/885] 3823423=test_rdoc_rd_inline_parser I, [2024-05-09T12:57:47.080771 #3782525] INFO -- : [587/885] 3823423=test_win32ole_type I, [2024-05-09T12:57:47.083097 #3782525] INFO -- : [588/885] 3823423=test_load I, [2024-05-09T12:57:47.088438 #3782525] INFO -- : [589/885] 3823423=test_x509attr I, [2024-05-09T12:57:47.097415 #3782525] INFO -- : [590/885] 3823423=test_printf I, [2024-05-09T12:57:47.117156 #3782525] INFO -- : [591/885] 3823423=test_workspace I, [2024-05-09T12:57:47.238549 #3782525] INFO -- : [592/885] 3823423=magic_comment_test I, [2024-05-09T12:57:47.248068 #3782525] INFO -- : [593/885] 3823423=test_win32ole_variant I, [2024-05-09T12:57:47.256196 #3782525] INFO -- : [594/885] 3823423=test_cgi_modruby I, [2024-05-09T12:57:47.265692 #3782525] INFO -- : [595/885] 3823423=test_win32ole_param_event I, [2024-05-09T12:57:47.277757 #3782525] INFO -- : [596/885] 3823423=test_https_proxy I, [2024-05-09T12:57:47.291276 #3782525] INFO -- : [597/885] 3823423=test_rdoc_parser I, [2024-05-09T12:57:47.408079 #3782525] INFO -- : [598/885] 3823423=test_gem_commands_rebuild_command I, [2024-05-09T12:57:47.421981 #3782525] INFO -- : [599/885] 3823423=test_nomethod_error I, [2024-05-09T12:57:47.424548 #3782525] INFO -- : [600/885] 3823423=test_etc I, [2024-05-09T12:57:47.548295 #3782525] INFO -- : [601/885] 3823423=test_stat I, [2024-05-09T12:57:47.550415 #3782525] INFO -- : [602/885] 3823423=test_files_test_1 I, [2024-05-09T12:57:47.566744 #3782525] INFO -- : [603/885] 3823423=test_dir I, [2024-05-09T12:57:47.683639 #3782525] INFO -- : [604/885] 3823422=test_closure I, [2024-05-09T12:57:47.908425 #3782525] INFO -- : [605/885] 3823423=test_rubygems I, [2024-05-09T12:57:48.079852 #3782525] INFO -- : [606/885] 3823423=test_resolve_symbol I, [2024-05-09T12:57:48.123935 #3782525] INFO -- : [607/885] 3823423=test_path I, [2024-05-09T12:57:48.132696 #3782525] INFO -- : [608/885] 3823423=test_digest I, [2024-05-09T12:57:48.142369 #3782525] INFO -- : [609/885] 3823423=test_rdoc_rd_inline I, [2024-05-09T12:57:48.147465 #3782525] INFO -- : [610/885] 3823423=test_uncorrectable_name_check I, [2024-05-09T12:57:48.162702 #3782525] INFO -- : [611/885] 3823423=test_io I, [2024-05-09T12:57:49.323325 #3782525] INFO -- : [612/885] 3823421=test_rdoc_top_level I, [2024-05-09T12:57:49.626570 #3782525] INFO -- : [613/885] 3823421=test_io_m17n I, [2024-05-09T12:57:50.639930 #3782525] INFO -- : [614/885] 3823422=test_cmethod I, [2024-05-09T12:57:50.662097 #3782525] INFO -- : [615/885] 3823422=test_float I, [2024-05-09T12:57:50.904341 #3782525] INFO -- : [616/885] 3823421=test_gem_stub_specification I, [2024-05-09T12:57:51.145979 #3782525] INFO -- : [617/885] 3823421=test_color I, [2024-05-09T12:57:51.158696 #3782525] INFO -- : [618/885] 3823421=test_propertyputref I, [2024-05-09T12:57:51.165060 #3782525] INFO -- : [619/885] 3823421=test_gb18030 I, [2024-05-09T12:57:51.178896 #3782525] INFO -- : [620/885] 3823421=test_gem_commands_lock_command I, [2024-05-09T12:57:51.202300 #3782525] INFO -- : [621/885] 3823421=test_reline_key I, [2024-05-09T12:57:51.472678 #3782525] INFO -- : [622/885] 3823421=test_unicode_normalize I, [2024-05-09T12:57:52.575679 #3782525] INFO -- : [623/885] 3823422=test_gem_stream_ui I, [2024-05-09T12:57:52.723780 #3782525] INFO -- : [624/885] 3823422=test_rdoc_generator_ri I, [2024-05-09T12:57:52.738832 #3782525] INFO -- : [625/885] 3823422=test_scanner_events I, [2024-05-09T12:57:52.786336 #3782525] INFO -- : [626/885] 3823422=test_ocsp I, [2024-05-09T12:57:52.882253 #3782525] INFO -- : [627/885] 3823422=test_ipaddr I, [2024-05-09T12:57:52.912554 #3782525] INFO -- : [628/885] 3823422=test_omap I, [2024-05-09T12:57:52.926871 #3782525] INFO -- : [629/885] 3823422=test_date_strptime I, [2024-05-09T12:57:53.050610 #3782525] INFO -- : [630/885] 3823422=test_rdoc_generator_pot_po I, [2024-05-09T12:57:53.061355 #3782525] INFO -- : [631/885] 3823422=test_shellwords I, [2024-05-09T12:57:53.073966 #3782525] INFO -- : [632/885] 3823422=test_mul I, [2024-05-09T12:57:53.086702 #3782525] INFO -- : [633/885] 3823422=json_ext_parser_test I, [2024-05-09T12:57:53.106937 #3782525] INFO -- : [634/885] 3823422=test_gem_ext_configure_builder I, [2024-05-09T12:57:53.173287 #3782525] INFO -- : [635/885] 3823422=test_nonblock I, [2024-05-09T12:57:53.197005 #3782525] INFO -- : [636/885] 3823422=test_rdoc_parser_simple I, [2024-05-09T12:57:53.234187 #3782525] INFO -- : [637/885] 3823422=test_autoload I, [2024-05-09T12:57:55.650111 #3782525] INFO -- : [638/885] 3823421=test_gem_package I, [2024-05-09T12:57:56.487329 #3782525] INFO -- : [639/885] 3823421=test_array I, [2024-05-09T12:57:57.797990 #3782525] INFO -- : [640/885] 3823422=test_benchmark I, [2024-05-09T12:57:59.395498 #3782525] INFO -- : [641/885] 3823422=test_at_exit I, [2024-05-09T12:57:59.475343 #3782525] INFO -- : [642/885] 3823422=test_have_macro I, [2024-05-09T12:57:59.790929 #3782525] INFO -- : [643/885] 3823422=test_mkmf I, [2024-05-09T12:57:59.830368 #3782525] INFO -- : [644/885] 3823422=test_gem_source I, [2024-05-09T12:58:00.198049 #3782525] INFO -- : [645/885] 3823422=test_class I, [2024-05-09T12:58:00.212733 #3782525] INFO -- : [646/885] 3823422=test_gem_source_git I, [2024-05-09T12:58:00.392618 #3782525] INFO -- : [647/885] 3823423=test_lexer I, [2024-05-09T12:58:00.397976 #3782525] INFO -- : [648/885] 3823423=test_win32ole_method I, [2024-05-09T12:58:00.419255 #3782525] INFO -- : [649/885] 3823423=test_regex_casefold I, [2024-05-09T12:58:00.868656 #3782525] INFO -- : [650/885] 3823423=test_ripper I, [2024-05-09T12:58:01.180479 #3782525] INFO -- : [651/885] 3823423=test_files_ext I, [2024-05-09T12:58:01.184114 #3782525] INFO -- : [652/885] 3823423=test_assembler I, [2024-05-09T12:58:01.200827 #3782525] INFO -- : [653/885] 3823423=test_stringio I, [2024-05-09T12:58:01.279752 #3782525] INFO -- : [654/885] 3823423=test_thread_cv I, [2024-05-09T12:58:01.356312 #3782525] INFO -- : [655/885] 3823422=test_random I, [2024-05-09T12:58:01.375689 #3782525] INFO -- : [656/885] 3823422=test_eval_history I, [2024-05-09T12:58:01.402320 #3782525] INFO -- : [657/885] 3823422=dispatcher_test I, [2024-05-09T12:58:01.416722 #3782525] INFO -- : [658/885] 3823422=test_unicode I, [2024-05-09T12:58:01.426510 #3782525] INFO -- : [659/885] 3823422=command_line_test I, [2024-05-09T12:58:01.504646 #3782525] INFO -- : [660/885] 3823422=test_pair I, [2024-05-09T12:58:01.919956 #3782525] INFO -- : [661/885] 3823423=test_win32ole_variant_m I, [2024-05-09T12:58:01.928650 #3782525] INFO -- : [662/885] 3823423=test_gem_commands_signout_command I, [2024-05-09T12:58:01.955126 #3782525] INFO -- : [663/885] 3823423=test_gem_package_tar_reader I, [2024-05-09T12:58:02.042389 #3782525] INFO -- : [664/885] 3823423=test_env I, [2024-05-09T12:58:04.520660 #3782525] INFO -- : [665/885] 3823423=test_eval I, [2024-05-09T12:58:04.527956 #3782525] INFO -- : [666/885] 3823423=test_document I, [2024-05-09T12:58:04.529502 #3782525] INFO -- : [667/885] 3823423=test_gem_safe_yaml I, [2024-05-09T12:58:04.571533 #3782525] INFO -- : [668/885] 3823423=test_gem_commands_setup_command I, [2024-05-09T12:58:05.457801 #3782525] INFO -- : [669/885] 3823423=test_history I, [2024-05-09T12:58:05.485750 #3782525] INFO -- : [670/885] 3823423=test_singleton_function I, [2024-05-09T12:58:05.499547 #3782525] INFO -- : [671/885] 3823423=test_iseq I, [2024-05-09T12:58:06.041069 #3782525] INFO -- : [672/885] 3823423=test_primitive I, [2024-05-09T12:58:06.056696 #3782525] INFO -- : [673/885] 3823423=test_parser I, [2024-05-09T12:58:06.078095 #3782525] INFO -- : [674/885] 3823423=test_rdoc_ri_paths I, [2024-05-09T12:58:06.140429 #3782525] INFO -- : [675/885] 3823423=test_cgi_multipart I, [2024-05-09T12:58:06.194149 #3782525] INFO -- : [676/885] 3823423=test_lazy_enumerator I, [2024-05-09T12:58:06.646363 #3782525] INFO -- : [677/885] 3823423=test_gem_request_set_lockfile_tokenizer I, [2024-05-09T12:58:06.793631 #3782525] INFO -- : [678/885] 3823423=test_ractor_compatibility I, [2024-05-09T12:58:06.839374 #3782525] INFO -- : [679/885] 3823422=test_arithmetic_sequence I, [2024-05-09T12:58:06.859285 #3782525] INFO -- : [680/885] 3823422=integer_parse_test I, [2024-05-09T12:58:06.868877 #3782525] INFO -- : [681/885] 3823422=test_autoconf I, [2024-05-09T12:58:06.878166 #3782525] INFO -- : [682/885] 3823422=test_find_executable I, [2024-05-09T12:58:06.887356 #3782525] INFO -- : [683/885] 3823422=test_sockopt I, [2024-05-09T12:58:06.895810 #3782525] INFO -- : [684/885] 3823422=test_ftp I, [2024-05-09T12:58:06.907460 #3782525] INFO -- : [685/885] 3823422=test_gem_source_fetch_problem I, [2024-05-09T12:58:06.927849 #3782525] INFO -- : [686/885] 3823422=test_encoding I, [2024-05-09T12:58:06.971382 #3782525] INFO -- : [687/885] 3823422=test_install I, [2024-05-09T12:58:07.098804 #3782525] INFO -- : [688/885] 3823423=test_rdoc_comment I, [2024-05-09T12:58:07.122041 #3782525] INFO -- : [689/885] 3823422=test_helper I, [2024-05-09T12:58:07.122153 #3782525] INFO -- : [690/885] 3823422=test_duplicate I, [2024-05-09T12:58:07.131704 #3782525] INFO -- : [691/885] 3823422=test_gem_resolver_api_set I, [2024-05-09T12:58:07.145183 #3782525] INFO -- : [692/885] 3823423=test_addr I, [2024-05-09T12:58:07.153176 #3782525] INFO -- : [693/885] 3823423=test_mailto I, [2024-05-09T12:58:07.162437 #3782525] INFO -- : [694/885] 3823423=test_kill_ring I, [2024-05-09T12:58:07.184656 #3782525] INFO -- : [695/885] 3823423=test_member I, [2024-05-09T12:58:07.190698 #3782525] INFO -- : [696/885] 3823423=test_object I, [2024-05-09T12:58:07.200634 #3782525] INFO -- : [697/885] 3823423=test_cgi_header I, [2024-05-09T12:58:07.204400 #3782525] INFO -- : [698/885] 3823423=format_errors_test I, [2024-05-09T12:58:07.210914 #3782525] INFO -- : [699/885] 3823423=test_case_options I, [2024-05-09T12:58:07.224649 #3782525] INFO -- : [700/885] 3823423=test_eval I, [2024-05-09T12:58:07.294864 #3782525] INFO -- : [701/885] 3823422=test_monitor I, [2024-05-09T12:58:07.464671 #3782525] INFO -- : [702/885] 3823422=test_beginendblock I, [2024-05-09T12:58:07.471034 #3782525] INFO -- : [703/885] 3823423=test_nofree I, [2024-05-09T12:58:07.471110 #3782525] INFO -- : [704/885] 3823423=test_whileuntil I, [2024-05-09T12:58:07.506946 #3782525] INFO -- : [705/885] 3823423=test_regexp I, [2024-05-09T12:58:07.884610 #3782525] INFO -- : [706/885] 3823422=test_pointer I, [2024-05-09T12:58:09.585312 #3782525] INFO -- : [707/885] 3823422=test_rdoc_normal_class I, [2024-05-09T12:58:09.630898 #3782525] INFO -- : [708/885] 3823422=test_within_pipe I, [2024-05-09T12:58:09.688476 #3782525] INFO -- : [709/885] 3823422=test_gem_installer I, [2024-05-09T12:58:12.057994 #3782525] INFO -- : [710/885] 3823421=test_bug_reporter I, [2024-05-09T12:58:12.205503 #3782525] INFO -- : [711/885] 3823421=test_buffered_io I, [2024-05-09T12:58:12.247779 #3782525] INFO -- : [712/885] 3823421=test_ossl I, [2024-05-09T12:58:14.969314 #3782525] INFO -- : [713/885] 3823422=test_ruby_lex I, [2024-05-09T12:58:15.147155 #3782525] INFO -- : [714/885] 3823422=test_arith_seq_extract I, [2024-05-09T12:58:15.250937 #3782525] INFO -- : [715/885] 3823422=compiler_test I, [2024-05-09T12:58:15.294148 #3782525] INFO -- : [716/885] 3823422=test_gem_source_subpath_problem I, [2024-05-09T12:58:15.383871 #3782525] INFO -- : [717/885] 3823422=test_object_references I, [2024-05-09T12:58:15.397871 #3782525] INFO -- : [718/885] 3823422=test_trace I, [2024-05-09T12:58:15.413363 #3782525] INFO -- : [719/885] 3823422=test_arity I, [2024-05-09T12:58:15.428440 #3782525] INFO -- : [720/885] 3823422=test_gem_path_support I, [2024-05-09T12:58:15.518366 #3782525] INFO -- : [721/885] 3823422=test_keyword I, [2024-05-09T12:58:16.070174 #3782525] INFO -- : [722/885] 3823422=test_win32ole_type_event I, [2024-05-09T12:58:16.084914 #3782525] INFO -- : [723/885] 3823422=test_scalar_scanner I, [2024-05-09T12:58:16.097879 #3782525] INFO -- : [724/885] 3823422=test_rb_str_dup I, [2024-05-09T12:58:16.108884 #3782525] INFO -- : [725/885] 3823422=test_lambda I, [2024-05-09T12:58:16.176447 #3782525] INFO -- : [726/885] 3823422=test_x509ext I, [2024-05-09T12:58:16.184618 #3782525] INFO -- : [727/885] 3823422=test_emitter I, [2024-05-09T12:58:16.196870 #3782525] INFO -- : [728/885] 3823422=bom_test I, [2024-05-09T12:58:16.261250 #3782525] INFO -- : [729/885] 3823422=test_summary I, [2024-05-09T12:58:16.277746 #3782525] INFO -- : [730/885] 3823422=test_helper_method I, [2024-05-09T12:58:16.296945 #3782525] INFO -- : [731/885] 3823422=test_file I, [2024-05-09T12:58:19.757170 #3782525] INFO -- : [732/885] 3823421=test_config I, [2024-05-09T12:58:20.073966 #3782525] INFO -- : [733/885] 3823421=test_rdoc_markup_to_html I, [2024-05-09T12:58:20.238719 #3782525] INFO -- : [734/885] 3823421=test_foreach I, [2024-05-09T12:58:20.246459 #3782525] INFO -- : [735/885] 3823421=test_append I, [2024-05-09T12:58:20.274955 #3782525] INFO -- : [736/885] 3823421=test_gem_resolver_installer_set I, [2024-05-09T12:58:20.522354 #3782525] INFO -- : [737/885] 3823421=test_pattern_key_name_check I, [2024-05-09T12:58:20.531589 #3782525] INFO -- : [738/885] 3823421=test_profile_frames I, [2024-05-09T12:58:20.701837 #3782525] INFO -- : [739/885] 3823421=test_debug I, [2024-05-09T12:58:20.948716 #3782525] INFO -- : [740/885] 3823421=test_refinement I, [2024-05-09T12:58:22.517327 #3782525] INFO -- : [741/885] 3823422=test_transcode I, [2024-05-09T12:58:22.704956 #3782525] INFO -- : [742/885] 3823422=test_class2name I, [2024-05-09T12:58:22.756243 #3782525] INFO -- : [743/885] 3823422=test_gem_commands_cleanup_command I, [2024-05-09T12:58:23.404424 #3782525] INFO -- : [744/885] 3823422=test_dns I, [2024-05-09T12:58:23.915775 #3782525] INFO -- : [745/885] 3823422=test_c_union_entity I, [2024-05-09T12:58:24.044841 #3782525] INFO -- : [746/885] 3823422=test_cgi_session I, [2024-05-09T12:58:24.060296 #3782525] INFO -- : [747/885] 3823422=test_notimplement I, [2024-05-09T12:58:24.079078 #3782525] INFO -- : [748/885] 3823422=test_x509crl I, [2024-05-09T12:58:24.182628 #3782525] INFO -- : [749/885] 3823422=test_rdoc_markup_heading I, [2024-05-09T12:58:24.197416 #3782525] INFO -- : [750/885] 3823422=test_io_console I, [2024-05-09T12:58:24.549815 #3782525] INFO -- : [751/885] 3823421=test_flip I, [2024-05-09T12:58:24.584377 #3782525] INFO -- : [752/885] 3823421=test_compile_prism I, [2024-05-09T12:58:24.888967 #3782525] INFO -- : [753/885] 3823421=test_helper I, [2024-05-09T12:58:24.895871 #3782525] INFO -- : [754/885] 3823421=test_win32ole_event I, [2024-05-09T12:58:24.989498 #3782525] INFO -- : [755/885] 3823421=test_gem_commands_uninstall_command I, [2024-05-09T12:58:25.814257 #3782525] INFO -- : [756/885] 3823421=test_rdoc_markup_formatter I, [2024-05-09T12:58:25.831090 #3782525] INFO -- : [757/885] 3823421=test_digest_extend I, [2024-05-09T12:58:25.870221 #3782525] INFO -- : [758/885] 3823421=test_gem_ext_cmake_builder I, [2024-05-09T12:58:25.877968 #3782525] INFO -- : [759/885] 3823421=test_thread_fd_close I, [2024-05-09T12:58:26.048530 #3782525] INFO -- : [760/885] 3823421=test_last_thread I, [2024-05-09T12:58:26.861904 #3782525] INFO -- : [761/885] 3823422=test_getopts I, [2024-05-09T12:58:26.871022 #3782525] INFO -- : [762/885] 3823422=test_emitter I, [2024-05-09T12:58:26.878963 #3782525] INFO -- : [763/885] 3823422=test_alias I, [2024-05-09T12:58:26.951532 #3782525] INFO -- : [764/885] 3823421=test_fips I, [2024-05-09T12:58:27.025334 #3782525] INFO -- : [765/885] 3823422=test_gem_resolver I, [2024-05-09T12:58:27.218931 #3782525] INFO -- : [766/885] 3823421=test_gem_source_vendor I, [2024-05-09T12:58:27.238786 #3782525] INFO -- : [767/885] 3823421=test_object I, [2024-05-09T12:58:27.413256 #3782525] INFO -- : [768/885] 3823422=test_dln I, [2024-05-09T12:58:27.460215 #3782525] INFO -- : [769/885] 3823422=unescape_test I, [2024-05-09T12:58:27.600859 #3782525] INFO -- : [770/885] 3823421=test_gem_commands_exec_command I, [2024-05-09T12:58:28.875935 #3782525] INFO -- : [771/885] 3823422=test_color_printer I, [2024-05-09T12:58:28.888241 #3782525] INFO -- : [772/885] 3823422=test_super I, [2024-05-09T12:58:29.067172 #3782525] INFO -- : [773/885] 3823421=test_modify_expand I, [2024-05-09T12:58:29.080215 #3782525] INFO -- : [774/885] 3823421=test_pkg_config I, [2024-05-09T12:58:29.110906 #3782525] INFO -- : [775/885] 3823421=test_gem_available_set I, [2024-05-09T12:58:29.219349 #3782525] INFO -- : [776/885] 3823421=errors_test I, [2024-05-09T12:58:30.592483 #3782525] INFO -- : [777/885] 3823421=test_convertible I, [2024-05-09T12:58:30.667915 #3782525] INFO -- : [778/885] 3823422=test_vm_dump I, [2024-05-09T12:58:30.677131 #3782525] INFO -- : [779/885] 3823422=json_encoding_test I, [2024-05-09T12:58:30.746434 #3782525] INFO -- : [780/885] 3823422=test_func I, [2024-05-09T12:58:32.888144 #3782525] INFO -- : [781/885] 3823421=test_config I, [2024-05-09T12:58:32.929617 #3782525] INFO -- : [782/885] 3823421=test_gem_console_ui I, [2024-05-09T12:58:32.936976 #3782525] INFO -- : [783/885] 3823421=test_ifunless I, [2024-05-09T12:58:33.311179 #3782525] INFO -- : [784/885] 3823421=test_allocation I, [2024-05-09T12:58:35.332022 #3782525] INFO -- : [785/885] 3823421=test_insns_leaf I, [2024-05-09T12:58:35.541520 #3782525] INFO -- : [786/885] 3823421=test_readpartial I, [2024-05-09T12:58:35.754266 #3782525] INFO -- : [787/885] 3823421=test_httpresponse I, [2024-05-09T12:58:35.794176 #3782525] INFO -- : [788/885] 3823421=test_rdoc_parser_ruby I, [2024-05-09T12:58:36.004731 #3782525] INFO -- : [789/885] 3823422=test_x509req I, [2024-05-09T12:58:36.024309 #3782525] INFO -- : [790/885] 3823422=test_gem I, [2024-05-09T12:58:37.161082 #3782525] INFO -- : [791/885] 3823421=test_registry I, [2024-05-09T12:58:37.170111 #3782525] INFO -- : [792/885] 3823421=json_generator_test I, [2024-05-09T12:58:37.282097 #3782525] INFO -- : [793/885] 3823421=test_ansi_without_terminfo I, [2024-05-09T12:58:37.292511 #3782525] INFO -- : [794/885] 3823421=test_ractor I, [2024-05-09T12:58:37.315668 #3782525] INFO -- : [795/885] 3823421=test_parser I, [2024-05-09T12:58:37.344699 #3782525] INFO -- : [796/885] 3823421=test_rdoc_markup_to_label I, [2024-05-09T12:58:37.379324 #3782525] INFO -- : [797/885] 3823421=test_gem_resolver_best_set I, [2024-05-09T12:58:37.466917 #3782525] INFO -- : [798/885] 3823421=test_cgi_core I, [2024-05-09T12:58:37.497743 #3782525] INFO -- : [799/885] 3823421=test_enc_str_buf_cat I, [2024-05-09T12:58:37.511611 #3782525] INFO -- : [800/885] 3823421=test_bignum I, [2024-05-09T12:58:38.538890 #3782525] INFO -- : [801/885] 3823422=newline_test I, [2024-05-09T12:58:38.626137 #3782525] INFO -- : [802/885] 3823422=test_rdoc_markup_hard_break I, [2024-05-09T12:58:38.650588 #3782525] INFO -- : [803/885] 3823422=test_marshal I, [2024-05-09T12:58:40.203049 #3782525] INFO -- : [804/885] 3823422=test_ancdata I, [2024-05-09T12:58:40.271480 #3782525] INFO -- : [805/885] 3823422=ractor_test I, [2024-05-09T12:58:40.281159 #3782525] INFO -- : [806/885] 3823422=test_nesting_parser I, [2024-05-09T12:58:40.304954 #3782525] INFO -- : [807/885] 3823422=test_gem_resolver_conflict I, [2024-05-09T12:58:40.346730 #3782525] INFO -- : [808/885] 3823422=test_ractor I, [2024-05-09T12:58:40.680752 #3782525] INFO -- : [809/885] 3823422=test_gem_commands_help_command I, [2024-05-09T12:58:40.767951 #3782525] INFO -- : [810/885] 3823422=test_scheduler I, [2024-05-09T12:58:40.957073 #3782525] INFO -- : [811/885] 3823422=test_ssl I, [2024-05-09T12:58:41.103981 #3782525] INFO -- : [812/885] 3823421=test_date_marshal I, [2024-05-09T12:58:41.108693 #3782525] INFO -- : [813/885] 3823422=test_have_func I, [2024-05-09T12:58:41.117789 #3782525] INFO -- : [814/885] 3823421=test_configuration I, [2024-05-09T12:58:41.220765 #3782525] INFO -- : [815/885] 3823421=test_gem_resolver_local_specification I, [2024-05-09T12:58:41.255730 #3782525] INFO -- : [816/885] 3823421=test_gem_commands_list_command I, [2024-05-09T12:58:41.267004 #3782525] INFO -- : [817/885] 3823421=test_date_new I, [2024-05-09T12:58:41.278705 #3782525] INFO -- : [818/885] 3823421=test_context I, [2024-05-09T12:58:41.367480 #3782525] INFO -- : [819/885] 3823421=test_udp I, [2024-05-09T12:58:41.407179 #3782525] INFO -- : [820/885] 3823421=test_gem_commands_contents_command I, [2024-05-09T12:58:41.540131 #3782525] INFO -- : [821/885] 3823421=test_rdoc_servlet I, [2024-05-09T12:58:41.573743 #3782525] INFO -- : [822/885] 3823423=test_coder I, [2024-05-09T12:58:41.590719 #3782525] INFO -- : [823/885] 3823423=test_symbol I, [2024-05-09T12:58:41.697599 #3782525] INFO -- : [824/885] 3823421=test_gem_commands_search_command I, [2024-05-09T12:58:41.706075 #3782525] INFO -- : [825/885] 3823421=test_formatter I, [2024-05-09T12:58:41.718914 #3782525] INFO -- : [826/885] 3823421=test_unix I, [2024-05-09T12:58:41.841110 #3782525] INFO -- : [827/885] 3823421=test_integer I, [2024-05-09T12:58:42.331399 #3782525] INFO -- : [828/885] 3823422=test_rbconfig I, [2024-05-09T12:58:42.343260 #3782525] INFO -- : [829/885] 3823422=test_num2int I, [2024-05-09T12:58:42.353295 #3782525] INFO -- : [830/885] 3823422=test_iter_break I, [2024-05-09T12:58:42.414928 #3782525] INFO -- : [831/885] 3823422=test_extlibs I, [2024-05-09T12:58:43.956511 #3782525] INFO -- : [832/885] 3823422=test_gem_commands_signin_command I, [2024-05-09T12:58:44.194082 #3782525] INFO -- : [833/885] 3823422=test_range I, [2024-05-09T12:58:44.363884 #3782525] INFO -- : [834/885] 3823421=test_recursion I, [2024-05-09T12:58:44.403804 #3782525] INFO -- : [835/885] 3823421=test_require I, [2024-05-09T12:58:44.959969 #3782525] INFO -- : [836/885] 3823422=test_enum I, [2024-05-09T12:58:45.771286 #3782525] INFO -- : [837/885] 3823421=test_rdoc_markup_include I, [2024-05-09T12:58:45.784510 #3782525] INFO -- : [838/885] 3823421=test_address_resolve I, [2024-05-09T12:58:45.814454 #3782525] INFO -- : [839/885] 3823421=test_trick I, [2024-05-09T12:58:46.077109 #3782525] INFO -- : [840/885] 3823422=test_ractor I, [2024-05-09T12:58:46.086428 #3782525] INFO -- : [841/885] 3823422=test_stream I, [2024-05-09T12:58:46.098068 #3782525] INFO -- : [842/885] 3823422=test_rdoc_attr I, [2024-05-09T12:58:46.116727 #3782525] INFO -- : [843/885] 3823422=test_locale I, [2024-05-09T12:58:46.144701 #3782525] INFO -- : [844/885] 3823422=test_ts I, [2024-05-09T12:58:46.435792 #3782525] INFO -- : [845/885] 3823422=test_symbol I, [2024-05-09T12:58:46.446166 #3782525] INFO -- : [846/885] 3823422=test_project_sanity I, [2024-05-09T12:58:46.509103 #3782525] INFO -- : [847/885] 3823422=location_test I, [2024-05-09T12:58:46.588271 #3782525] INFO -- : [848/885] 3823422=test_delegate I, [2024-05-09T12:58:46.610207 #3782525] INFO -- : [849/885] 3823422=test_chilled I, [2024-05-09T12:58:46.664714 #3782525] INFO -- : [850/885] 3823422=test_ensured I, [2024-05-09T12:58:46.675374 #3782525] INFO -- : [851/885] 3823422=test_euc_jp I, [2024-05-09T12:58:46.694739 #3782525] INFO -- : [852/885] 3823422=test_key_stroke I, [2024-05-09T12:58:46.703592 #3782525] INFO -- : [853/885] 3823422=test_rdoc_markup I, [2024-05-09T12:58:46.714806 #3782525] INFO -- : [854/885] 3823422=test_alias_and_anchor I, [2024-05-09T12:58:46.740341 #3782525] INFO -- : [855/885] 3823422=test_time I, [2024-05-09T12:58:46.950854 #3782525] INFO -- : [856/885] 3823422=test_popen_deadlock I, [2024-05-09T12:58:47.517183 #3782525] INFO -- : [857/885] 3823422=ruby_api_test I, [2024-05-09T12:58:47.705795 #3782525] INFO -- : [858/885] 3823422=test_gem_resolver_index_set I, [2024-05-09T12:58:47.762983 #3782525] INFO -- : [859/885] 3823422=test_webauthn_listener_response I, [2024-05-09T12:58:47.856306 #3782525] INFO -- : [860/885] 3823422=test_sleep I, [2024-05-09T12:58:48.029960 #3782525] INFO -- : [861/885] 3823423=test_set_len I, [2024-05-09T12:58:48.038237 #3782525] INFO -- : [862/885] 3823423=constant_path_node_test I, [2024-05-09T12:58:48.043875 #3782525] INFO -- : [863/885] 3823423=test_interned_str I, [2024-05-09T12:58:48.049124 #3782525] INFO -- : [864/885] 3823423=test_folderitem2_invokeverb I, [2024-05-09T12:58:48.068743 #3782525] INFO -- : [865/885] 3823423=test_pattern_matching I, [2024-05-09T12:58:48.212280 #3782525] INFO -- : [866/885] 3823423=test_gc I, [2024-05-09T12:58:48.335094 #3782525] INFO -- : [867/885] 3823421=test_gem_bundler_version_finder I, [2024-05-09T12:58:48.409124 #3782525] INFO -- : [868/885] 3823421=test_gem_request_set I, [2024-05-09T12:58:48.912958 #3782525] INFO -- : [869/885] 3823421=test_data I, [2024-05-09T12:58:48.980362 #3782525] INFO -- : [870/885] 3823421=test_bug-14834 I, [2024-05-09T12:58:49.037618 #3782525] INFO -- : [871/885] 3823421=test_inlinecache I, [2024-05-09T12:58:49.050863 #3782525] INFO -- : [872/885] 3823421=test_socket I, [2024-05-09T12:58:49.954487 #3782525] INFO -- : [873/885] 3823421=test_terminfo I, [2024-05-09T12:58:49.976252 #3782525] INFO -- : [874/885] 3823421=test_thread I, [2024-05-09T12:58:52.820140 #3782525] INFO -- : [875/885] 3823422=test_time_tz I, [2024-05-09T12:58:52.876644 #3782525] INFO -- : [876/885] 3823422=test_addrinfo I, [2024-05-09T12:58:52.908357 #3782525] INFO -- : .Closed file descriptor: TestSocketAddrinfo#test_addrinfo_timeout: 11 I, [2024-05-09T12:58:52.908431 #3782525] INFO -- : Leaked file descriptor: TestSocketAddrinfo#test_addrinfo_timeout: 9 # I, [2024-05-09T12:58:52.942269 #3782525] INFO -- : COMMAND PID USER FD TYPE DEVICE SIZE/OFF NODE NAME I, [2024-05-09T12:58:52.942346 #3782525] INFO -- : ruby 3823422 opc 9u unix 0x0000000000000000 0t0 2905891238 type=STREAM I, [2024-05-09T12:58:53.034579 #3782525] INFO -- : [877/885] 3823422=test_to_ruby I, [2024-05-09T12:58:53.050275 #3782525] INFO -- : [878/885] 3823422=test_windows_1251 I, [2024-05-09T12:58:53.064103 #3782525] INFO -- : [879/885] 3823422=test_gem_ext_builder I, [2024-05-09T12:58:54.265723 #3782525] INFO -- : [880/885] 3823422=test_to_ary_concat I, [2024-05-09T12:58:58.398612 #3782525] INFO -- : [881/885] 3823423=test_history I, [2024-05-09T12:58:58.415185 #3782525] INFO -- : [882/885] 3823423=test_reline I, [2024-05-09T12:58:58.540609 #3782525] INFO -- : [883/885] 3823423=test_ellipsize I, [2024-05-09T12:58:58.573655 #3782525] INFO -- : [884/885] 3823423=test_call I, [2024-05-09T12:58:58.746803 #3782525] INFO -- : [885/885] 3823421=test_gem_commands_build_command I, [2024-05-09T12:58:59.175220 #3782525] INFO -- : Finished tests in 194.290564s, 135.2356 tests/s, 48106.1448 assertions/s. E, [2024-05-09T12:58:59.175452 #3782525] ERROR -- : Children under /tmp/rubytest.hq2gwy: E, [2024-05-09T12:58:59.175502 #3782525] ERROR -- : * drwx------ 4 28 2024-05-09 12:57:47 +0000 gem_rebuild20240509-3823423-qrp8qh/ E, [2024-05-09T12:58:59.175602 #3782525] ERROR -- : * drwxrwxr-x 2 40 2024-05-09 12:57:47 +0000 old/ E, [2024-05-09T12:58:59.175618 #3782525] ERROR -- : * -rw-rw-r-- 1 4096 2024-05-09 12:57:47 +0000 rebuild_test_gem-1.0.0.gem E, [2024-05-09T12:58:59.175746 #3782525] ERROR -- : * drwxrwxr-x 2 40 2024-05-09 12:57:47 +0000 new/ E, [2024-05-09T12:58:59.175773 #3782525] ERROR -- : * -rw-rw-r-- 1 4096 2024-05-09 12:57:47 +0000 rebuild_test_gem-1.0.0.gem I, [2024-05-09T12:58:59.181628 #3782525] INFO -- : 26275 tests, 9346570 assertions, 0 failures, 0 errors, 320 skips I, [2024-05-09T12:58:59.181664 #3782525] INFO -- : I, [2024-05-09T12:58:59.181676 #3782525] INFO -- : ruby -v: ruby 3.4.0dev (2024-05-09T10:37:25Z master 74c911dfa9) [aarch64-linux] I, [2024-05-09T12:58:59.182433 #3782525] INFO -- : $$$[end] "make yes-test-all TESTOPTS='--stderr-on-failure' TESTS='-j3'" exit with 0. I, [2024-05-09T12:58:59.182721 #3782525] INFO -- : $$$[beg] make yes-test-rubyspec MSPECOPT='--error-output stderr --debug -j' TESTS='-j3' I, [2024-05-09T12:58:59.308400 #3782525] INFO -- : BASERUBY = /usr/local/bin/ruby --disable=gems I, [2024-05-09T12:58:59.308477 #3782525] INFO -- : CC = gcc I, [2024-05-09T12:58:59.308508 #3782525] INFO -- : LD = ld I, [2024-05-09T12:58:59.308523 #3782525] INFO -- : LDSHARED = gcc -shared I, [2024-05-09T12:58:59.308534 #3782525] INFO -- : CFLAGS = -O3 -fno-fast-math -ggdb3 -Wall -Wextra -Wdeprecated-declarations -Wdiv-by-zero -Wduplicated-cond -Wimplicit-function-declaration -Wimplicit-int -Wpointer-arith -Wwrite-strings -Wold-style-definition -Wimplicit-fallthrough=0 -Wmissing-noreturn -Wno-cast-function-type -Wno-constant-logical-operand -Wno-long-long -Wno-missing-field-initializers -Wno-overlength-strings -Wno-packed-bitfield-compat -Wno-parentheses-equality -Wno-self-assign -Wno-tautological-compare -Wno-unused-parameter -Wno-unused-value -Wsuggest-attribute=format -Wsuggest-attribute=noreturn -Wunused-variable -Wmisleading-indentation -Wundef I, [2024-05-09T12:58:59.308545 #3782525] INFO -- : XCFLAGS = -U_FORTIFY_SOURCE -D_FORTIFY_SOURCE=2 -fstack-protector-strong -msign-return-address=all -fno-strict-overflow -fvisibility=hidden -fexcess-precision=standard -DRUBY_EXPORT -fPIE -I. -I.ext/include/aarch64-linux -I/home/opc/ruby/src/master/include -I/home/opc/ruby/src/master -I/home/opc/ruby/src/master/prism -I/home/opc/ruby/src/master/enc/unicode/15.0.0 I, [2024-05-09T12:58:59.308554 #3782525] INFO -- : CPPFLAGS = I, [2024-05-09T12:58:59.308563 #3782525] INFO -- : DLDFLAGS = -Wl,--compress-debug-sections=zlib -fstack-protector-strong -pie I, [2024-05-09T12:58:59.308572 #3782525] INFO -- : SOLIBS = -lz -lrt -lrt -ldl -lcrypt -lm -lpthread I, [2024-05-09T12:58:59.308581 #3782525] INFO -- : LANG = en_US.UTF-8 I, [2024-05-09T12:58:59.308589 #3782525] INFO -- : LC_ALL = I, [2024-05-09T12:58:59.308598 #3782525] INFO -- : LC_CTYPE = I, [2024-05-09T12:58:59.308606 #3782525] INFO -- : MFLAGS = I, [2024-05-09T12:58:59.308651 #3782525] INFO -- : RUSTC = rustc I, [2024-05-09T12:58:59.308660 #3782525] INFO -- : YJIT_RUSTC_ARGS = --crate-name=yjit --crate-type=staticlib --edition=2021 -g -C lto=thin -C opt-level=3 -C overflow-checks=on '--out-dir=/home/opc/ruby/build/master/yjit/target/release/' /home/opc/ruby/src/master/yjit/src/lib.rs I, [2024-05-09T12:58:59.309344 #3782525] INFO -- : gcc (GCC) 8.5.0 20210514 (Red Hat 8.5.0-10.1.0.1) I, [2024-05-09T12:58:59.309362 #3782525] INFO -- : Copyright (C) 2018 Free Software Foundation, Inc. I, [2024-05-09T12:58:59.309372 #3782525] INFO -- : This is free software; see the source for copying conditions. There is NO I, [2024-05-09T12:58:59.309381 #3782525] INFO -- : warranty; not even for MERCHANTABILITY or FITNESS FOR A PARTICULAR PURPOSE. I, [2024-05-09T12:58:59.309390 #3782525] INFO -- : I, [2024-05-09T12:58:59.311374 #3782525] INFO -- : generating enc.mk I, [2024-05-09T12:58:59.541280 #3782525] INFO -- : generating encdb.h I, [2024-05-09T12:58:59.579124 #3782525] INFO -- : encdb.h unchanged I, [2024-05-09T12:58:59.580414 #3782525] INFO -- : making enc I, [2024-05-09T12:58:59.608401 #3782525] INFO -- : make[1]: Entering directory '/home/opc/ruby/build/master' I, [2024-05-09T12:58:59.608463 #3782525] INFO -- : make[1]: Nothing to be done for 'enc'. I, [2024-05-09T12:58:59.608475 #3782525] INFO -- : make[1]: Leaving directory '/home/opc/ruby/build/master' I, [2024-05-09T12:58:59.609280 #3782525] INFO -- : making srcs under enc I, [2024-05-09T12:58:59.650928 #3782525] INFO -- : make[1]: Entering directory '/home/opc/ruby/build/master' I, [2024-05-09T12:58:59.650989 #3782525] INFO -- : make[1]: Nothing to be done for 'srcs'. I, [2024-05-09T12:58:59.651001 #3782525] INFO -- : make[1]: Leaving directory '/home/opc/ruby/build/master' I, [2024-05-09T12:58:59.652140 #3782525] INFO -- : generating transdb.h I, [2024-05-09T12:58:59.794914 #3782525] INFO -- : transdb.h unchanged I, [2024-05-09T12:58:59.796293 #3782525] INFO -- : making trans I, [2024-05-09T12:58:59.844624 #3782525] INFO -- : make[1]: Entering directory '/home/opc/ruby/build/master' I, [2024-05-09T12:58:59.844697 #3782525] INFO -- : make[1]: Nothing to be done for 'trans'. I, [2024-05-09T12:58:59.844709 #3782525] INFO -- : make[1]: Leaving directory '/home/opc/ruby/build/master' I, [2024-05-09T12:58:59.845460 #3782525] INFO -- : making encs I, [2024-05-09T12:58:59.897853 #3782525] INFO -- : make[1]: Entering directory '/home/opc/ruby/build/master' I, [2024-05-09T12:58:59.897929 #3782525] INFO -- : make[1]: Nothing to be done for 'encs'. I, [2024-05-09T12:58:59.897940 #3782525] INFO -- : make[1]: Leaving directory '/home/opc/ruby/build/master' I, [2024-05-09T12:58:59.899924 #3782525] INFO -- : generating makefiles ext/configure-ext.mk I, [2024-05-09T12:58:59.939613 #3782525] INFO -- : ext/configure-ext.mk updated I, [2024-05-09T12:58:59.943400 #3782525] INFO -- : make[1]: Entering directory '/home/opc/ruby/build/master' I, [2024-05-09T12:59:01.990653 #3782525] INFO -- : make[1]: Leaving directory '/home/opc/ruby/build/master' I, [2024-05-09T12:59:01.991366 #3782525] INFO -- : generating makefile exts.mk I, [2024-05-09T12:59:02.050511 #3782525] INFO -- : exts.mk unchanged I, [2024-05-09T12:59:02.055296 #3782525] INFO -- : make[1]: Entering directory '/home/opc/ruby/build/master' I, [2024-05-09T12:59:02.356587 #3782525] INFO -- : make[2]: Entering directory '/home/opc/ruby/build/master/ext/coverage' I, [2024-05-09T12:59:02.361496 #3782525] INFO -- : make[2]: Leaving directory '/home/opc/ruby/build/master/ext/coverage' I, [2024-05-09T12:59:02.367612 #3782525] INFO -- : make[2]: Entering directory '/home/opc/ruby/build/master/ext/date' I, [2024-05-09T12:59:02.372996 #3782525] INFO -- : make[2]: Leaving directory '/home/opc/ruby/build/master/ext/date' I, [2024-05-09T12:59:02.376642 #3782525] INFO -- : make[2]: Entering directory '/home/opc/ruby/build/master/ext/digest' I, [2024-05-09T12:59:02.385622 #3782525] INFO -- : make[2]: Leaving directory '/home/opc/ruby/build/master/ext/digest' I, [2024-05-09T12:59:02.408350 #3782525] INFO -- : make[2]: Entering directory '/home/opc/ruby/build/master/ext/digest/sha2' I, [2024-05-09T12:59:02.413244 #3782525] INFO -- : make[2]: Leaving directory '/home/opc/ruby/build/master/ext/digest/sha2' I, [2024-05-09T12:59:02.431536 #3782525] INFO -- : make[2]: Entering directory '/home/opc/ruby/build/master/ext/fiddle' I, [2024-05-09T12:59:02.442029 #3782525] INFO -- : make[2]: Leaving directory '/home/opc/ruby/build/master/ext/fiddle' I, [2024-05-09T12:59:02.446336 #3782525] INFO -- : make[2]: Entering directory '/home/opc/ruby/build/master/ext/io/console' I, [2024-05-09T12:59:02.450917 #3782525] INFO -- : make[2]: Leaving directory '/home/opc/ruby/build/master/ext/io/console' I, [2024-05-09T12:59:02.462078 #3782525] INFO -- : make[2]: Entering directory '/home/opc/ruby/build/master/ext/json' I, [2024-05-09T12:59:02.471651 #3782525] INFO -- : make[2]: Leaving directory '/home/opc/ruby/build/master/ext/json' I, [2024-05-09T12:59:02.484830 #3782525] INFO -- : make[2]: Entering directory '/home/opc/ruby/build/master/ext/monitor' I, [2024-05-09T12:59:02.489060 #3782525] INFO -- : make[2]: Leaving directory '/home/opc/ruby/build/master/ext/monitor' I, [2024-05-09T12:59:02.495121 #3782525] INFO -- : make[2]: Entering directory '/home/opc/ruby/build/master/ext/objspace' I, [2024-05-09T12:59:02.500940 #3782525] INFO -- : make[2]: Leaving directory '/home/opc/ruby/build/master/ext/objspace' I, [2024-05-09T12:59:02.519759 #3782525] INFO -- : make[2]: Entering directory '/home/opc/ruby/build/master/ext/openssl' I, [2024-05-09T12:59:02.541634 #3782525] INFO -- : make[2]: Leaving directory '/home/opc/ruby/build/master/ext/openssl' I, [2024-05-09T12:59:02.545911 #3782525] INFO -- : make[2]: Entering directory '/home/opc/ruby/build/master/ext/pathname' I, [2024-05-09T12:59:02.550054 #3782525] INFO -- : make[2]: Leaving directory '/home/opc/ruby/build/master/ext/pathname' I, [2024-05-09T12:59:02.556250 #3782525] INFO -- : make[2]: Entering directory '/home/opc/ruby/build/master/ext/psych' I, [2024-05-09T12:59:02.577502 #3782525] INFO -- : make[2]: Leaving directory '/home/opc/ruby/build/master/ext/psych' I, [2024-05-09T12:59:02.581964 #3782525] INFO -- : make[2]: Entering directory '/home/opc/ruby/build/master/ext/pty' I, [2024-05-09T12:59:02.586127 #3782525] INFO -- : make[2]: Leaving directory '/home/opc/ruby/build/master/ext/pty' I, [2024-05-09T12:59:02.599417 #3782525] INFO -- : make[2]: Entering directory '/home/opc/ruby/build/master/ext/ripper' I, [2024-05-09T12:59:02.607177 #3782525] INFO -- : make[2]: Leaving directory '/home/opc/ruby/build/master/ext/ripper' I, [2024-05-09T12:59:02.609209 #3782525] INFO -- : make[2]: Entering directory '/home/opc/ruby/build/master/ext/rubyvm' I, [2024-05-09T12:59:02.612793 #3782525] INFO -- : make[2]: Leaving directory '/home/opc/ruby/build/master/ext/rubyvm' I, [2024-05-09T12:59:02.624837 #3782525] INFO -- : make[2]: Entering directory '/home/opc/ruby/build/master/ext/socket' I, [2024-05-09T12:59:02.635573 #3782525] INFO -- : make[2]: Leaving directory '/home/opc/ruby/build/master/ext/socket' I, [2024-05-09T12:59:02.651050 #3782525] INFO -- : make[2]: Entering directory '/home/opc/ruby/build/master/.bundle/gems/bigdecimal-3.1.7/ext/bigdecimal' I, [2024-05-09T12:59:02.681721 #3782525] INFO -- : make[2]: Leaving directory '/home/opc/ruby/build/master/.bundle/gems/bigdecimal-3.1.7/ext/bigdecimal' I, [2024-05-09T12:59:02.684314 #3782525] INFO -- : make[2]: Entering directory '/home/opc/ruby/build/master/.bundle/gems/bigdecimal-3.1.8/ext/bigdecimal' I, [2024-05-09T12:59:02.715057 #3782525] INFO -- : make[2]: Leaving directory '/home/opc/ruby/build/master/.bundle/gems/bigdecimal-3.1.8/ext/bigdecimal' I, [2024-05-09T12:59:02.717690 #3782525] INFO -- : make[2]: Entering directory '/home/opc/ruby/build/master/.bundle/gems/debug-1.9.2/ext/debug' I, [2024-05-09T12:59:02.747924 #3782525] INFO -- : make[2]: Leaving directory '/home/opc/ruby/build/master/.bundle/gems/debug-1.9.2/ext/debug' I, [2024-05-09T12:59:02.750508 #3782525] INFO -- : make[2]: Entering directory '/home/opc/ruby/build/master/.bundle/gems/nkf-0.2.0/ext/nkf' I, [2024-05-09T12:59:02.780875 #3782525] INFO -- : make[2]: Leaving directory '/home/opc/ruby/build/master/.bundle/gems/nkf-0.2.0/ext/nkf' I, [2024-05-09T12:59:02.783352 #3782525] INFO -- : make[2]: Entering directory '/home/opc/ruby/build/master/.bundle/gems/racc-1.7.3/ext/racc/cparse' I, [2024-05-09T12:59:02.813828 #3782525] INFO -- : make[2]: Leaving directory '/home/opc/ruby/build/master/.bundle/gems/racc-1.7.3/ext/racc/cparse' I, [2024-05-09T12:59:02.816736 #3782525] INFO -- : make[2]: Entering directory '/home/opc/ruby/build/master/.bundle/gems/rbs-3.4.4/ext/rbs_extension' I, [2024-05-09T12:59:02.846850 #3782525] INFO -- : make[2]: Leaving directory '/home/opc/ruby/build/master/.bundle/gems/rbs-3.4.4/ext/rbs_extension' I, [2024-05-09T12:59:02.849514 #3782525] INFO -- : make[2]: Entering directory '/home/opc/ruby/build/master/.bundle/gems/syslog-0.1.2/ext/syslog' I, [2024-05-09T12:59:02.879736 #3782525] INFO -- : make[2]: Leaving directory '/home/opc/ruby/build/master/.bundle/gems/syslog-0.1.2/ext/syslog' I, [2024-05-09T12:59:02.917729 #3782525] INFO -- : make[2]: Entering directory '/home/opc/ruby/build/master' I, [2024-05-09T12:59:03.000114 #3782525] INFO -- : make[2]: 'ruby' is up to date. I, [2024-05-09T12:59:03.000195 #3782525] INFO -- : make[2]: Leaving directory '/home/opc/ruby/build/master' I, [2024-05-09T12:59:03.000292 #3782525] INFO -- : make[1]: Leaving directory '/home/opc/ruby/build/master' I, [2024-05-09T12:59:03.004683 #3782525] INFO -- : make[1]: Entering directory '/home/opc/ruby/build/master' I, [2024-05-09T12:59:03.004722 #3782525] INFO -- : make[1]: Nothing to be done for 'note'. I, [2024-05-09T12:59:03.004733 #3782525] INFO -- : make[1]: Leaving directory '/home/opc/ruby/build/master' E, [2024-05-09T12:59:03.079592 #3782525] ERROR -- : $ /home/opc/ruby/build/master/miniruby -I/home/opc/ruby/src/master/lib /home/opc/ruby/src/master/tool/runruby.rb --archdir=/home/opc/ruby/build/master --extout=.ext -- /home/opc/ruby/src/master/spec/mspec/bin/mspec-run -B /home/opc/ruby/src/master/spec/default.mspec --error-output stderr --debug -fy -o /tmp/rubytest.1re2rt/1-mspec-multi-0 E, [2024-05-09T12:59:03.079898 #3782525] ERROR -- : $ /home/opc/ruby/build/master/miniruby -I/home/opc/ruby/src/master/lib /home/opc/ruby/src/master/tool/runruby.rb --archdir=/home/opc/ruby/build/master --extout=.ext -- /home/opc/ruby/src/master/spec/mspec/bin/mspec-run -B /home/opc/ruby/src/master/spec/default.mspec --error-output stderr --debug -fy -o /tmp/rubytest.1re2rt/2-mspec-multi-1 E, [2024-05-09T12:59:03.080180 #3782525] ERROR -- : $ /home/opc/ruby/build/master/miniruby -I/home/opc/ruby/src/master/lib /home/opc/ruby/src/master/tool/runruby.rb --archdir=/home/opc/ruby/build/master --extout=.ext -- /home/opc/ruby/src/master/spec/mspec/bin/mspec-run -B /home/opc/ruby/src/master/spec/default.mspec --error-output stderr --debug -fy -o /tmp/rubytest.1re2rt/3-mspec-multi-2 I, [2024-05-09T12:59:03.213208 #3782525] INFO -- : ruby 3.4.0dev (2024-05-09T10:37:25Z master 74c911dfa9) [aarch64-linux] I, [2024-05-09T12:59:08.540158 #3782525] INFO -- : 0 ......................................................................... I, [2024-05-09T12:59:10.998223 #3782525] INFO -- : 73 ......................................................................... I, [2024-05-09T12:59:11.190579 #3782525] INFO -- : 146 ......................................................................... I, [2024-05-09T12:59:11.486497 #3782525] INFO -- : 219 ......................................................................... I, [2024-05-09T12:59:11.657697 #3782525] INFO -- : 292 ......................................................................... I, [2024-05-09T12:59:11.904625 #3782525] INFO -- : 365 ......................................................................... I, [2024-05-09T12:59:12.028386 #3782525] INFO -- : 438 ......................................................................... I, [2024-05-09T12:59:12.090268 #3782525] INFO -- : 511 ......................................................................... I, [2024-05-09T12:59:12.154391 #3782525] INFO -- : 584 ......................................................................... I, [2024-05-09T12:59:12.783702 #3782525] INFO -- : 657 ......................................................................... I, [2024-05-09T12:59:12.870492 #3782525] INFO -- : 730 ......................................................................... I, [2024-05-09T12:59:12.923660 #3782525] INFO -- : 803 ......................................................................... I, [2024-05-09T12:59:13.124833 #3782525] INFO -- : 876 ......................................................................... I, [2024-05-09T12:59:13.231962 #3782525] INFO -- : 949 ......................................................................... I, [2024-05-09T12:59:13.842674 #3782525] INFO -- : 1022 ......................................................................... I, [2024-05-09T12:59:16.118321 #3782525] INFO -- : 1095 ......................................................................... I, [2024-05-09T12:59:16.997644 #3782525] INFO -- : 1168 ......................................................................... I, [2024-05-09T12:59:17.144672 #3782525] INFO -- : 1241 ......................................................................... I, [2024-05-09T12:59:17.352098 #3782525] INFO -- : 1314 ......................................................................... I, [2024-05-09T12:59:17.445103 #3782525] INFO -- : 1387 ......................................................................... I, [2024-05-09T12:59:19.492794 #3782525] INFO -- : 1460 ......................................................................... I, [2024-05-09T12:59:22.816892 #3782525] INFO -- : 1533 ......................................................................... I, [2024-05-09T12:59:22.966906 #3782525] INFO -- : 1606 ......................................................................... I, [2024-05-09T12:59:23.775170 #3782525] INFO -- : 1679 ......................................................................... I, [2024-05-09T12:59:24.090497 #3782525] INFO -- : 1752 ......................................................................... I, [2024-05-09T12:59:24.400763 #3782525] INFO -- : 1825 ......................................................................... I, [2024-05-09T12:59:24.730421 #3782525] INFO -- : 1898 ......................................................................... I, [2024-05-09T12:59:25.129389 #3782525] INFO -- : 1971 ......................................................................... I, [2024-05-09T12:59:25.630919 #3782525] INFO -- : 2044 ......................................................................... I, [2024-05-09T12:59:25.711949 #3782525] INFO -- : 2117 ......................................................................... I, [2024-05-09T12:59:25.779582 #3782525] INFO -- : 2190 ......................................................................... I, [2024-05-09T12:59:25.824536 #3782525] INFO -- : 2263 ......................................................................... I, [2024-05-09T12:59:25.872119 #3782525] INFO -- : 2336 ......................................................................... I, [2024-05-09T12:59:25.966479 #3782525] INFO -- : 2409 ......................................................................... I, [2024-05-09T12:59:26.250730 #3782525] INFO -- : 2482 ......................................................................... I, [2024-05-09T12:59:26.384852 #3782525] INFO -- : 2555 ......................................................................... I, [2024-05-09T12:59:27.687717 #3782525] INFO -- : 2628 ......................................................................... I, [2024-05-09T12:59:27.845292 #3782525] INFO -- : 2701 ......................................................................... I, [2024-05-09T12:59:27.993883 #3782525] INFO -- : 2774 ......................................................................... I, [2024-05-09T12:59:28.306729 #3782525] INFO -- : 2847 ......................................................................... I, [2024-05-09T12:59:28.563580 #3782525] INFO -- : 2920 ......................................................................... I, [2024-05-09T12:59:28.686794 #3782525] INFO -- : 2993 ......................................................................... I, [2024-05-09T12:59:28.752913 #3782525] INFO -- : 3066 ......................................................................... I, [2024-05-09T12:59:28.795208 #3782525] INFO -- : 3139 ......................................................................... I, [2024-05-09T12:59:28.863261 #3782525] INFO -- : 3212 ......................................................................... I, [2024-05-09T12:59:28.935069 #3782525] INFO -- : 3285 ......................................................................... I, [2024-05-09T12:59:32.776208 #3782525] INFO -- : 3358 ........................................................................ I, [2024-05-09T12:59:32.776284 #3782525] INFO -- : I, [2024-05-09T12:59:32.776296 #3782525] INFO -- : Finished in 29.696613 seconds I, [2024-05-09T12:59:32.776306 #3782525] INFO -- : I, [2024-05-09T12:59:32.776315 #3782525] INFO -- : 3429 files, 32607 examples, 192041 expectations, 0 failures, 0 errors, 0 tagged I, [2024-05-09T12:59:32.777967 #3782525] INFO -- : $$$[end] "make yes-test-rubyspec MSPECOPT='--error-output stderr --debug -j' TESTS='-j3'" exit with 0.