# Logfile created on 2024-05-09 09:59:00 +0000 by logger.rb/v1.5.3 I, [2024-05-09T09:59:00.003172 #243109] INFO -- : #, @formatter=nil, @logdev=#, @binmode=false, @mon_data=#, @mon_data_owner_object_id=860>>> I, [2024-05-09T09:59:00.003562 #243109] INFO -- : $$$[beg] make update-unicode -j3 I, [2024-05-09T09:59:00.092345 #243109] INFO -- : Downloading Unicode emoji 15.0 files... I, [2024-05-09T09:59:00.092567 #243109] INFO -- : Downloading Unicode emoji 15.0 files... I, [2024-05-09T09:59:00.092842 #243109] INFO -- : Downloading Unicode emoji 15.0 files... I, [2024-05-09T09:59:00.169467 #243109] INFO -- : made symlink emoji/15.0/emoji-sequences.txt to /home/opc/ruby/src/master/.downloaded-cache/emoji/15.0/emoji-sequences.txt I, [2024-05-09T09:59:00.171576 #243109] INFO -- : downloading emoji/15.0/emoji-test.txt ... /home/opc/ruby/src/master/enc/unicode/data/emoji/15.0/emoji-sequences.txt already exists I, [2024-05-09T09:59:00.175046 #243109] INFO -- : downloading emoji/15.0/emoji-test.txt ... /home/opc/ruby/src/master/enc/unicode/data/emoji/15.0/emoji-sequences.txt already exists E, [2024-05-09T09:59:00.634030 #243109] ERROR -- : /home/opc/ruby/src/master/tool/downloader.rb:302:in `rescue in download': failed to download emoji/15.0/emoji-test.txt (RuntimeError) E, [2024-05-09T09:59:00.634096 #243109] ERROR -- : OpenURI::HTTPError: 403 Forbidden: https://www.unicode.org/Public/emoji/15.0/emoji-test.txt E, [2024-05-09T09:59:00.634106 #243109] ERROR -- : from /home/opc/ruby/src/master/tool/downloader.rb:201:in `download' E, [2024-05-09T09:59:00.634116 #243109] ERROR -- : from /home/opc/ruby/src/master/tool/downloader.rb:136:in `download' E, [2024-05-09T09:59:00.634125 #243109] ERROR -- : from /home/opc/ruby/src/master/tool/downloader.rb:482:in `block in
' E, [2024-05-09T09:59:00.634133 #243109] ERROR -- : from /home/opc/ruby/src/master/tool/downloader.rb:465:in `each' E, [2024-05-09T09:59:00.634141 #243109] ERROR -- : from /home/opc/ruby/src/master/tool/downloader.rb:465:in `
' E, [2024-05-09T09:59:00.634149 #243109] ERROR -- : /usr/local/lib/ruby/3.2.0/open-uri.rb:369:in `open_http': 403 Forbidden (OpenURI::HTTPError) E, [2024-05-09T09:59:00.634158 #243109] ERROR -- : from /usr/local/lib/ruby/3.2.0/open-uri.rb:760:in `buffer_open' E, [2024-05-09T09:59:00.634166 #243109] ERROR -- : from /usr/local/lib/ruby/3.2.0/open-uri.rb:214:in `block in open_loop' E, [2024-05-09T09:59:00.634174 #243109] ERROR -- : from /usr/local/lib/ruby/3.2.0/open-uri.rb:212:in `catch' E, [2024-05-09T09:59:00.634182 #243109] ERROR -- : from /usr/local/lib/ruby/3.2.0/open-uri.rb:212:in `open_loop' E, [2024-05-09T09:59:00.634191 #243109] ERROR -- : from /usr/local/lib/ruby/3.2.0/open-uri.rb:153:in `open_uri' E, [2024-05-09T09:59:00.634199 #243109] ERROR -- : from /usr/local/lib/ruby/3.2.0/open-uri.rb:740:in `open' E, [2024-05-09T09:59:00.634211 #243109] ERROR -- : from /usr/local/lib/ruby/3.2.0/open-uri.rb:748:in `read' E, [2024-05-09T09:59:00.634219 #243109] ERROR -- : from /home/opc/ruby/src/master/tool/downloader.rb:247:in `block in download' E, [2024-05-09T09:59:00.634227 #243109] ERROR -- : from /home/opc/ruby/src/master/tool/downloader.rb:378:in `with_retry' E, [2024-05-09T09:59:00.634235 #243109] ERROR -- : from /home/opc/ruby/src/master/tool/downloader.rb:246:in `download' E, [2024-05-09T09:59:00.634243 #243109] ERROR -- : from /home/opc/ruby/src/master/tool/downloader.rb:136:in `download' E, [2024-05-09T09:59:00.634251 #243109] ERROR -- : from /home/opc/ruby/src/master/tool/downloader.rb:482:in `block in
' E, [2024-05-09T09:59:00.634259 #243109] ERROR -- : from /home/opc/ruby/src/master/tool/downloader.rb:465:in `each' E, [2024-05-09T09:59:00.634267 #243109] ERROR -- : from /home/opc/ruby/src/master/tool/downloader.rb:465:in `
' E, [2024-05-09T09:59:00.637013 #243109] ERROR -- : make: *** [uncommon.mk:1765: /home/opc/ruby/src/master/enc/unicode/data/emoji/15.0/emoji-sequences.txt] Error 1 E, [2024-05-09T09:59:00.637089 #243109] ERROR -- : make: *** Deleting file '/home/opc/ruby/src/master/enc/unicode/data/emoji/15.0/emoji-sequences.txt' E, [2024-05-09T09:59:00.637102 #243109] ERROR -- : make: *** Waiting for unfinished jobs.... E, [2024-05-09T09:59:00.660584 #243109] ERROR -- : /home/opc/ruby/src/master/tool/downloader.rb:302:in `rescue in download': failed to download emoji/15.0/emoji-test.txt (RuntimeError) E, [2024-05-09T09:59:00.660664 #243109] ERROR -- : OpenURI::HTTPError: 403 Forbidden: https://www.unicode.org/Public/emoji/15.0/emoji-test.txt E, [2024-05-09T09:59:00.660676 #243109] ERROR -- : from /home/opc/ruby/src/master/tool/downloader.rb:201:in `download' E, [2024-05-09T09:59:00.660686 #243109] ERROR -- : from /home/opc/ruby/src/master/tool/downloader.rb:136:in `download' E, [2024-05-09T09:59:00.660694 #243109] ERROR -- : from /home/opc/ruby/src/master/tool/downloader.rb:482:in `block in
' E, [2024-05-09T09:59:00.660703 #243109] ERROR -- : from /home/opc/ruby/src/master/tool/downloader.rb:465:in `each' E, [2024-05-09T09:59:00.660712 #243109] ERROR -- : from /home/opc/ruby/src/master/tool/downloader.rb:465:in `
' E, [2024-05-09T09:59:00.660736 #243109] ERROR -- : /usr/local/lib/ruby/3.2.0/open-uri.rb:369:in `open_http': 403 Forbidden (OpenURI::HTTPError) E, [2024-05-09T09:59:00.660747 #243109] ERROR -- : from /usr/local/lib/ruby/3.2.0/open-uri.rb:760:in `buffer_open' E, [2024-05-09T09:59:00.660755 #243109] ERROR -- : from /usr/local/lib/ruby/3.2.0/open-uri.rb:214:in `block in open_loop' E, [2024-05-09T09:59:00.660764 #243109] ERROR -- : from /usr/local/lib/ruby/3.2.0/open-uri.rb:212:in `catch' E, [2024-05-09T09:59:00.660772 #243109] ERROR -- : from /usr/local/lib/ruby/3.2.0/open-uri.rb:212:in `open_loop' E, [2024-05-09T09:59:00.660780 #243109] ERROR -- : from /usr/local/lib/ruby/3.2.0/open-uri.rb:153:in `open_uri' E, [2024-05-09T09:59:00.660789 #243109] ERROR -- : from /usr/local/lib/ruby/3.2.0/open-uri.rb:740:in `open' E, [2024-05-09T09:59:00.660797 #243109] ERROR -- : from /usr/local/lib/ruby/3.2.0/open-uri.rb:748:in `read' E, [2024-05-09T09:59:00.660805 #243109] ERROR -- : from /home/opc/ruby/src/master/tool/downloader.rb:247:in `block in download' E, [2024-05-09T09:59:00.660813 #243109] ERROR -- : from /home/opc/ruby/src/master/tool/downloader.rb:378:in `with_retry' E, [2024-05-09T09:59:00.660822 #243109] ERROR -- : from /home/opc/ruby/src/master/tool/downloader.rb:246:in `download' E, [2024-05-09T09:59:00.660830 #243109] ERROR -- : from /home/opc/ruby/src/master/tool/downloader.rb:136:in `download' E, [2024-05-09T09:59:00.660838 #243109] ERROR -- : from /home/opc/ruby/src/master/tool/downloader.rb:482:in `block in
' E, [2024-05-09T09:59:00.660846 #243109] ERROR -- : from /home/opc/ruby/src/master/tool/downloader.rb:465:in `each' E, [2024-05-09T09:59:00.660854 #243109] ERROR -- : from /home/opc/ruby/src/master/tool/downloader.rb:465:in `
' E, [2024-05-09T09:59:00.663727 #243109] ERROR -- : make: *** [uncommon.mk:1765: /home/opc/ruby/src/master/enc/unicode/data/emoji/15.0/emoji-zwj-sequences.txt] Error 1 E, [2024-05-09T09:59:00.682083 #243109] ERROR -- : /home/opc/ruby/src/master/tool/downloader.rb:302:in `rescue in download': failed to download emoji/15.0/emoji-test.txt (RuntimeError) E, [2024-05-09T09:59:00.682124 #243109] ERROR -- : OpenURI::HTTPError: 403 Forbidden: https://www.unicode.org/Public/emoji/15.0/emoji-test.txt E, [2024-05-09T09:59:00.682134 #243109] ERROR -- : from /home/opc/ruby/src/master/tool/downloader.rb:201:in `download' E, [2024-05-09T09:59:00.682144 #243109] ERROR -- : from /home/opc/ruby/src/master/tool/downloader.rb:136:in `download' E, [2024-05-09T09:59:00.682152 #243109] ERROR -- : from /home/opc/ruby/src/master/tool/downloader.rb:482:in `block in
' E, [2024-05-09T09:59:00.682160 #243109] ERROR -- : from /home/opc/ruby/src/master/tool/downloader.rb:465:in `each' E, [2024-05-09T09:59:00.682168 #243109] ERROR -- : from /home/opc/ruby/src/master/tool/downloader.rb:465:in `
' E, [2024-05-09T09:59:00.682176 #243109] ERROR -- : /usr/local/lib/ruby/3.2.0/open-uri.rb:369:in `open_http': 403 Forbidden (OpenURI::HTTPError) E, [2024-05-09T09:59:00.682185 #243109] ERROR -- : from /usr/local/lib/ruby/3.2.0/open-uri.rb:760:in `buffer_open' E, [2024-05-09T09:59:00.682193 #243109] ERROR -- : from /usr/local/lib/ruby/3.2.0/open-uri.rb:214:in `block in open_loop' E, [2024-05-09T09:59:00.682201 #243109] ERROR -- : from /usr/local/lib/ruby/3.2.0/open-uri.rb:212:in `catch' E, [2024-05-09T09:59:00.682209 #243109] ERROR -- : from /usr/local/lib/ruby/3.2.0/open-uri.rb:212:in `open_loop' E, [2024-05-09T09:59:00.682217 #243109] ERROR -- : from /usr/local/lib/ruby/3.2.0/open-uri.rb:153:in `open_uri' E, [2024-05-09T09:59:00.682225 #243109] ERROR -- : from /usr/local/lib/ruby/3.2.0/open-uri.rb:740:in `open' E, [2024-05-09T09:59:00.682233 #243109] ERROR -- : from /usr/local/lib/ruby/3.2.0/open-uri.rb:748:in `read' E, [2024-05-09T09:59:00.682242 #243109] ERROR -- : from /home/opc/ruby/src/master/tool/downloader.rb:247:in `block in download' E, [2024-05-09T09:59:00.682250 #243109] ERROR -- : from /home/opc/ruby/src/master/tool/downloader.rb:378:in `with_retry' E, [2024-05-09T09:59:00.682258 #243109] ERROR -- : from /home/opc/ruby/src/master/tool/downloader.rb:246:in `download' E, [2024-05-09T09:59:00.682266 #243109] ERROR -- : from /home/opc/ruby/src/master/tool/downloader.rb:136:in `download' E, [2024-05-09T09:59:00.682275 #243109] ERROR -- : from /home/opc/ruby/src/master/tool/downloader.rb:482:in `block in
' E, [2024-05-09T09:59:00.682283 #243109] ERROR -- : from /home/opc/ruby/src/master/tool/downloader.rb:465:in `each' E, [2024-05-09T09:59:00.682291 #243109] ERROR -- : from /home/opc/ruby/src/master/tool/downloader.rb:465:in `
' E, [2024-05-09T09:59:00.685044 #243109] ERROR -- : make: *** [uncommon.mk:1765: /home/opc/ruby/src/master/enc/unicode/data/emoji/15.0/emoji-test.txt] Error 1 I, [2024-05-09T09:59:00.685141 #243109] INFO -- : downloading emoji/15.0/emoji-test.txt ... I, [2024-05-09T09:59:00.685270 #243109] INFO -- : $$$[end] "make update-unicode -j3" exit with 512. I, [2024-05-09T09:59:00.685304 #243109] INFO -- : $$$[beg] make update-download -j3 I, [2024-05-09T09:59:00.850213 #243109] INFO -- : tool/config.guess already exists I, [2024-05-09T09:59:00.850278 #243109] INFO -- : tool/config.sub already exists I, [2024-05-09T09:59:00.853215 #243109] INFO -- : Update minitest to ea9caafc0754b1d6236a490d59e624b53209734a I, [2024-05-09T09:59:00.853294 #243109] INFO -- : Update power_assert to 84e85124c5014a139af39161d484156cfe87a9ed I, [2024-05-09T09:59:00.853538 #243109] INFO -- : Update rbs to ba7872795d5de04adb8ff500c0e6afdc81a041dd I, [2024-05-09T09:59:00.856593 #243109] INFO -- : echo 84e85124c5014a139af39161d484156cfe87a9ed | /bin/sh /home/opc/ruby/src/master/tool/ifchange /home/opc/ruby/src/master/.bundle/.timestamp/power_assert.revision - I, [2024-05-09T09:59:00.857058 #243109] INFO -- : echo ea9caafc0754b1d6236a490d59e624b53209734a | /bin/sh /home/opc/ruby/src/master/tool/ifchange /home/opc/ruby/src/master/.bundle/.timestamp/minitest.revision - I, [2024-05-09T09:59:00.857246 #243109] INFO -- : echo ba7872795d5de04adb8ff500c0e6afdc81a041dd | /bin/sh /home/opc/ruby/src/master/tool/ifchange /home/opc/ruby/src/master/.bundle/.timestamp/rbs.revision - I, [2024-05-09T09:59:00.865306 #243109] INFO -- : /home/opc/ruby/src/master/.bundle/.timestamp/power_assert.revision unchanged I, [2024-05-09T09:59:00.865597 #243109] INFO -- : /home/opc/ruby/src/master/.bundle/.timestamp/minitest.revision unchanged I, [2024-05-09T09:59:00.866115 #243109] INFO -- : /home/opc/ruby/src/master/.bundle/.timestamp/rbs.revision unchanged I, [2024-05-09T09:59:00.868115 #243109] INFO -- : Update typeprof to b19a6416da3a05d57fadd6ffdadb382b6d236ca5 I, [2024-05-09T09:59:00.879243 #243109] INFO -- : echo b19a6416da3a05d57fadd6ffdadb382b6d236ca5 | /bin/sh /home/opc/ruby/src/master/tool/ifchange /home/opc/ruby/src/master/.bundle/.timestamp/typeprof.revision - I, [2024-05-09T09:59:00.886139 #243109] INFO -- : /home/opc/ruby/src/master/.bundle/.timestamp/typeprof.revision unchanged I, [2024-05-09T09:59:00.958529 #243109] INFO -- : Building power_assert@84e85124c5014a139af39161d484156cfe87a9ed to /home/opc/ruby/src/master/gems/power_assert-2.0.3.gem I, [2024-05-09T09:59:01.069185 #243109] INFO -- : Successfully built RubyGem I, [2024-05-09T09:59:01.069243 #243109] INFO -- : Name: power_assert I, [2024-05-09T09:59:01.069254 #243109] INFO -- : Version: 2.0.4dev I, [2024-05-09T09:59:01.069263 #243109] INFO -- : File: power_assert-2.0.4dev.gem I, [2024-05-09T09:59:01.149192 #243109] INFO -- : $$$[end] "make update-download -j3" exit with 0. I, [2024-05-09T09:59:01.149263 #243109] INFO -- : $$$[beg] make update-rubyspec -j3 I, [2024-05-09T09:59:01.237238 #243109] INFO -- : make: Nothing to be done for 'update-rubyspec'. I, [2024-05-09T09:59:01.237395 #243109] INFO -- : $$$[end] "make update-rubyspec -j3" exit with 0. I, [2024-05-09T09:59:01.237443 #243109] INFO -- : $$$[beg] make update-src -j3 I, [2024-05-09T09:59:02.280237 #243109] INFO -- : Already up to date. I, [2024-05-09T09:59:02.294912 #243109] INFO -- : Latest commit hash = 8b3280bebd I, [2024-05-09T09:59:02.295587 #243109] INFO -- : $$$[end] "make update-src -j3" exit with 0. I, [2024-05-09T09:59:02.295630 #243109] INFO -- : $$$[beg] make after-update -j3 I, [2024-05-09T09:59:02.398119 #243109] INFO -- : generating /home/opc/ruby/src/master/ext/ripper/eventids2table.c I, [2024-05-09T09:59:02.404884 #243109] INFO -- : make[1]: Entering directory '/home/opc/ruby/src/master/ext/ripper' I, [2024-05-09T09:59:02.404938 #243109] INFO -- : make[1]: Nothing to be done for 'src'. I, [2024-05-09T09:59:02.404949 #243109] INFO -- : make[1]: Leaving directory '/home/opc/ruby/src/master/ext/ripper' I, [2024-05-09T09:59:02.433659 #243109] INFO -- : /home/opc/ruby/src/master/revision.h updated I, [2024-05-09T09:59:02.434812 #243109] INFO -- : generating aarch64-linux-fake.rb I, [2024-05-09T09:59:02.492061 #243109] INFO -- : aarch64-linux-fake.rb updated I, [2024-05-09T09:59:02.493456 #243109] INFO -- : generating enc.mk I, [2024-05-09T09:59:02.735466 #243109] INFO -- : making srcs under enc I, [2024-05-09T09:59:02.777537 #243109] INFO -- : make[1]: Entering directory '/home/opc/ruby/build/master' I, [2024-05-09T09:59:02.777618 #243109] INFO -- : make[1]: Nothing to be done for 'srcs'. I, [2024-05-09T09:59:02.777628 #243109] INFO -- : make[1]: Leaving directory '/home/opc/ruby/build/master' I, [2024-05-09T09:59:02.857192 #243109] INFO -- : Update minitest to ea9caafc0754b1d6236a490d59e624b53209734a I, [2024-05-09T09:59:02.857283 #243109] INFO -- : Update power_assert to 84e85124c5014a139af39161d484156cfe87a9ed I, [2024-05-09T09:59:02.857540 #243109] INFO -- : Update rbs to ba7872795d5de04adb8ff500c0e6afdc81a041dd I, [2024-05-09T09:59:02.860891 #243109] INFO -- : echo ea9caafc0754b1d6236a490d59e624b53209734a | /bin/sh /home/opc/ruby/src/master/tool/ifchange /home/opc/ruby/src/master/.bundle/.timestamp/minitest.revision - I, [2024-05-09T09:59:02.861178 #243109] INFO -- : echo 84e85124c5014a139af39161d484156cfe87a9ed | /bin/sh /home/opc/ruby/src/master/tool/ifchange /home/opc/ruby/src/master/.bundle/.timestamp/power_assert.revision - I, [2024-05-09T09:59:02.861372 #243109] INFO -- : echo ba7872795d5de04adb8ff500c0e6afdc81a041dd | /bin/sh /home/opc/ruby/src/master/tool/ifchange /home/opc/ruby/src/master/.bundle/.timestamp/rbs.revision - I, [2024-05-09T09:59:02.867119 #243109] INFO -- : /home/opc/ruby/src/master/.bundle/.timestamp/minitest.revision unchanged I, [2024-05-09T09:59:02.867227 #243109] INFO -- : /home/opc/ruby/src/master/.bundle/.timestamp/rbs.revision unchanged I, [2024-05-09T09:59:02.869336 #243109] INFO -- : /home/opc/ruby/src/master/.bundle/.timestamp/power_assert.revision unchanged I, [2024-05-09T09:59:02.870476 #243109] INFO -- : Update typeprof to b19a6416da3a05d57fadd6ffdadb382b6d236ca5 I, [2024-05-09T09:59:02.873265 #243109] INFO -- : echo b19a6416da3a05d57fadd6ffdadb382b6d236ca5 | /bin/sh /home/opc/ruby/src/master/tool/ifchange /home/opc/ruby/src/master/.bundle/.timestamp/typeprof.revision - I, [2024-05-09T09:59:02.888059 #243109] INFO -- : /home/opc/ruby/src/master/.bundle/.timestamp/typeprof.revision unchanged I, [2024-05-09T09:59:02.959307 #243109] INFO -- : Building power_assert@84e85124c5014a139af39161d484156cfe87a9ed to /home/opc/ruby/src/master/gems/power_assert-2.0.3.gem I, [2024-05-09T09:59:03.070385 #243109] INFO -- : Successfully built RubyGem I, [2024-05-09T09:59:03.070443 #243109] INFO -- : Name: power_assert I, [2024-05-09T09:59:03.070454 #243109] INFO -- : Version: 2.0.4dev I, [2024-05-09T09:59:03.070464 #243109] INFO -- : File: power_assert-2.0.4dev.gem I, [2024-05-09T09:59:03.072790 #243109] INFO -- : Extracting bundle gem power_assert-2.0.3... I, [2024-05-09T09:59:03.169545 #243109] INFO -- : Try with hash version of bundled gems instead of gems/power_assert-2.0.3.gem. We don't use this gem with release version of Ruby. I, [2024-05-09T09:59:03.180504 #243109] INFO -- : Unpacked gems/power_assert-2.0.4dev.gem I, [2024-05-09T09:59:03.182511 #243109] INFO -- : $$$[end] "make after-update -j3" exit with 0. I, [2024-05-09T09:59:03.182666 #243109] INFO -- : $$$[beg] make miniruby -j3 I, [2024-05-09T09:59:03.272191 #243109] INFO -- : BASERUBY = /usr/local/bin/ruby --disable=gems I, [2024-05-09T09:59:03.272254 #243109] INFO -- : CC = gcc I, [2024-05-09T09:59:03.272265 #243109] INFO -- : LD = ld I, [2024-05-09T09:59:03.272276 #243109] INFO -- : LDSHARED = gcc -shared I, [2024-05-09T09:59:03.272285 #243109] INFO -- : CFLAGS = -O3 -fno-fast-math -ggdb3 -Wall -Wextra -Wdeprecated-declarations -Wdiv-by-zero -Wduplicated-cond -Wimplicit-function-declaration -Wimplicit-int -Wpointer-arith -Wwrite-strings -Wold-style-definition -Wimplicit-fallthrough=0 -Wmissing-noreturn -Wno-cast-function-type -Wno-constant-logical-operand -Wno-long-long -Wno-missing-field-initializers -Wno-overlength-strings -Wno-packed-bitfield-compat -Wno-parentheses-equality -Wno-self-assign -Wno-tautological-compare -Wno-unused-parameter -Wno-unused-value -Wsuggest-attribute=format -Wsuggest-attribute=noreturn -Wunused-variable -Wmisleading-indentation -Wundef I, [2024-05-09T09:59:03.272295 #243109] INFO -- : XCFLAGS = -U_FORTIFY_SOURCE -D_FORTIFY_SOURCE=2 -fstack-protector-strong -msign-return-address=all -fno-strict-overflow -fvisibility=hidden -fexcess-precision=standard -DRUBY_EXPORT -fPIE -I. -I.ext/include/aarch64-linux -I/home/opc/ruby/src/master/include -I/home/opc/ruby/src/master -I/home/opc/ruby/src/master/prism -I/home/opc/ruby/src/master/enc/unicode/15.0.0 I, [2024-05-09T09:59:03.272303 #243109] INFO -- : CPPFLAGS = I, [2024-05-09T09:59:03.272311 #243109] INFO -- : DLDFLAGS = -Wl,--compress-debug-sections=zlib -fstack-protector-strong -pie I, [2024-05-09T09:59:03.272320 #243109] INFO -- : SOLIBS = -lz -lrt -lrt -ldl -lcrypt -lm -lpthread I, [2024-05-09T09:59:03.272328 #243109] INFO -- : LANG = en_US.UTF-8 I, [2024-05-09T09:59:03.272359 #243109] INFO -- : LC_ALL = I, [2024-05-09T09:59:03.272367 #243109] INFO -- : LC_CTYPE = I, [2024-05-09T09:59:03.272375 #243109] INFO -- : MFLAGS = -j3 --jobserver-auth=4,5 I, [2024-05-09T09:59:03.272383 #243109] INFO -- : RUSTC = rustc I, [2024-05-09T09:59:03.272390 #243109] INFO -- : YJIT_RUSTC_ARGS = --crate-name=yjit --crate-type=staticlib --edition=2021 -g -C lto=thin -C opt-level=3 -C overflow-checks=on '--out-dir=/home/opc/ruby/build/master/yjit/target/release/' /home/opc/ruby/src/master/yjit/src/lib.rs I, [2024-05-09T09:59:03.273148 #243109] INFO -- : gcc (GCC) 8.5.0 20210514 (Red Hat 8.5.0-10.1.0.1) I, [2024-05-09T09:59:03.273185 #243109] INFO -- : Copyright (C) 2018 Free Software Foundation, Inc. I, [2024-05-09T09:59:03.273196 #243109] INFO -- : This is free software; see the source for copying conditions. There is NO I, [2024-05-09T09:59:03.273205 #243109] INFO -- : warranty; not even for MERCHANTABILITY or FITNESS FOR A PARTICULAR PURPOSE. I, [2024-05-09T09:59:03.273213 #243109] INFO -- : I, [2024-05-09T09:59:03.298168 #243109] INFO -- : compiling /home/opc/ruby/src/master/version.c I, [2024-05-09T09:59:03.440956 #243109] INFO -- : linking miniruby I, [2024-05-09T09:59:04.340603 #243109] INFO -- : $$$[end] "make miniruby -j3" exit with 0. I, [2024-05-09T09:59:04.340776 #243109] INFO -- : $$$[beg] make ruby -j3 I, [2024-05-09T09:59:04.430883 #243109] INFO -- : BASERUBY = /usr/local/bin/ruby --disable=gems I, [2024-05-09T09:59:04.430953 #243109] INFO -- : CC = gcc I, [2024-05-09T09:59:04.430964 #243109] INFO -- : LD = ld I, [2024-05-09T09:59:04.430972 #243109] INFO -- : LDSHARED = gcc -shared I, [2024-05-09T09:59:04.430984 #243109] INFO -- : CFLAGS = -O3 -fno-fast-math -ggdb3 -Wall -Wextra -Wdeprecated-declarations -Wdiv-by-zero -Wduplicated-cond -Wimplicit-function-declaration -Wimplicit-int -Wpointer-arith -Wwrite-strings -Wold-style-definition -Wimplicit-fallthrough=0 -Wmissing-noreturn -Wno-cast-function-type -Wno-constant-logical-operand -Wno-long-long -Wno-missing-field-initializers -Wno-overlength-strings -Wno-packed-bitfield-compat -Wno-parentheses-equality -Wno-self-assign -Wno-tautological-compare -Wno-unused-parameter -Wno-unused-value -Wsuggest-attribute=format -Wsuggest-attribute=noreturn -Wunused-variable -Wmisleading-indentation -Wundef I, [2024-05-09T09:59:04.430993 #243109] INFO -- : XCFLAGS = -U_FORTIFY_SOURCE -D_FORTIFY_SOURCE=2 -fstack-protector-strong -msign-return-address=all -fno-strict-overflow -fvisibility=hidden -fexcess-precision=standard -DRUBY_EXPORT -fPIE -I. -I.ext/include/aarch64-linux -I/home/opc/ruby/src/master/include -I/home/opc/ruby/src/master -I/home/opc/ruby/src/master/prism -I/home/opc/ruby/src/master/enc/unicode/15.0.0 I, [2024-05-09T09:59:04.431001 #243109] INFO -- : CPPFLAGS = I, [2024-05-09T09:59:04.431032 #243109] INFO -- : DLDFLAGS = -Wl,--compress-debug-sections=zlib -fstack-protector-strong -pie I, [2024-05-09T09:59:04.431045 #243109] INFO -- : SOLIBS = -lz -lrt -lrt -ldl -lcrypt -lm -lpthread I, [2024-05-09T09:59:04.431053 #243109] INFO -- : LANG = en_US.UTF-8 I, [2024-05-09T09:59:04.431061 #243109] INFO -- : LC_ALL = I, [2024-05-09T09:59:04.431069 #243109] INFO -- : LC_CTYPE = I, [2024-05-09T09:59:04.431077 #243109] INFO -- : MFLAGS = -j3 --jobserver-auth=4,5 I, [2024-05-09T09:59:04.431085 #243109] INFO -- : RUSTC = rustc I, [2024-05-09T09:59:04.431093 #243109] INFO -- : YJIT_RUSTC_ARGS = --crate-name=yjit --crate-type=staticlib --edition=2021 -g -C lto=thin -C opt-level=3 -C overflow-checks=on '--out-dir=/home/opc/ruby/build/master/yjit/target/release/' /home/opc/ruby/src/master/yjit/src/lib.rs I, [2024-05-09T09:59:04.431840 #243109] INFO -- : gcc (GCC) 8.5.0 20210514 (Red Hat 8.5.0-10.1.0.1) I, [2024-05-09T09:59:04.431875 #243109] INFO -- : Copyright (C) 2018 Free Software Foundation, Inc. I, [2024-05-09T09:59:04.431886 #243109] INFO -- : This is free software; see the source for copying conditions. There is NO I, [2024-05-09T09:59:04.431898 #243109] INFO -- : warranty; not even for MERCHANTABILITY or FITNESS FOR A PARTICULAR PURPOSE. I, [2024-05-09T09:59:04.431907 #243109] INFO -- : I, [2024-05-09T09:59:04.612661 #243109] INFO -- : builtin_binary.inc updated I, [2024-05-09T09:59:04.616386 #243109] INFO -- : c5234a9416e4f20f175185e840b25b0f08674d14078ed7083f37e655458e3ca9 builtin_binary.inc I, [2024-05-09T09:59:04.617324 #243109] INFO -- : compiling /home/opc/ruby/src/master/builtin.c I, [2024-05-09T09:59:04.943677 #243109] INFO -- : linking static-library libruby-static.a I, [2024-05-09T09:59:07.878979 #243109] INFO -- : linking ruby I, [2024-05-09T09:59:08.821270 #243109] INFO -- : $$$[end] "make ruby -j3" exit with 0. I, [2024-05-09T09:59:08.821441 #243109] INFO -- : $$$[beg] make all -j3 I, [2024-05-09T09:59:08.909996 #243109] INFO -- : BASERUBY = /usr/local/bin/ruby --disable=gems I, [2024-05-09T09:59:08.910067 #243109] INFO -- : CC = gcc I, [2024-05-09T09:59:08.910078 #243109] INFO -- : LD = ld I, [2024-05-09T09:59:08.910088 #243109] INFO -- : LDSHARED = gcc -shared I, [2024-05-09T09:59:08.910100 #243109] INFO -- : CFLAGS = -O3 -fno-fast-math -ggdb3 -Wall -Wextra -Wdeprecated-declarations -Wdiv-by-zero -Wduplicated-cond -Wimplicit-function-declaration -Wimplicit-int -Wpointer-arith -Wwrite-strings -Wold-style-definition -Wimplicit-fallthrough=0 -Wmissing-noreturn -Wno-cast-function-type -Wno-constant-logical-operand -Wno-long-long -Wno-missing-field-initializers -Wno-overlength-strings -Wno-packed-bitfield-compat -Wno-parentheses-equality -Wno-self-assign -Wno-tautological-compare -Wno-unused-parameter -Wno-unused-value -Wsuggest-attribute=format -Wsuggest-attribute=noreturn -Wunused-variable -Wmisleading-indentation -Wundef I, [2024-05-09T09:59:08.910109 #243109] INFO -- : XCFLAGS = -U_FORTIFY_SOURCE -D_FORTIFY_SOURCE=2 -fstack-protector-strong -msign-return-address=all -fno-strict-overflow -fvisibility=hidden -fexcess-precision=standard -DRUBY_EXPORT -fPIE -I. -I.ext/include/aarch64-linux -I/home/opc/ruby/src/master/include -I/home/opc/ruby/src/master -I/home/opc/ruby/src/master/prism -I/home/opc/ruby/src/master/enc/unicode/15.0.0 I, [2024-05-09T09:59:08.910118 #243109] INFO -- : CPPFLAGS = I, [2024-05-09T09:59:08.910126 #243109] INFO -- : DLDFLAGS = -Wl,--compress-debug-sections=zlib -fstack-protector-strong -pie I, [2024-05-09T09:59:08.910134 #243109] INFO -- : SOLIBS = -lz -lrt -lrt -ldl -lcrypt -lm -lpthread I, [2024-05-09T09:59:08.910143 #243109] INFO -- : LANG = en_US.UTF-8 I, [2024-05-09T09:59:08.910151 #243109] INFO -- : LC_ALL = I, [2024-05-09T09:59:08.910159 #243109] INFO -- : LC_CTYPE = I, [2024-05-09T09:59:08.910167 #243109] INFO -- : MFLAGS = -j3 --jobserver-auth=4,5 I, [2024-05-09T09:59:08.910175 #243109] INFO -- : RUSTC = rustc I, [2024-05-09T09:59:08.910183 #243109] INFO -- : YJIT_RUSTC_ARGS = --crate-name=yjit --crate-type=staticlib --edition=2021 -g -C lto=thin -C opt-level=3 -C overflow-checks=on '--out-dir=/home/opc/ruby/build/master/yjit/target/release/' /home/opc/ruby/src/master/yjit/src/lib.rs I, [2024-05-09T09:59:08.910862 #243109] INFO -- : gcc (GCC) 8.5.0 20210514 (Red Hat 8.5.0-10.1.0.1) I, [2024-05-09T09:59:08.910879 #243109] INFO -- : Copyright (C) 2018 Free Software Foundation, Inc. I, [2024-05-09T09:59:08.910889 #243109] INFO -- : This is free software; see the source for copying conditions. There is NO I, [2024-05-09T09:59:08.910897 #243109] INFO -- : warranty; not even for MERCHANTABILITY or FITNESS FOR A PARTICULAR PURPOSE. I, [2024-05-09T09:59:08.910932 #243109] INFO -- : I, [2024-05-09T09:59:08.945579 #243109] INFO -- : generating encdb.h I, [2024-05-09T09:59:08.947064 #243109] INFO -- : generating enc.mk I, [2024-05-09T09:59:08.985382 #243109] INFO -- : encdb.h unchanged I, [2024-05-09T09:59:09.182569 #243109] INFO -- : making srcs under enc I, [2024-05-09T09:59:09.183172 #243109] INFO -- : making enc I, [2024-05-09T09:59:09.210149 #243109] INFO -- : make[1]: Entering directory '/home/opc/ruby/build/master' I, [2024-05-09T09:59:09.210224 #243109] INFO -- : make[1]: Nothing to be done for 'enc'. I, [2024-05-09T09:59:09.210238 #243109] INFO -- : make[1]: Leaving directory '/home/opc/ruby/build/master' I, [2024-05-09T09:59:09.224668 #243109] INFO -- : make[1]: Entering directory '/home/opc/ruby/build/master' I, [2024-05-09T09:59:09.224731 #243109] INFO -- : make[1]: Nothing to be done for 'srcs'. I, [2024-05-09T09:59:09.224741 #243109] INFO -- : make[1]: Leaving directory '/home/opc/ruby/build/master' I, [2024-05-09T09:59:09.225523 #243109] INFO -- : generating transdb.h I, [2024-05-09T09:59:09.370425 #243109] INFO -- : transdb.h unchanged I, [2024-05-09T09:59:09.371749 #243109] INFO -- : generating makefiles ext/configure-ext.mk I, [2024-05-09T09:59:09.371864 #243109] INFO -- : making trans I, [2024-05-09T09:59:09.410766 #243109] INFO -- : ext/configure-ext.mk updated I, [2024-05-09T09:59:09.413796 #243109] INFO -- : make[1]: Entering directory '/home/opc/ruby/build/master' I, [2024-05-09T09:59:09.421104 #243109] INFO -- : make[1]: Entering directory '/home/opc/ruby/build/master' I, [2024-05-09T09:59:09.421153 #243109] INFO -- : make[1]: Nothing to be done for 'trans'. I, [2024-05-09T09:59:09.421167 #243109] INFO -- : make[1]: Leaving directory '/home/opc/ruby/build/master' I, [2024-05-09T09:59:10.120385 #243109] INFO -- : making encs I, [2024-05-09T09:59:10.163747 #243109] INFO -- : make[1]: Leaving directory '/home/opc/ruby/build/master' I, [2024-05-09T09:59:10.164416 #243109] INFO -- : generating makefile exts.mk I, [2024-05-09T09:59:10.176934 #243109] INFO -- : make[1]: Entering directory '/home/opc/ruby/build/master' I, [2024-05-09T09:59:10.177003 #243109] INFO -- : make[1]: Nothing to be done for 'encs'. I, [2024-05-09T09:59:10.177014 #243109] INFO -- : make[1]: Leaving directory '/home/opc/ruby/build/master' I, [2024-05-09T09:59:10.223860 #243109] INFO -- : exts.mk unchanged I, [2024-05-09T09:59:10.228745 #243109] INFO -- : make[1]: Entering directory '/home/opc/ruby/build/master' I, [2024-05-09T09:59:10.335213 #243109] INFO -- : make[2]: Entering directory '/home/opc/ruby/build/master/ext/coverage' I, [2024-05-09T09:59:10.335395 #243109] INFO -- : make[2]: Entering directory '/home/opc/ruby/build/master/ext/digest' I, [2024-05-09T09:59:10.337667 #243109] INFO -- : make[2]: Entering directory '/home/opc/ruby/build/master/ext/date' I, [2024-05-09T09:59:10.342413 #243109] INFO -- : make[2]: Leaving directory '/home/opc/ruby/build/master/ext/coverage' I, [2024-05-09T09:59:10.342999 #243109] INFO -- : make[2]: Leaving directory '/home/opc/ruby/build/master/ext/date' I, [2024-05-09T09:59:10.344007 #243109] INFO -- : make[2]: Leaving directory '/home/opc/ruby/build/master/ext/digest' I, [2024-05-09T09:59:10.351791 #243109] INFO -- : make[2]: Entering directory '/home/opc/ruby/build/master/ext/io/console' I, [2024-05-09T09:59:10.352303 #243109] INFO -- : make[2]: Entering directory '/home/opc/ruby/build/master/ext/fiddle' I, [2024-05-09T09:59:10.357184 #243109] INFO -- : make[2]: Leaving directory '/home/opc/ruby/build/master/ext/io/console' I, [2024-05-09T09:59:10.359209 #243109] INFO -- : make[2]: Entering directory '/home/opc/ruby/build/master/ext/json' I, [2024-05-09T09:59:10.360844 #243109] INFO -- : make[2]: Leaving directory '/home/opc/ruby/build/master/ext/fiddle' I, [2024-05-09T09:59:10.363760 #243109] INFO -- : make[2]: Entering directory '/home/opc/ruby/build/master/ext/monitor' I, [2024-05-09T09:59:10.366866 #243109] INFO -- : make[2]: Entering directory '/home/opc/ruby/build/master/ext/objspace' I, [2024-05-09T09:59:10.368012 #243109] INFO -- : make[2]: Leaving directory '/home/opc/ruby/build/master/ext/monitor' I, [2024-05-09T09:59:10.368692 #243109] INFO -- : make[2]: Leaving directory '/home/opc/ruby/build/master/ext/json' I, [2024-05-09T09:59:10.372740 #243109] INFO -- : make[2]: Entering directory '/home/opc/ruby/build/master/ext/pathname' I, [2024-05-09T09:59:10.376536 #243109] INFO -- : make[2]: Leaving directory '/home/opc/ruby/build/master/ext/pathname' I, [2024-05-09T09:59:10.379517 #243109] INFO -- : make[2]: Leaving directory '/home/opc/ruby/build/master/ext/objspace' I, [2024-05-09T09:59:10.383214 #243109] INFO -- : make[2]: Entering directory '/home/opc/ruby/build/master/ext/psych' I, [2024-05-09T09:59:10.384018 #243109] INFO -- : make[2]: Entering directory '/home/opc/ruby/build/master/ext/pty' I, [2024-05-09T09:59:10.386871 #243109] INFO -- : make[2]: Entering directory '/home/opc/ruby/build/master/ext/openssl' I, [2024-05-09T09:59:10.389592 #243109] INFO -- : make[2]: Leaving directory '/home/opc/ruby/build/master/ext/pty' I, [2024-05-09T09:59:10.399348 #243109] INFO -- : make[2]: Leaving directory '/home/opc/ruby/build/master/ext/psych' I, [2024-05-09T09:59:10.401224 #243109] INFO -- : make[2]: Entering directory '/home/opc/ruby/build/master/ext/rubyvm' I, [2024-05-09T09:59:10.404662 #243109] INFO -- : make[2]: Leaving directory '/home/opc/ruby/build/master/ext/rubyvm' I, [2024-05-09T09:59:10.406137 #243109] INFO -- : make[2]: Entering directory '/home/opc/ruby/build/master/ext/ripper' I, [2024-05-09T09:59:10.411197 #243109] INFO -- : make[2]: Leaving directory '/home/opc/ruby/build/master/ext/openssl' I, [2024-05-09T09:59:10.414181 #243109] INFO -- : make[2]: Leaving directory '/home/opc/ruby/build/master/ext/ripper' I, [2024-05-09T09:59:10.417008 #243109] INFO -- : make[2]: Entering directory '/home/opc/ruby/build/master/ext/socket' I, [2024-05-09T09:59:10.420866 #243109] INFO -- : make[2]: Entering directory '/home/opc/ruby/build/master/.bundle/gems/bigdecimal-3.1.7/ext/bigdecimal' I, [2024-05-09T09:59:10.426218 #243109] INFO -- : make[2]: Entering directory '/home/opc/ruby/build/master/.bundle/gems/bigdecimal-3.1.8/ext/bigdecimal' I, [2024-05-09T09:59:10.428377 #243109] INFO -- : make[2]: Leaving directory '/home/opc/ruby/build/master/ext/socket' I, [2024-05-09T09:59:10.430767 #243109] INFO -- : make[2]: Entering directory '/home/opc/ruby/build/master/.bundle/gems/debug-1.9.2/ext/debug' I, [2024-05-09T09:59:10.451334 #243109] INFO -- : make[2]: Leaving directory '/home/opc/ruby/build/master/.bundle/gems/bigdecimal-3.1.7/ext/bigdecimal' I, [2024-05-09T09:59:10.453822 #243109] INFO -- : make[2]: Entering directory '/home/opc/ruby/build/master/.bundle/gems/nkf-0.2.0/ext/nkf' I, [2024-05-09T09:59:10.459072 #243109] INFO -- : make[2]: Leaving directory '/home/opc/ruby/build/master/.bundle/gems/bigdecimal-3.1.8/ext/bigdecimal' I, [2024-05-09T09:59:10.461664 #243109] INFO -- : make[2]: Entering directory '/home/opc/ruby/build/master/.bundle/gems/racc-1.7.3/ext/racc/cparse' I, [2024-05-09T09:59:10.461938 #243109] INFO -- : make[2]: Leaving directory '/home/opc/ruby/build/master/.bundle/gems/debug-1.9.2/ext/debug' I, [2024-05-09T09:59:10.469128 #243109] INFO -- : make[2]: Entering directory '/home/opc/ruby/build/master/.bundle/gems/rbs-3.4.4/ext/rbs_extension' I, [2024-05-09T09:59:10.486236 #243109] INFO -- : make[2]: Leaving directory '/home/opc/ruby/build/master/.bundle/gems/nkf-0.2.0/ext/nkf' I, [2024-05-09T09:59:10.488972 #243109] INFO -- : make[2]: Entering directory '/home/opc/ruby/build/master/.bundle/gems/syslog-0.1.2/ext/syslog' I, [2024-05-09T09:59:10.492159 #243109] INFO -- : make[2]: Leaving directory '/home/opc/ruby/build/master/.bundle/gems/racc-1.7.3/ext/racc/cparse' I, [2024-05-09T09:59:10.501551 #243109] INFO -- : make[2]: Leaving directory '/home/opc/ruby/build/master/.bundle/gems/rbs-3.4.4/ext/rbs_extension' I, [2024-05-09T09:59:10.511393 #243109] INFO -- : make[2]: Entering directory '/home/opc/ruby/build/master/ext/digest/sha2' I, [2024-05-09T09:59:10.519675 #243109] INFO -- : make[2]: Leaving directory '/home/opc/ruby/build/master/ext/digest/sha2' I, [2024-05-09T09:59:10.521495 #243109] INFO -- : make[2]: Leaving directory '/home/opc/ruby/build/master/.bundle/gems/syslog-0.1.2/ext/syslog' I, [2024-05-09T09:59:10.560224 #243109] INFO -- : make[2]: Entering directory '/home/opc/ruby/build/master' I, [2024-05-09T09:59:10.643617 #243109] INFO -- : make[2]: 'ruby' is up to date. I, [2024-05-09T09:59:10.643710 #243109] INFO -- : make[2]: Leaving directory '/home/opc/ruby/build/master' I, [2024-05-09T09:59:10.643882 #243109] INFO -- : make[1]: Leaving directory '/home/opc/ruby/build/master' I, [2024-05-09T09:59:10.648261 #243109] INFO -- : make[1]: Entering directory '/home/opc/ruby/build/master' I, [2024-05-09T09:59:10.648299 #243109] INFO -- : make[1]: Nothing to be done for 'note'. I, [2024-05-09T09:59:10.648309 #243109] INFO -- : make[1]: Leaving directory '/home/opc/ruby/build/master' I, [2024-05-09T09:59:10.648592 #243109] INFO -- : $$$[end] "make all -j3" exit with 0. I, [2024-05-09T09:59:10.648744 #243109] INFO -- : $$$[beg] make install -j3 I, [2024-05-09T09:59:10.743457 #243109] INFO -- : Update minitest to ea9caafc0754b1d6236a490d59e624b53209734a I, [2024-05-09T09:59:10.743679 #243109] INFO -- : Update power_assert to 84e85124c5014a139af39161d484156cfe87a9ed I, [2024-05-09T09:59:10.744050 #243109] INFO -- : Update rbs to ba7872795d5de04adb8ff500c0e6afdc81a041dd I, [2024-05-09T09:59:10.746814 #243109] INFO -- : echo 84e85124c5014a139af39161d484156cfe87a9ed | /bin/sh /home/opc/ruby/src/master/tool/ifchange /home/opc/ruby/src/master/.bundle/.timestamp/power_assert.revision - I, [2024-05-09T09:59:10.746974 #243109] INFO -- : echo ea9caafc0754b1d6236a490d59e624b53209734a | /bin/sh /home/opc/ruby/src/master/tool/ifchange /home/opc/ruby/src/master/.bundle/.timestamp/minitest.revision - I, [2024-05-09T09:59:10.747765 #243109] INFO -- : echo ba7872795d5de04adb8ff500c0e6afdc81a041dd | /bin/sh /home/opc/ruby/src/master/tool/ifchange /home/opc/ruby/src/master/.bundle/.timestamp/rbs.revision - I, [2024-05-09T09:59:10.752524 #243109] INFO -- : /home/opc/ruby/src/master/.bundle/.timestamp/power_assert.revision unchanged I, [2024-05-09T09:59:10.753577 #243109] INFO -- : /home/opc/ruby/src/master/.bundle/.timestamp/rbs.revision unchanged I, [2024-05-09T09:59:10.753847 #243109] INFO -- : /home/opc/ruby/src/master/.bundle/.timestamp/minitest.revision unchanged I, [2024-05-09T09:59:10.755166 #243109] INFO -- : Update typeprof to b19a6416da3a05d57fadd6ffdadb382b6d236ca5 I, [2024-05-09T09:59:10.757913 #243109] INFO -- : BASERUBY = /usr/local/bin/ruby --disable=gems I, [2024-05-09T09:59:10.757957 #243109] INFO -- : CC = gcc I, [2024-05-09T09:59:10.757968 #243109] INFO -- : LD = ld I, [2024-05-09T09:59:10.757976 #243109] INFO -- : LDSHARED = gcc -shared I, [2024-05-09T09:59:10.757986 #243109] INFO -- : CFLAGS = -O3 -fno-fast-math -ggdb3 -Wall -Wextra -Wdeprecated-declarations -Wdiv-by-zero -Wduplicated-cond -Wimplicit-function-declaration -Wimplicit-int -Wpointer-arith -Wwrite-strings -Wold-style-definition -Wimplicit-fallthrough=0 -Wmissing-noreturn -Wno-cast-function-type -Wno-constant-logical-operand -Wno-long-long -Wno-missing-field-initializers -Wno-overlength-strings -Wno-packed-bitfield-compat -Wno-parentheses-equality -Wno-self-assign -Wno-tautological-compare -Wno-unused-parameter -Wno-unused-value -Wsuggest-attribute=format -Wsuggest-attribute=noreturn -Wunused-variable -Wmisleading-indentation -Wundef I, [2024-05-09T09:59:10.757995 #243109] INFO -- : XCFLAGS = -U_FORTIFY_SOURCE -D_FORTIFY_SOURCE=2 -fstack-protector-strong -msign-return-address=all -fno-strict-overflow -fvisibility=hidden -fexcess-precision=standard -DRUBY_EXPORT -fPIE -I. -I.ext/include/aarch64-linux -I/home/opc/ruby/src/master/include -I/home/opc/ruby/src/master -I/home/opc/ruby/src/master/prism -I/home/opc/ruby/src/master/enc/unicode/15.0.0 I, [2024-05-09T09:59:10.758003 #243109] INFO -- : CPPFLAGS = I, [2024-05-09T09:59:10.758013 #243109] INFO -- : DLDFLAGS = -Wl,--compress-debug-sections=zlib -fstack-protector-strong -pie I, [2024-05-09T09:59:10.758022 #243109] INFO -- : SOLIBS = -lz -lrt -lrt -ldl -lcrypt -lm -lpthread I, [2024-05-09T09:59:10.758029 #243109] INFO -- : LANG = en_US.UTF-8 I, [2024-05-09T09:59:10.758037 #243109] INFO -- : LC_ALL = I, [2024-05-09T09:59:10.758045 #243109] INFO -- : LC_CTYPE = I, [2024-05-09T09:59:10.758052 #243109] INFO -- : MFLAGS = -j3 --jobserver-auth=4,5 I, [2024-05-09T09:59:10.758060 #243109] INFO -- : RUSTC = rustc I, [2024-05-09T09:59:10.758071 #243109] INFO -- : YJIT_RUSTC_ARGS = --crate-name=yjit --crate-type=staticlib --edition=2021 -g -C lto=thin -C opt-level=3 -C overflow-checks=on '--out-dir=/home/opc/ruby/build/master/yjit/target/release/' /home/opc/ruby/src/master/yjit/src/lib.rs I, [2024-05-09T09:59:10.788883 #243109] INFO -- : echo b19a6416da3a05d57fadd6ffdadb382b6d236ca5 | /bin/sh /home/opc/ruby/src/master/tool/ifchange /home/opc/ruby/src/master/.bundle/.timestamp/typeprof.revision - I, [2024-05-09T09:59:10.789977 #243109] INFO -- : gcc (GCC) 8.5.0 20210514 (Red Hat 8.5.0-10.1.0.1) I, [2024-05-09T09:59:10.790019 #243109] INFO -- : Copyright (C) 2018 Free Software Foundation, Inc. I, [2024-05-09T09:59:10.790029 #243109] INFO -- : This is free software; see the source for copying conditions. There is NO I, [2024-05-09T09:59:10.790040 #243109] INFO -- : warranty; not even for MERCHANTABILITY or FITNESS FOR A PARTICULAR PURPOSE. I, [2024-05-09T09:59:10.790048 #243109] INFO -- : I, [2024-05-09T09:59:10.790607 #243109] INFO -- : generating encdb.h I, [2024-05-09T09:59:10.792343 #243109] INFO -- : generating enc.mk I, [2024-05-09T09:59:10.804801 #243109] INFO -- : /home/opc/ruby/src/master/.bundle/.timestamp/typeprof.revision unchanged I, [2024-05-09T09:59:10.828925 #243109] INFO -- : encdb.h unchanged I, [2024-05-09T09:59:10.922477 #243109] INFO -- : Building power_assert@84e85124c5014a139af39161d484156cfe87a9ed to /home/opc/ruby/src/master/gems/power_assert-2.0.3.gem I, [2024-05-09T09:59:11.031856 #243109] INFO -- : making srcs under enc I, [2024-05-09T09:59:11.032365 #243109] INFO -- : making enc I, [2024-05-09T09:59:11.040053 #243109] INFO -- : Successfully built RubyGem I, [2024-05-09T09:59:11.040089 #243109] INFO -- : Name: power_assert I, [2024-05-09T09:59:11.040100 #243109] INFO -- : Version: 2.0.4dev I, [2024-05-09T09:59:11.040108 #243109] INFO -- : File: power_assert-2.0.4dev.gem I, [2024-05-09T09:59:11.042562 #243109] INFO -- : Extracting bundle gem power_assert-2.0.3... I, [2024-05-09T09:59:11.059990 #243109] INFO -- : make[1]: Entering directory '/home/opc/ruby/build/master' I, [2024-05-09T09:59:11.060048 #243109] INFO -- : make[1]: Nothing to be done for 'enc'. I, [2024-05-09T09:59:11.060059 #243109] INFO -- : make[1]: Leaving directory '/home/opc/ruby/build/master' I, [2024-05-09T09:59:11.075130 #243109] INFO -- : make[1]: Entering directory '/home/opc/ruby/build/master' I, [2024-05-09T09:59:11.075193 #243109] INFO -- : make[1]: Nothing to be done for 'srcs'. I, [2024-05-09T09:59:11.075204 #243109] INFO -- : make[1]: Leaving directory '/home/opc/ruby/build/master' I, [2024-05-09T09:59:11.076117 #243109] INFO -- : generating transdb.h I, [2024-05-09T09:59:11.140156 #243109] INFO -- : Try with hash version of bundled gems instead of gems/power_assert-2.0.3.gem. We don't use this gem with release version of Ruby. I, [2024-05-09T09:59:11.150545 #243109] INFO -- : Unpacked gems/power_assert-2.0.4dev.gem I, [2024-05-09T09:59:11.221299 #243109] INFO -- : transdb.h unchanged I, [2024-05-09T09:59:11.222652 #243109] INFO -- : generating makefiles ext/configure-ext.mk I, [2024-05-09T09:59:11.222845 #243109] INFO -- : making trans I, [2024-05-09T09:59:11.262114 #243109] INFO -- : ext/configure-ext.mk unchanged I, [2024-05-09T09:59:11.265291 #243109] INFO -- : make[1]: Entering directory '/home/opc/ruby/build/master' I, [2024-05-09T09:59:11.271361 #243109] INFO -- : make[1]: Entering directory '/home/opc/ruby/build/master' I, [2024-05-09T09:59:11.271422 #243109] INFO -- : make[1]: Nothing to be done for 'trans'. I, [2024-05-09T09:59:11.271433 #243109] INFO -- : make[1]: Leaving directory '/home/opc/ruby/build/master' I, [2024-05-09T09:59:11.869646 #243109] INFO -- : making encs I, [2024-05-09T09:59:11.929617 #243109] INFO -- : make[1]: Entering directory '/home/opc/ruby/build/master' I, [2024-05-09T09:59:11.929686 #243109] INFO -- : make[1]: Nothing to be done for 'encs'. I, [2024-05-09T09:59:11.929696 #243109] INFO -- : make[1]: Leaving directory '/home/opc/ruby/build/master' I, [2024-05-09T09:59:12.028895 #243109] INFO -- : make[1]: Leaving directory '/home/opc/ruby/build/master' I, [2024-05-09T09:59:12.029629 #243109] INFO -- : generating makefile exts.mk I, [2024-05-09T09:59:12.088221 #243109] INFO -- : exts.mk unchanged I, [2024-05-09T09:59:12.093166 #243109] INFO -- : make[1]: Entering directory '/home/opc/ruby/build/master' I, [2024-05-09T09:59:12.196366 #243109] INFO -- : make[2]: Entering directory '/home/opc/ruby/build/master/ext/coverage' I, [2024-05-09T09:59:12.198086 #243109] INFO -- : make[2]: Entering directory '/home/opc/ruby/build/master/ext/digest' I, [2024-05-09T09:59:12.199265 #243109] INFO -- : make[2]: Entering directory '/home/opc/ruby/build/master/ext/date' I, [2024-05-09T09:59:12.203608 #243109] INFO -- : make[2]: Leaving directory '/home/opc/ruby/build/master/ext/coverage' I, [2024-05-09T09:59:12.204680 #243109] INFO -- : make[2]: Leaving directory '/home/opc/ruby/build/master/ext/date' I, [2024-05-09T09:59:12.210419 #243109] INFO -- : make[2]: Leaving directory '/home/opc/ruby/build/master/ext/digest' I, [2024-05-09T09:59:12.215225 #243109] INFO -- : make[2]: Entering directory '/home/opc/ruby/build/master/ext/io/console' I, [2024-05-09T09:59:12.217535 #243109] INFO -- : make[2]: Entering directory '/home/opc/ruby/build/master/ext/fiddle' I, [2024-05-09T09:59:12.219536 #243109] INFO -- : make[2]: Leaving directory '/home/opc/ruby/build/master/ext/io/console' I, [2024-05-09T09:59:12.221540 #243109] INFO -- : make[2]: Entering directory '/home/opc/ruby/build/master/ext/json' I, [2024-05-09T09:59:12.224913 #243109] INFO -- : make[2]: Entering directory '/home/opc/ruby/build/master/ext/monitor' I, [2024-05-09T09:59:12.228010 #243109] INFO -- : make[2]: Leaving directory '/home/opc/ruby/build/master/ext/fiddle' I, [2024-05-09T09:59:12.229484 #243109] INFO -- : make[2]: Leaving directory '/home/opc/ruby/build/master/ext/monitor' I, [2024-05-09T09:59:12.231032 #243109] INFO -- : make[2]: Leaving directory '/home/opc/ruby/build/master/ext/json' I, [2024-05-09T09:59:12.234495 #243109] INFO -- : make[2]: Entering directory '/home/opc/ruby/build/master/ext/objspace' I, [2024-05-09T09:59:12.234996 #243109] INFO -- : make[2]: Entering directory '/home/opc/ruby/build/master/ext/pathname' I, [2024-05-09T09:59:12.239717 #243109] INFO -- : make[2]: Leaving directory '/home/opc/ruby/build/master/ext/pathname' I, [2024-05-09T09:59:12.243533 #243109] INFO -- : make[2]: Leaving directory '/home/opc/ruby/build/master/ext/objspace' I, [2024-05-09T09:59:12.247681 #243109] INFO -- : make[2]: Entering directory '/home/opc/ruby/build/master/ext/pty' I, [2024-05-09T09:59:12.248360 #243109] INFO -- : make[2]: Entering directory '/home/opc/ruby/build/master/ext/openssl' I, [2024-05-09T09:59:12.248763 #243109] INFO -- : make[2]: Entering directory '/home/opc/ruby/build/master/ext/psych' I, [2024-05-09T09:59:12.255123 #243109] INFO -- : make[2]: Leaving directory '/home/opc/ruby/build/master/ext/pty' I, [2024-05-09T09:59:12.266593 #243109] INFO -- : make[2]: Leaving directory '/home/opc/ruby/build/master/ext/psych' I, [2024-05-09T09:59:12.268177 #243109] INFO -- : make[2]: Leaving directory '/home/opc/ruby/build/master/ext/openssl' I, [2024-05-09T09:59:12.269760 #243109] INFO -- : make[2]: Entering directory '/home/opc/ruby/build/master/ext/rubyvm' I, [2024-05-09T09:59:12.272744 #243109] INFO -- : make[2]: Entering directory '/home/opc/ruby/build/master/ext/ripper' I, [2024-05-09T09:59:12.273300 #243109] INFO -- : make[2]: Leaving directory '/home/opc/ruby/build/master/ext/rubyvm' I, [2024-05-09T09:59:12.280439 #243109] INFO -- : make[2]: Leaving directory '/home/opc/ruby/build/master/ext/ripper' I, [2024-05-09T09:59:12.280655 #243109] INFO -- : make[2]: Entering directory '/home/opc/ruby/build/master/ext/socket' I, [2024-05-09T09:59:12.285343 #243109] INFO -- : make[2]: Entering directory '/home/opc/ruby/build/master/.bundle/gems/bigdecimal-3.1.7/ext/bigdecimal' I, [2024-05-09T09:59:12.288828 #243109] INFO -- : make[2]: Entering directory '/home/opc/ruby/build/master/.bundle/gems/bigdecimal-3.1.8/ext/bigdecimal' I, [2024-05-09T09:59:12.296295 #243109] INFO -- : make[2]: Leaving directory '/home/opc/ruby/build/master/ext/socket' I, [2024-05-09T09:59:12.298977 #243109] INFO -- : make[2]: Entering directory '/home/opc/ruby/build/master/.bundle/gems/debug-1.9.2/ext/debug' I, [2024-05-09T09:59:12.316948 #243109] INFO -- : make[2]: Leaving directory '/home/opc/ruby/build/master/.bundle/gems/bigdecimal-3.1.7/ext/bigdecimal' I, [2024-05-09T09:59:12.319374 #243109] INFO -- : make[2]: Entering directory '/home/opc/ruby/build/master/.bundle/gems/nkf-0.2.0/ext/nkf' I, [2024-05-09T09:59:12.322904 #243109] INFO -- : make[2]: Leaving directory '/home/opc/ruby/build/master/.bundle/gems/bigdecimal-3.1.8/ext/bigdecimal' I, [2024-05-09T09:59:12.325431 #243109] INFO -- : make[2]: Entering directory '/home/opc/ruby/build/master/.bundle/gems/racc-1.7.3/ext/racc/cparse' I, [2024-05-09T09:59:12.329895 #243109] INFO -- : make[2]: Leaving directory '/home/opc/ruby/build/master/.bundle/gems/debug-1.9.2/ext/debug' I, [2024-05-09T09:59:12.332761 #243109] INFO -- : make[2]: Entering directory '/home/opc/ruby/build/master/.bundle/gems/rbs-3.4.4/ext/rbs_extension' I, [2024-05-09T09:59:12.350849 #243109] INFO -- : make[2]: Leaving directory '/home/opc/ruby/build/master/.bundle/gems/nkf-0.2.0/ext/nkf' I, [2024-05-09T09:59:12.353672 #243109] INFO -- : make[2]: Entering directory '/home/opc/ruby/build/master/.bundle/gems/syslog-0.1.2/ext/syslog' I, [2024-05-09T09:59:12.358698 #243109] INFO -- : make[2]: Leaving directory '/home/opc/ruby/build/master/.bundle/gems/racc-1.7.3/ext/racc/cparse' I, [2024-05-09T09:59:12.364604 #243109] INFO -- : make[2]: Leaving directory '/home/opc/ruby/build/master/.bundle/gems/rbs-3.4.4/ext/rbs_extension' I, [2024-05-09T09:59:12.378755 #243109] INFO -- : make[2]: Entering directory '/home/opc/ruby/build/master/ext/digest/sha2' I, [2024-05-09T09:59:12.385411 #243109] INFO -- : make[2]: Leaving directory '/home/opc/ruby/build/master/.bundle/gems/syslog-0.1.2/ext/syslog' I, [2024-05-09T09:59:12.385873 #243109] INFO -- : make[2]: Leaving directory '/home/opc/ruby/build/master/ext/digest/sha2' I, [2024-05-09T09:59:12.423519 #243109] INFO -- : make[2]: Entering directory '/home/opc/ruby/build/master' I, [2024-05-09T09:59:12.508058 #243109] INFO -- : make[2]: 'ruby' is up to date. I, [2024-05-09T09:59:12.508156 #243109] INFO -- : make[2]: Leaving directory '/home/opc/ruby/build/master' I, [2024-05-09T09:59:12.508282 #243109] INFO -- : make[1]: Leaving directory '/home/opc/ruby/build/master' I, [2024-05-09T09:59:12.512703 #243109] INFO -- : make[1]: Entering directory '/home/opc/ruby/build/master' I, [2024-05-09T09:59:12.512759 #243109] INFO -- : make[1]: Nothing to be done for 'note'. I, [2024-05-09T09:59:12.512770 #243109] INFO -- : make[1]: Leaving directory '/home/opc/ruby/build/master' I, [2024-05-09T09:59:12.512931 #243109] INFO -- : ./miniruby -I/home/opc/ruby/src/master/lib -I. -I.ext/common /home/opc/ruby/src/master/tool/runruby.rb --extout=.ext -- --disable-gems -r./aarch64-linux-fake /home/opc/ruby/src/master/tool/rbinstall.rb --make="make" --dest-dir="" --extout=".ext" --ext-build-dir="./ext" --mflags="-j3 --jobserver-auth=4,5" --make-flags=" -j3 --jobserver-auth=4,5" --data-mode=0644 --prog-mode=0755 --installed-list .installed.list --mantype="doc" --gnumake --install=all --exclude=doc I, [2024-05-09T09:59:12.663524 #243109] INFO -- : Installing to I, [2024-05-09T09:59:12.663589 #243109] INFO -- : installing binary commands: /home/opc/ruby/install/master/bin I, [2024-05-09T09:59:12.852096 #243109] INFO -- : installing base libraries: /home/opc/ruby/install/master/lib I, [2024-05-09T09:59:12.852635 #243109] INFO -- : installing arch files: /home/opc/ruby/install/master/lib/ruby/3.4.0+0/aarch64-linux I, [2024-05-09T09:59:12.852748 #243109] INFO -- : installing pkgconfig data: /home/opc/ruby/install/master/lib/pkgconfig I, [2024-05-09T09:59:12.852931 #243109] INFO -- : installing extension objects: /home/opc/ruby/install/master/lib/ruby/3.4.0+0/aarch64-linux I, [2024-05-09T09:59:12.865609 #243109] INFO -- : installing extension objects: /home/opc/ruby/install/master/lib/ruby/site_ruby/3.4.0+0/aarch64-linux I, [2024-05-09T09:59:12.865649 #243109] INFO -- : installing extension objects: /home/opc/ruby/install/master/lib/ruby/vendor_ruby/3.4.0+0/aarch64-linux I, [2024-05-09T09:59:12.865748 #243109] INFO -- : installing extension headers: /home/opc/ruby/install/master/include/ruby-3.4.0+0/aarch64-linux I, [2024-05-09T09:59:12.866041 #243109] INFO -- : installing extension scripts: /home/opc/ruby/install/master/lib/ruby/3.4.0+0 I, [2024-05-09T09:59:12.874733 #243109] INFO -- : installing extension scripts: /home/opc/ruby/install/master/lib/ruby/site_ruby/3.4.0+0 I, [2024-05-09T09:59:12.874762 #243109] INFO -- : installing extension scripts: /home/opc/ruby/install/master/lib/ruby/vendor_ruby/3.4.0+0 I, [2024-05-09T09:59:12.874772 #243109] INFO -- : installing extension headers: /home/opc/ruby/install/master/include/ruby-3.4.0+0/ruby I, [2024-05-09T09:59:12.874900 #243109] INFO -- : installing command scripts: /home/opc/ruby/install/master/bin I, [2024-05-09T09:59:12.875443 #243109] INFO -- : installing library scripts: /home/opc/ruby/install/master/lib/ruby/3.4.0+0 I, [2024-05-09T09:59:12.966285 #243109] INFO -- : installing common headers: /home/opc/ruby/install/master/include/ruby-3.4.0+0 I, [2024-05-09T09:59:12.981138 #243109] INFO -- : installing manpages: /home/opc/ruby/install/master/share/man/man1 I, [2024-05-09T09:59:12.981532 #243109] INFO -- : installing default gems from lib: /home/opc/ruby/install/master/lib/ruby/gems/3.4.0+0 I, [2024-05-09T09:59:13.022198 #243109] INFO -- : benchmark 0.3.0 I, [2024-05-09T09:59:13.035838 #243109] INFO -- : bundler 2.6.0.dev I, [2024-05-09T09:59:13.040780 #243109] INFO -- : cgi 0.4.1 I, [2024-05-09T09:59:13.041975 #243109] INFO -- : delegate 0.3.1 I, [2024-05-09T09:59:13.043062 #243109] INFO -- : did_you_mean 1.6.3 I, [2024-05-09T09:59:13.044356 #243109] INFO -- : english 0.8.0 I, [2024-05-09T09:59:13.045507 #243109] INFO -- : erb 4.0.4 I, [2024-05-09T09:59:13.047851 #243109] INFO -- : error_highlight 0.6.0 I, [2024-05-09T09:59:13.048959 #243109] INFO -- : fileutils 1.7.2 I, [2024-05-09T09:59:13.050083 #243109] INFO -- : find 0.2.0 I, [2024-05-09T09:59:13.051148 #243109] INFO -- : forwardable 1.3.3 I, [2024-05-09T09:59:13.052213 #243109] INFO -- : ipaddr 1.2.6 I, [2024-05-09T09:59:13.053343 #243109] INFO -- : irb 1.13.1 I, [2024-05-09T09:59:13.055813 #243109] INFO -- : logger 1.6.0 I, [2024-05-09T09:59:13.058423 #243109] INFO -- : net-http 0.4.1 I, [2024-05-09T09:59:13.059947 #243109] INFO -- : net-protocol 0.2.2 I, [2024-05-09T09:59:13.061133 #243109] INFO -- : open-uri 0.4.1 I, [2024-05-09T09:59:13.062281 #243109] INFO -- : open3 0.2.1 I, [2024-05-09T09:59:13.063358 #243109] INFO -- : optparse 0.5.0 I, [2024-05-09T09:59:13.064470 #243109] INFO -- : ostruct 0.6.0 I, [2024-05-09T09:59:13.065606 #243109] INFO -- : pp 0.5.0 I, [2024-05-09T09:59:13.066721 #243109] INFO -- : prettyprint 0.2.0 I, [2024-05-09T09:59:13.067805 #243109] INFO -- : prism 0.28.0 I, [2024-05-09T09:59:13.068994 #243109] INFO -- : pstore 0.1.3 I, [2024-05-09T09:59:13.070335 #243109] INFO -- : rdoc 6.6.3.1 I, [2024-05-09T09:59:13.074093 #243109] INFO -- : readline 0.0.4 I, [2024-05-09T09:59:13.075220 #243109] INFO -- : reline 0.5.6 I, [2024-05-09T09:59:13.076407 #243109] INFO -- : resolv 0.4.0 I, [2024-05-09T09:59:13.077633 #243109] INFO -- : ruby2_keywords 0.0.5 I, [2024-05-09T09:59:13.078743 #243109] INFO -- : securerandom 0.3.1 I, [2024-05-09T09:59:13.079860 #243109] INFO -- : set 1.1.0 I, [2024-05-09T09:59:13.081045 #243109] INFO -- : shellwords 0.2.0 I, [2024-05-09T09:59:13.082207 #243109] INFO -- : singleton 0.2.0 I, [2024-05-09T09:59:13.084832 #243109] INFO -- : syntax_suggest 2.0.0 I, [2024-05-09T09:59:13.087736 #243109] INFO -- : tempfile 0.2.1 I, [2024-05-09T09:59:13.088906 #243109] INFO -- : time 0.3.0 I, [2024-05-09T09:59:13.090109 #243109] INFO -- : timeout 0.4.1 I, [2024-05-09T09:59:13.091232 #243109] INFO -- : tmpdir 0.2.0 I, [2024-05-09T09:59:13.092376 #243109] INFO -- : tsort 0.2.0 I, [2024-05-09T09:59:13.093580 #243109] INFO -- : un 0.3.0 I, [2024-05-09T09:59:13.094689 #243109] INFO -- : uri 0.13.0 I, [2024-05-09T09:59:13.095866 #243109] INFO -- : weakref 0.1.3 I, [2024-05-09T09:59:13.097088 #243109] INFO -- : yaml 0.3.0 I, [2024-05-09T09:59:13.098278 #243109] INFO -- : installing default gems from ext: /home/opc/ruby/install/master/lib/ruby/gems/3.4.0+0 I, [2024-05-09T09:59:13.109503 #243109] INFO -- : date 3.3.4 I, [2024-05-09T09:59:13.110656 #243109] INFO -- : digest 3.1.1 I, [2024-05-09T09:59:13.111743 #243109] INFO -- : etc 1.4.3 I, [2024-05-09T09:59:13.112906 #243109] INFO -- : fcntl 1.1.0 I, [2024-05-09T09:59:13.114053 #243109] INFO -- : fiddle 1.1.3 I, [2024-05-09T09:59:13.115175 #243109] INFO -- : io-console 0.7.2 I, [2024-05-09T09:59:13.116288 #243109] INFO -- : io-nonblock 0.3.0 I, [2024-05-09T09:59:13.117721 #243109] INFO -- : io-wait 0.3.1 I, [2024-05-09T09:59:13.118802 #243109] INFO -- : json 2.7.2 I, [2024-05-09T09:59:13.120019 #243109] INFO -- : openssl 3.2.0 I, [2024-05-09T09:59:13.121685 #243109] INFO -- : pathname 0.3.0 I, [2024-05-09T09:59:13.122800 #243109] INFO -- : psych 5.1.2 I, [2024-05-09T09:59:13.124041 #243109] INFO -- : stringio 3.1.1 I, [2024-05-09T09:59:13.125271 #243109] INFO -- : strscan 3.1.1 I, [2024-05-09T09:59:13.126560 #243109] INFO -- : zlib 3.1.0 I, [2024-05-09T09:59:13.127470 #243109] INFO -- : installing bundled gems: /home/opc/ruby/install/master/lib/ruby/gems/3.4.0+0 I, [2024-05-09T09:59:13.128103 #243109] INFO -- : minitest 5.22.3 I, [2024-05-09T09:59:13.142030 #243109] INFO -- : rake 13.2.1 I, [2024-05-09T09:59:13.154949 #243109] INFO -- : test-unit 3.6.2 I, [2024-05-09T09:59:13.170906 #243109] INFO -- : rexml 3.2.6 I, [2024-05-09T09:59:13.184364 #243109] INFO -- : rss 0.3.0 I, [2024-05-09T09:59:13.194011 #243109] INFO -- : net-ftp 0.3.4 I, [2024-05-09T09:59:13.197596 #243109] INFO -- : net-imap 0.4.11 I, [2024-05-09T09:59:13.215001 #243109] INFO -- : net-pop 0.1.2 I, [2024-05-09T09:59:13.217937 #243109] INFO -- : net-smtp 0.5.0 I, [2024-05-09T09:59:13.221117 #243109] INFO -- : matrix 0.4.2 I, [2024-05-09T09:59:13.227060 #243109] INFO -- : prime 0.1.2 I, [2024-05-09T09:59:13.237624 #243109] INFO -- : rbs 3.4.4 I, [2024-05-09T09:59:13.336785 #243109] INFO -- : typeprof 0.21.11 I, [2024-05-09T09:59:13.363905 #243109] INFO -- : debug 1.9.2 I, [2024-05-09T09:59:13.374485 #243109] INFO -- : racc 1.7.3 I, [2024-05-09T09:59:13.384393 #243109] INFO -- : mutex_m 0.2.0 I, [2024-05-09T09:59:13.388636 #243109] INFO -- : getoptlong 0.2.1 I, [2024-05-09T09:59:13.393475 #243109] INFO -- : base64 0.2.0 I, [2024-05-09T09:59:13.396343 #243109] INFO -- : bigdecimal 3.1.8 I, [2024-05-09T09:59:13.402248 #243109] INFO -- : observer 0.1.2 I, [2024-05-09T09:59:13.405329 #243109] INFO -- : abbrev 0.1.2 I, [2024-05-09T09:59:13.408451 #243109] INFO -- : resolv-replace 0.1.1 I, [2024-05-09T09:59:13.411497 #243109] INFO -- : rinda 0.2.0 I, [2024-05-09T09:59:13.415218 #243109] INFO -- : drb 2.2.1 I, [2024-05-09T09:59:13.419716 #243109] INFO -- : nkf 0.2.0 I, [2024-05-09T09:59:13.427463 #243109] INFO -- : syslog 0.1.2 I, [2024-05-09T09:59:13.431966 #243109] INFO -- : csv 3.3.0 I, [2024-05-09T09:59:13.441282 #243109] INFO -- : installing bundled gem cache: /home/opc/ruby/install/master/lib/ruby/gems/3.4.0+0/cache I, [2024-05-09T09:59:13.443199 #243109] INFO -- : skipped bundled gems: I, [2024-05-09T09:59:13.443228 #243109] INFO -- : power_assert-2.0.4dev.gem not found in bundled_gems I, [2024-05-09T09:59:13.446169 #243109] INFO -- : $$$[end] "make install -j3" exit with 0. I, [2024-05-09T09:59:13.446318 #243109] INFO -- : $$$[beg] make yes-btest TESTOPTS='-q -j3' I, [2024-05-09T09:59:36.784356 #243109] INFO -- : PASS all 1936 tests E, [2024-05-09T09:59:36.787009 #243109] ERROR -- : I, [2024-05-09T09:59:36.787212 #243109] INFO -- : $$$[end] "make yes-btest TESTOPTS='-q -j3'" exit with 0. I, [2024-05-09T09:59:36.787366 #243109] INFO -- : $$$[beg] make yes-test-basic TESTS='-j3' I, [2024-05-09T09:59:36.878898 #243109] INFO -- : BASERUBY = /usr/local/bin/ruby --disable=gems I, [2024-05-09T09:59:36.878972 #243109] INFO -- : CC = gcc I, [2024-05-09T09:59:36.878983 #243109] INFO -- : LD = ld I, [2024-05-09T09:59:36.878992 #243109] INFO -- : LDSHARED = gcc -shared I, [2024-05-09T09:59:36.880389 #243109] INFO -- : CFLAGS = -O3 -fno-fast-math -ggdb3 -Wall -Wextra -Wdeprecated-declarations -Wdiv-by-zero -Wduplicated-cond -Wimplicit-function-declaration -Wimplicit-int -Wpointer-arith -Wwrite-strings -Wold-style-definition -Wimplicit-fallthrough=0 -Wmissing-noreturn -Wno-cast-function-type -Wno-constant-logical-operand -Wno-long-long -Wno-missing-field-initializers -Wno-overlength-strings -Wno-packed-bitfield-compat -Wno-parentheses-equality -Wno-self-assign -Wno-tautological-compare -Wno-unused-parameter -Wno-unused-value -Wsuggest-attribute=format -Wsuggest-attribute=noreturn -Wunused-variable -Wmisleading-indentation -Wundef I, [2024-05-09T09:59:36.880419 #243109] INFO -- : XCFLAGS = -U_FORTIFY_SOURCE -D_FORTIFY_SOURCE=2 -fstack-protector-strong -msign-return-address=all -fno-strict-overflow -fvisibility=hidden -fexcess-precision=standard -DRUBY_EXPORT -fPIE -I. -I.ext/include/aarch64-linux -I/home/opc/ruby/src/master/include -I/home/opc/ruby/src/master -I/home/opc/ruby/src/master/prism -I/home/opc/ruby/src/master/enc/unicode/15.0.0 I, [2024-05-09T09:59:36.880428 #243109] INFO -- : CPPFLAGS = I, [2024-05-09T09:59:36.880436 #243109] INFO -- : DLDFLAGS = -Wl,--compress-debug-sections=zlib -fstack-protector-strong -pie I, [2024-05-09T09:59:36.880444 #243109] INFO -- : SOLIBS = -lz -lrt -lrt -ldl -lcrypt -lm -lpthread I, [2024-05-09T09:59:36.880452 #243109] INFO -- : LANG = en_US.UTF-8 I, [2024-05-09T09:59:36.880459 #243109] INFO -- : LC_ALL = I, [2024-05-09T09:59:36.880467 #243109] INFO -- : LC_CTYPE = I, [2024-05-09T09:59:36.880474 #243109] INFO -- : MFLAGS = I, [2024-05-09T09:59:36.880482 #243109] INFO -- : RUSTC = rustc I, [2024-05-09T09:59:36.880558 #243109] INFO -- : YJIT_RUSTC_ARGS = --crate-name=yjit --crate-type=staticlib --edition=2021 -g -C lto=thin -C opt-level=3 -C overflow-checks=on '--out-dir=/home/opc/ruby/build/master/yjit/target/release/' /home/opc/ruby/src/master/yjit/src/lib.rs I, [2024-05-09T09:59:36.880569 #243109] INFO -- : gcc (GCC) 8.5.0 20210514 (Red Hat 8.5.0-10.1.0.1) I, [2024-05-09T09:59:36.880577 #243109] INFO -- : Copyright (C) 2018 Free Software Foundation, Inc. I, [2024-05-09T09:59:36.880585 #243109] INFO -- : This is free software; see the source for copying conditions. There is NO I, [2024-05-09T09:59:36.880593 #243109] INFO -- : warranty; not even for MERCHANTABILITY or FITNESS FOR A PARTICULAR PURPOSE. I, [2024-05-09T09:59:36.880600 #243109] INFO -- : I, [2024-05-09T09:59:37.034783 #243109] INFO -- : Checking leaked global symbols...none I, [2024-05-09T09:59:37.087286 #243109] INFO -- : /home/opc/ruby/src/master/basictest/test.rb:assignment ....................................................................................................................................................................................................................................................................................................................................................................................OK 372 I, [2024-05-09T09:59:37.087357 #243109] INFO -- : /home/opc/ruby/src/master/basictest/test.rb:condition ..OK 2 I, [2024-05-09T09:59:37.087387 #243109] INFO -- : /home/opc/ruby/src/master/basictest/test.rb:if/unless ...OK 3 I, [2024-05-09T09:59:37.087439 #243109] INFO -- : /home/opc/ruby/src/master/basictest/test.rb:case .....OK 5 I, [2024-05-09T09:59:37.088005 #243109] INFO -- : /home/opc/ruby/src/master/basictest/test.rb:while/until ........OK 8 I, [2024-05-09T09:59:37.088128 #243109] INFO -- : /home/opc/ruby/src/master/basictest/test.rb:exception ..........OK 10 I, [2024-05-09T09:59:37.088801 #243109] INFO -- : /home/opc/ruby/src/master/basictest/test.rb:array .......................................OK 39 I, [2024-05-09T09:59:37.089119 #243109] INFO -- : /home/opc/ruby/src/master/basictest/test.rb:hash ...........................OK 27 I, [2024-05-09T09:59:37.090845 #243109] INFO -- : /home/opc/ruby/src/master/basictest/test.rb:iterator ...........................................................................................................OK 107 I, [2024-05-09T09:59:37.091614 #243109] INFO -- : /home/opc/ruby/src/master/basictest/test.rb:float ................................................................................OK 80 I, [2024-05-09T09:59:37.095303 #243109] INFO -- : /home/opc/ruby/src/master/basictest/test.rb:bignum ...............................OK 31 I, [2024-05-09T09:59:37.097001 #243109] INFO -- : /home/opc/ruby/src/master/basictest/test.rb:string & char ..............................................................OK 62 I, [2024-05-09T09:59:37.097185 #243109] INFO -- : /home/opc/ruby/src/master/basictest/test.rb:assignment ..........OK 10 I, [2024-05-09T09:59:37.097256 #243109] INFO -- : /home/opc/ruby/src/master/basictest/test.rb:call ......OK 6 I, [2024-05-09T09:59:37.097460 #243109] INFO -- : /home/opc/ruby/src/master/basictest/test.rb:proc .........OK 9 I, [2024-05-09T09:59:37.197845 #243109] INFO -- : /home/opc/ruby/src/master/basictest/test.rb:signal ..OK 2 I, [2024-05-09T09:59:37.199369 #243109] INFO -- : /home/opc/ruby/src/master/basictest/test.rb:eval ...........................OK 27 I, [2024-05-09T09:59:37.331264 #243109] INFO -- : /home/opc/ruby/src/master/basictest/test.rb:system ........OK 8 I, [2024-05-09T09:59:37.331337 #243109] INFO -- : /home/opc/ruby/src/master/basictest/test.rb:const .....OK 5 I, [2024-05-09T09:59:37.331436 #243109] INFO -- : /home/opc/ruby/src/master/basictest/test.rb:clone .....OK 5 I, [2024-05-09T09:59:37.331693 #243109] INFO -- : /home/opc/ruby/src/master/basictest/test.rb:marshal ....OK 4 I, [2024-05-09T09:59:37.331770 #243109] INFO -- : /home/opc/ruby/src/master/basictest/test.rb:pack ....OK 4 I, [2024-05-09T09:59:37.331801 #243109] INFO -- : /home/opc/ruby/src/master/basictest/test.rb:math ..OK 2 I, [2024-05-09T09:59:37.331890 #243109] INFO -- : /home/opc/ruby/src/master/basictest/test.rb:struct ......OK 6 I, [2024-05-09T09:59:37.332056 #243109] INFO -- : /home/opc/ruby/src/master/basictest/test.rb:variable ............OK 12 I, [2024-05-09T09:59:37.332097 #243109] INFO -- : /home/opc/ruby/src/master/basictest/test.rb:trace ...OK 3 I, [2024-05-09T09:59:37.332223 #243109] INFO -- : /home/opc/ruby/src/master/basictest/test.rb:defined? ............OK 12 I, [2024-05-09T09:59:37.332312 #243109] INFO -- : /home/opc/ruby/src/master/basictest/test.rb:alias ......OK 6 I, [2024-05-09T09:59:37.332870 #243109] INFO -- : /home/opc/ruby/src/master/basictest/test.rb:path .......................OK 23 I, [2024-05-09T09:59:37.400601 #243109] INFO -- : /home/opc/ruby/src/master/basictest/test.rb:gc ....OK 4 I, [2024-05-09T09:59:37.402738 #243109] INFO -- : I, [2024-05-09T09:59:37.402769 #243109] INFO -- : test succeeded I, [2024-05-09T09:59:37.403428 #243109] INFO -- : $$$[end] "make yes-test-basic TESTS='-j3'" exit with 0. I, [2024-05-09T09:59:37.403608 #243109] INFO -- : $$$[beg] make yes-test-all TESTOPTS='--stderr-on-failure' TESTS='-j3' I, [2024-05-09T09:59:37.527047 #243109] INFO -- : BASERUBY = /usr/local/bin/ruby --disable=gems I, [2024-05-09T09:59:37.527120 #243109] INFO -- : CC = gcc I, [2024-05-09T09:59:37.527131 #243109] INFO -- : LD = ld I, [2024-05-09T09:59:37.527140 #243109] INFO -- : LDSHARED = gcc -shared I, [2024-05-09T09:59:37.527152 #243109] INFO -- : CFLAGS = -O3 -fno-fast-math -ggdb3 -Wall -Wextra -Wdeprecated-declarations -Wdiv-by-zero -Wduplicated-cond -Wimplicit-function-declaration -Wimplicit-int -Wpointer-arith -Wwrite-strings -Wold-style-definition -Wimplicit-fallthrough=0 -Wmissing-noreturn -Wno-cast-function-type -Wno-constant-logical-operand -Wno-long-long -Wno-missing-field-initializers -Wno-overlength-strings -Wno-packed-bitfield-compat -Wno-parentheses-equality -Wno-self-assign -Wno-tautological-compare -Wno-unused-parameter -Wno-unused-value -Wsuggest-attribute=format -Wsuggest-attribute=noreturn -Wunused-variable -Wmisleading-indentation -Wundef I, [2024-05-09T09:59:37.527162 #243109] INFO -- : XCFLAGS = -U_FORTIFY_SOURCE -D_FORTIFY_SOURCE=2 -fstack-protector-strong -msign-return-address=all -fno-strict-overflow -fvisibility=hidden -fexcess-precision=standard -DRUBY_EXPORT -fPIE -I. -I.ext/include/aarch64-linux -I/home/opc/ruby/src/master/include -I/home/opc/ruby/src/master -I/home/opc/ruby/src/master/prism -I/home/opc/ruby/src/master/enc/unicode/15.0.0 I, [2024-05-09T09:59:37.527171 #243109] INFO -- : CPPFLAGS = I, [2024-05-09T09:59:37.527179 #243109] INFO -- : DLDFLAGS = -Wl,--compress-debug-sections=zlib -fstack-protector-strong -pie I, [2024-05-09T09:59:37.527189 #243109] INFO -- : SOLIBS = -lz -lrt -lrt -ldl -lcrypt -lm -lpthread I, [2024-05-09T09:59:37.527198 #243109] INFO -- : LANG = en_US.UTF-8 I, [2024-05-09T09:59:37.527206 #243109] INFO -- : LC_ALL = I, [2024-05-09T09:59:37.527213 #243109] INFO -- : LC_CTYPE = I, [2024-05-09T09:59:37.527221 #243109] INFO -- : MFLAGS = I, [2024-05-09T09:59:37.527229 #243109] INFO -- : RUSTC = rustc I, [2024-05-09T09:59:37.527237 #243109] INFO -- : YJIT_RUSTC_ARGS = --crate-name=yjit --crate-type=staticlib --edition=2021 -g -C lto=thin -C opt-level=3 -C overflow-checks=on '--out-dir=/home/opc/ruby/build/master/yjit/target/release/' /home/opc/ruby/src/master/yjit/src/lib.rs I, [2024-05-09T09:59:37.527976 #243109] INFO -- : gcc (GCC) 8.5.0 20210514 (Red Hat 8.5.0-10.1.0.1) I, [2024-05-09T09:59:37.528014 #243109] INFO -- : Copyright (C) 2018 Free Software Foundation, Inc. I, [2024-05-09T09:59:37.528025 #243109] INFO -- : This is free software; see the source for copying conditions. There is NO I, [2024-05-09T09:59:37.528035 #243109] INFO -- : warranty; not even for MERCHANTABILITY or FITNESS FOR A PARTICULAR PURPOSE. I, [2024-05-09T09:59:37.528044 #243109] INFO -- : I, [2024-05-09T09:59:37.530002 #243109] INFO -- : generating enc.mk I, [2024-05-09T09:59:37.773209 #243109] INFO -- : generating encdb.h I, [2024-05-09T09:59:37.809867 #243109] INFO -- : encdb.h unchanged I, [2024-05-09T09:59:37.811287 #243109] INFO -- : making enc I, [2024-05-09T09:59:37.838581 #243109] INFO -- : make[1]: Entering directory '/home/opc/ruby/build/master' I, [2024-05-09T09:59:37.838667 #243109] INFO -- : make[1]: Nothing to be done for 'enc'. I, [2024-05-09T09:59:37.838679 #243109] INFO -- : make[1]: Leaving directory '/home/opc/ruby/build/master' I, [2024-05-09T09:59:37.839485 #243109] INFO -- : making srcs under enc I, [2024-05-09T09:59:37.881317 #243109] INFO -- : make[1]: Entering directory '/home/opc/ruby/build/master' I, [2024-05-09T09:59:37.881369 #243109] INFO -- : make[1]: Nothing to be done for 'srcs'. I, [2024-05-09T09:59:37.881381 #243109] INFO -- : make[1]: Leaving directory '/home/opc/ruby/build/master' I, [2024-05-09T09:59:37.882516 #243109] INFO -- : generating transdb.h I, [2024-05-09T09:59:38.025611 #243109] INFO -- : transdb.h unchanged I, [2024-05-09T09:59:38.027131 #243109] INFO -- : making trans I, [2024-05-09T09:59:38.075552 #243109] INFO -- : make[1]: Entering directory '/home/opc/ruby/build/master' I, [2024-05-09T09:59:38.075693 #243109] INFO -- : make[1]: Nothing to be done for 'trans'. I, [2024-05-09T09:59:38.075709 #243109] INFO -- : make[1]: Leaving directory '/home/opc/ruby/build/master' I, [2024-05-09T09:59:38.076479 #243109] INFO -- : making encs I, [2024-05-09T09:59:38.128840 #243109] INFO -- : make[1]: Entering directory '/home/opc/ruby/build/master' I, [2024-05-09T09:59:38.128896 #243109] INFO -- : make[1]: Nothing to be done for 'encs'. I, [2024-05-09T09:59:38.128907 #243109] INFO -- : make[1]: Leaving directory '/home/opc/ruby/build/master' I, [2024-05-09T09:59:38.130990 #243109] INFO -- : generating makefiles ext/configure-ext.mk I, [2024-05-09T09:59:38.170299 #243109] INFO -- : ext/configure-ext.mk updated I, [2024-05-09T09:59:38.174136 #243109] INFO -- : make[1]: Entering directory '/home/opc/ruby/build/master' I, [2024-05-09T09:59:40.219909 #243109] INFO -- : make[1]: Leaving directory '/home/opc/ruby/build/master' I, [2024-05-09T09:59:40.220628 #243109] INFO -- : generating makefile exts.mk I, [2024-05-09T09:59:40.280188 #243109] INFO -- : exts.mk unchanged I, [2024-05-09T09:59:40.285145 #243109] INFO -- : make[1]: Entering directory '/home/opc/ruby/build/master' I, [2024-05-09T09:59:40.581318 #243109] INFO -- : make[2]: Entering directory '/home/opc/ruby/build/master/ext/coverage' I, [2024-05-09T09:59:40.586169 #243109] INFO -- : make[2]: Leaving directory '/home/opc/ruby/build/master/ext/coverage' I, [2024-05-09T09:59:40.591809 #243109] INFO -- : make[2]: Entering directory '/home/opc/ruby/build/master/ext/date' I, [2024-05-09T09:59:40.597040 #243109] INFO -- : make[2]: Leaving directory '/home/opc/ruby/build/master/ext/date' I, [2024-05-09T09:59:40.600502 #243109] INFO -- : make[2]: Entering directory '/home/opc/ruby/build/master/ext/digest' I, [2024-05-09T09:59:40.609294 #243109] INFO -- : make[2]: Leaving directory '/home/opc/ruby/build/master/ext/digest' I, [2024-05-09T09:59:40.631618 #243109] INFO -- : make[2]: Entering directory '/home/opc/ruby/build/master/ext/digest/sha2' I, [2024-05-09T09:59:40.636506 #243109] INFO -- : make[2]: Leaving directory '/home/opc/ruby/build/master/ext/digest/sha2' I, [2024-05-09T09:59:40.654406 #243109] INFO -- : make[2]: Entering directory '/home/opc/ruby/build/master/ext/fiddle' I, [2024-05-09T09:59:40.664443 #243109] INFO -- : make[2]: Leaving directory '/home/opc/ruby/build/master/ext/fiddle' I, [2024-05-09T09:59:40.668663 #243109] INFO -- : make[2]: Entering directory '/home/opc/ruby/build/master/ext/io/console' I, [2024-05-09T09:59:40.673079 #243109] INFO -- : make[2]: Leaving directory '/home/opc/ruby/build/master/ext/io/console' I, [2024-05-09T09:59:40.683793 #243109] INFO -- : make[2]: Entering directory '/home/opc/ruby/build/master/ext/json' I, [2024-05-09T09:59:40.693040 #243109] INFO -- : make[2]: Leaving directory '/home/opc/ruby/build/master/ext/json' I, [2024-05-09T09:59:40.705710 #243109] INFO -- : make[2]: Entering directory '/home/opc/ruby/build/master/ext/monitor' I, [2024-05-09T09:59:40.709669 #243109] INFO -- : make[2]: Leaving directory '/home/opc/ruby/build/master/ext/monitor' I, [2024-05-09T09:59:40.715626 #243109] INFO -- : make[2]: Entering directory '/home/opc/ruby/build/master/ext/objspace' I, [2024-05-09T09:59:40.721464 #243109] INFO -- : make[2]: Leaving directory '/home/opc/ruby/build/master/ext/objspace' I, [2024-05-09T09:59:40.740380 #243109] INFO -- : make[2]: Entering directory '/home/opc/ruby/build/master/ext/openssl' I, [2024-05-09T09:59:40.762019 #243109] INFO -- : make[2]: Leaving directory '/home/opc/ruby/build/master/ext/openssl' I, [2024-05-09T09:59:40.766157 #243109] INFO -- : make[2]: Entering directory '/home/opc/ruby/build/master/ext/pathname' I, [2024-05-09T09:59:40.770338 #243109] INFO -- : make[2]: Leaving directory '/home/opc/ruby/build/master/ext/pathname' I, [2024-05-09T09:59:40.776521 #243109] INFO -- : make[2]: Entering directory '/home/opc/ruby/build/master/ext/psych' I, [2024-05-09T09:59:40.797750 #243109] INFO -- : make[2]: Leaving directory '/home/opc/ruby/build/master/ext/psych' I, [2024-05-09T09:59:40.802116 #243109] INFO -- : make[2]: Entering directory '/home/opc/ruby/build/master/ext/pty' I, [2024-05-09T09:59:40.806220 #243109] INFO -- : make[2]: Leaving directory '/home/opc/ruby/build/master/ext/pty' I, [2024-05-09T09:59:40.819334 #243109] INFO -- : make[2]: Entering directory '/home/opc/ruby/build/master/ext/ripper' I, [2024-05-09T09:59:40.826889 #243109] INFO -- : make[2]: Leaving directory '/home/opc/ruby/build/master/ext/ripper' I, [2024-05-09T09:59:40.828756 #243109] INFO -- : make[2]: Entering directory '/home/opc/ruby/build/master/ext/rubyvm' I, [2024-05-09T09:59:40.832116 #243109] INFO -- : make[2]: Leaving directory '/home/opc/ruby/build/master/ext/rubyvm' I, [2024-05-09T09:59:40.844016 #243109] INFO -- : make[2]: Entering directory '/home/opc/ruby/build/master/ext/socket' I, [2024-05-09T09:59:40.854660 #243109] INFO -- : make[2]: Leaving directory '/home/opc/ruby/build/master/ext/socket' I, [2024-05-09T09:59:40.869911 #243109] INFO -- : make[2]: Entering directory '/home/opc/ruby/build/master/.bundle/gems/bigdecimal-3.1.7/ext/bigdecimal' I, [2024-05-09T09:59:40.901175 #243109] INFO -- : make[2]: Leaving directory '/home/opc/ruby/build/master/.bundle/gems/bigdecimal-3.1.7/ext/bigdecimal' I, [2024-05-09T09:59:40.903968 #243109] INFO -- : make[2]: Entering directory '/home/opc/ruby/build/master/.bundle/gems/bigdecimal-3.1.8/ext/bigdecimal' I, [2024-05-09T09:59:40.934261 #243109] INFO -- : make[2]: Leaving directory '/home/opc/ruby/build/master/.bundle/gems/bigdecimal-3.1.8/ext/bigdecimal' I, [2024-05-09T09:59:40.936836 #243109] INFO -- : make[2]: Entering directory '/home/opc/ruby/build/master/.bundle/gems/debug-1.9.2/ext/debug' I, [2024-05-09T09:59:40.966614 #243109] INFO -- : make[2]: Leaving directory '/home/opc/ruby/build/master/.bundle/gems/debug-1.9.2/ext/debug' I, [2024-05-09T09:59:40.969193 #243109] INFO -- : make[2]: Entering directory '/home/opc/ruby/build/master/.bundle/gems/nkf-0.2.0/ext/nkf' I, [2024-05-09T09:59:40.999184 #243109] INFO -- : make[2]: Leaving directory '/home/opc/ruby/build/master/.bundle/gems/nkf-0.2.0/ext/nkf' I, [2024-05-09T09:59:41.001775 #243109] INFO -- : make[2]: Entering directory '/home/opc/ruby/build/master/.bundle/gems/racc-1.7.3/ext/racc/cparse' I, [2024-05-09T09:59:41.031697 #243109] INFO -- : make[2]: Leaving directory '/home/opc/ruby/build/master/.bundle/gems/racc-1.7.3/ext/racc/cparse' I, [2024-05-09T09:59:41.034734 #243109] INFO -- : make[2]: Entering directory '/home/opc/ruby/build/master/.bundle/gems/rbs-3.4.4/ext/rbs_extension' I, [2024-05-09T09:59:41.064651 #243109] INFO -- : make[2]: Leaving directory '/home/opc/ruby/build/master/.bundle/gems/rbs-3.4.4/ext/rbs_extension' I, [2024-05-09T09:59:41.067143 #243109] INFO -- : make[2]: Entering directory '/home/opc/ruby/build/master/.bundle/gems/syslog-0.1.2/ext/syslog' I, [2024-05-09T09:59:41.097103 #243109] INFO -- : make[2]: Leaving directory '/home/opc/ruby/build/master/.bundle/gems/syslog-0.1.2/ext/syslog' I, [2024-05-09T09:59:41.135214 #243109] INFO -- : make[2]: Entering directory '/home/opc/ruby/build/master' I, [2024-05-09T09:59:41.217941 #243109] INFO -- : make[2]: 'ruby' is up to date. I, [2024-05-09T09:59:41.218016 #243109] INFO -- : make[2]: Leaving directory '/home/opc/ruby/build/master' I, [2024-05-09T09:59:41.218151 #243109] INFO -- : make[1]: Leaving directory '/home/opc/ruby/build/master' I, [2024-05-09T09:59:41.222500 #243109] INFO -- : make[1]: Entering directory '/home/opc/ruby/build/master' I, [2024-05-09T09:59:41.222522 #243109] INFO -- : make[1]: Nothing to be done for 'note'. I, [2024-05-09T09:59:41.222532 #243109] INFO -- : make[1]: Leaving directory '/home/opc/ruby/build/master' I, [2024-05-09T09:59:41.333296 #243109] INFO -- : Run options: I, [2024-05-09T09:59:41.333374 #243109] INFO -- : --seed=4839 I, [2024-05-09T09:59:41.333385 #243109] INFO -- : "--ruby=./miniruby -I/home/opc/ruby/src/master/lib -I. -I.ext/common /home/opc/ruby/src/master/tool/runruby.rb --extout=.ext -- --disable-gems" I, [2024-05-09T09:59:41.333395 #243109] INFO -- : --excludes-dir=/home/opc/ruby/src/master/test/.excludes I, [2024-05-09T09:59:41.333403 #243109] INFO -- : --name=!/memory_leak/ I, [2024-05-09T09:59:41.333412 #243109] INFO -- : --stderr-on-failure I, [2024-05-09T09:59:41.333420 #243109] INFO -- : -j3 I, [2024-05-09T09:59:41.333428 #243109] INFO -- : I, [2024-05-09T09:59:41.333436 #243109] INFO -- : # Running tests: I, [2024-05-09T09:59:41.333444 #243109] INFO -- : I, [2024-05-09T09:59:41.460740 #243109] INFO -- : [ 1/885] 283996=test_alias I, [2024-05-09T09:59:41.467048 #243109] INFO -- : [ 2/885] 283997=test_fips I, [2024-05-09T09:59:41.496737 #243109] INFO -- : [ 3/885] 283998=test_emitter I, [2024-05-09T09:59:41.505314 #243109] INFO -- : [ 4/885] 283998=test_getopts I, [2024-05-09T09:59:41.510346 #243109] INFO -- : [ 5/885] 283998=test_thread_fd_close I, [2024-05-09T09:59:41.515702 #243109] INFO -- : [ 6/885] 283998=test_last_thread I, [2024-05-09T09:59:41.603061 #243109] INFO -- : [ 7/885] 283996=test_digest_extend I, [2024-05-09T09:59:41.655914 #243109] INFO -- : [ 8/885] 283996=test_gem_ext_cmake_builder I, [2024-05-09T09:59:41.777544 #243109] INFO -- : [ 9/885] 283997=test_rdoc_markup_formatter I, [2024-05-09T09:59:41.834806 #243109] INFO -- : [ 10/885] 283996=test_gem_commands_uninstall_command I, [2024-05-09T09:59:41.892337 #243109] INFO -- : [ 11/885] 283997=test_win32ole_event I, [2024-05-09T09:59:41.930883 #243109] INFO -- : [ 12/885] 283997=test_helper I, [2024-05-09T09:59:41.966932 #243109] INFO -- : [ 13/885] 283997=test_compile_prism I, [2024-05-09T09:59:42.266901 #243109] INFO -- : [ 14/885] 283997=test_io_console I, [2024-05-09T09:59:42.353127 #243109] INFO -- : Leaked file descriptor: TestIO_Console#test_noecho: 8 # I, [2024-05-09T09:59:42.353196 #243109] INFO -- : Leaked file descriptor: TestIO_Console#test_noecho: 9 # I, [2024-05-09T09:59:42.385951 #243109] INFO -- : COMMAND PID USER FD TYPE DEVICE SIZE/OFF NODE NAME I, [2024-05-09T09:59:42.386023 #243109] INFO -- : ruby 283997 opc 8r REG 252,0 6940392 13705429 /var/lib/sss/mc/group I, [2024-05-09T09:59:42.386033 #243109] INFO -- : ruby 283997 opc 9u unix 0x0000000000000000 0t0 2904057770 type=STREAM I, [2024-05-09T09:59:42.565358 #243109] INFO -- : [ 15/885] 283996=test_flip I, [2024-05-09T09:59:42.580100 #243109] INFO -- : [ 16/885] 283998=test_rdoc_markup_heading I, [2024-05-09T09:59:42.620932 #243109] INFO -- : [ 17/885] 283996=test_x509crl I, [2024-05-09T09:59:42.684592 #243109] INFO -- : [ 18/885] 283998=test_notimplement I, [2024-05-09T09:59:42.687865 #243109] INFO -- : [ 19/885] 283998=test_cgi_session I, [2024-05-09T09:59:42.699335 #243109] INFO -- : [ 20/885] 283996=test_c_union_entity I, [2024-05-09T09:59:42.721648 #243109] INFO -- : [ 21/885] 283998=test_dns I, [2024-05-09T09:59:42.760581 #243109] INFO -- : [ 22/885] 283996=test_gem_commands_cleanup_command I, [2024-05-09T09:59:43.196376 #243109] INFO -- : [ 23/885] 283998=test_class2name I, [2024-05-09T09:59:43.211213 #243109] INFO -- : [ 24/885] 283998=test_transcode I, [2024-05-09T09:59:43.268750 #243109] INFO -- : [ 25/885] 283996=test_refinement I, [2024-05-09T09:59:43.401647 #243109] INFO -- : [ 26/885] 283998=test_debug I, [2024-05-09T09:59:43.423180 #243109] INFO -- : [ 27/885] 283998=test_profile_frames I, [2024-05-09T09:59:43.577332 #243109] INFO -- : [ 28/885] 283998=test_pattern_key_name_check I, [2024-05-09T09:59:43.611635 #243109] INFO -- : [ 29/885] 283998=test_x509req I, [2024-05-09T09:59:43.658481 #243109] INFO -- : [ 30/885] 283998=test_rdoc_parser_ruby I, [2024-05-09T09:59:44.112386 #243109] INFO -- : [ 31/885] 283998=test_httpresponse I, [2024-05-09T09:59:44.139340 #243109] INFO -- : [ 32/885] 283998=test_readpartial I, [2024-05-09T09:59:44.549066 #243109] INFO -- : [ 33/885] 283998=test_insns_leaf I, [2024-05-09T09:59:44.841680 #243109] INFO -- : [ 34/885] 283998=test_allocation I, [2024-05-09T09:59:44.950951 #243109] INFO -- : [ 35/885] 283997=test_ifunless I, [2024-05-09T09:59:44.990671 #243109] INFO -- : [ 36/885] 283997=test_gem_console_ui I, [2024-05-09T09:59:45.098862 #243109] INFO -- : [ 37/885] 283997=test_config I, [2024-05-09T09:59:45.200195 #243109] INFO -- : [ 38/885] 283997=test_func I, [2024-05-09T09:59:46.461844 #243109] INFO -- : [ 39/885] 283997=test_vm_dump I, [2024-05-09T09:59:46.469377 #243109] INFO -- : [ 40/885] 283997=json_encoding_test I, [2024-05-09T09:59:46.493620 #243109] INFO -- : [ 41/885] 283997=errors_test I, [2024-05-09T09:59:46.606930 #243109] INFO -- : [ 42/885] 283997=test_convertible I, [2024-05-09T09:59:46.754921 #243109] INFO -- : [ 43/885] 283996=test_gem_available_set I, [2024-05-09T09:59:46.836957 #243109] INFO -- : [ 44/885] 283998=test_pkg_config I, [2024-05-09T09:59:46.845335 #243109] INFO -- : [ 45/885] 283996=test_modify_expand I, [2024-05-09T09:59:46.855776 #243109] INFO -- : [ 46/885] 283996=test_super I, [2024-05-09T09:59:46.915894 #243109] INFO -- : [ 47/885] 283998=test_color_printer I, [2024-05-09T09:59:47.058192 #243109] INFO -- : [ 48/885] 283998=unescape_test I, [2024-05-09T09:59:47.289544 #243109] INFO -- : [ 49/885] 283996=test_gem_commands_exec_command I, [2024-05-09T09:59:48.333894 #243109] INFO -- : [ 50/885] 283998=test_dln I, [2024-05-09T09:59:48.348807 #243109] INFO -- : [ 51/885] 283998=test_object I, [2024-05-09T09:59:48.583916 #243109] INFO -- : [ 52/885] 283996=test_gem_source_vendor I, [2024-05-09T09:59:48.592867 #243109] INFO -- : [ 53/885] 283996=test_gem_resolver I, [2024-05-09T09:59:48.696844 #243109] INFO -- : [ 54/885] 283998=test_object_references I, [2024-05-09T09:59:48.700121 #243109] INFO -- : [ 55/885] 283998=test_gem_source_subpath_problem I, [2024-05-09T09:59:48.890554 #243109] INFO -- : [ 56/885] 283996=compiler_test I, [2024-05-09T09:59:48.975229 #243109] INFO -- : [ 57/885] 283996=test_arith_seq_extract I, [2024-05-09T09:59:49.011903 #243109] INFO -- : [ 58/885] 283998=test_ruby_lex I, [2024-05-09T09:59:49.133911 #243109] INFO -- : [ 59/885] 283996=test_ossl I, [2024-05-09T09:59:49.169170 #243109] INFO -- : [ 60/885] 283998=test_buffered_io I, [2024-05-09T09:59:49.180563 #243109] INFO -- : [ 61/885] 283998=test_bug_reporter I, [2024-05-09T09:59:49.391563 #243109] INFO -- : [ 62/885] 283998=test_gem_installer I, [2024-05-09T09:59:50.366906 #243109] INFO -- : [ 63/885] 283997=test_within_pipe I, [2024-05-09T09:59:50.446707 #243109] INFO -- : [ 64/885] 283997=test_rdoc_normal_class I, [2024-05-09T09:59:50.506501 #243109] INFO -- : [ 65/885] 283997=test_pointer I, [2024-05-09T09:59:51.007451 #243109] INFO -- : [ 66/885] 283997=test_regexp I, [2024-05-09T09:59:54.140303 #243109] INFO -- : [ 67/885] 283998=test_whileuntil I, [2024-05-09T09:59:54.146385 #243109] INFO -- : [ 68/885] 283998=test_nofree I, [2024-05-09T09:59:54.153097 #243109] INFO -- : [ 69/885] 283998=test_monitor I, [2024-05-09T09:59:54.375455 #243109] INFO -- : [ 70/885] 283998=test_beginendblock I, [2024-05-09T09:59:54.688578 #243109] INFO -- : [ 71/885] 283998=test_eval I, [2024-05-09T09:59:54.968845 #243109] INFO -- : [ 72/885] 283998=test_case_options I, [2024-05-09T09:59:54.977371 #243109] INFO -- : [ 73/885] 283998=test_cgi_header I, [2024-05-09T09:59:54.982412 #243109] INFO -- : [ 74/885] 283998=format_errors_test I, [2024-05-09T09:59:54.987658 #243109] INFO -- : [ 75/885] 283998=test_object I, [2024-05-09T09:59:54.991888 #243109] INFO -- : [ 76/885] 283998=test_member I, [2024-05-09T09:59:55.001739 #243109] INFO -- : [ 77/885] 283998=test_kill_ring I, [2024-05-09T09:59:55.009659 #243109] INFO -- : [ 78/885] 283998=test_mailto I, [2024-05-09T09:59:55.017584 #243109] INFO -- : [ 79/885] 283998=test_addr I, [2024-05-09T09:59:55.030927 #243109] INFO -- : [ 80/885] 283998=test_gem_resolver_api_set I, [2024-05-09T09:59:55.106613 #243109] INFO -- : [ 81/885] 283998=test_duplicate I, [2024-05-09T09:59:55.116365 #243109] INFO -- : [ 82/885] 283998=test_helper I, [2024-05-09T09:59:55.131658 #243109] INFO -- : [ 83/885] 283998=test_gem_resolver_installer_set I, [2024-05-09T09:59:55.379169 #243109] INFO -- : [ 84/885] 283998=test_append I, [2024-05-09T09:59:55.383820 #243109] INFO -- : [ 85/885] 283998=test_foreach I, [2024-05-09T09:59:55.393142 #243109] INFO -- : [ 86/885] 283998=test_rdoc_markup_to_html I, [2024-05-09T09:59:55.495151 #243109] INFO -- : [ 87/885] 283998=test_helper_method I, [2024-05-09T09:59:55.507131 #243109] INFO -- : [ 88/885] 283998=test_summary I, [2024-05-09T09:59:55.695593 #243109] INFO -- : [ 89/885] 283998=test_config I, [2024-05-09T09:59:56.028556 #243109] INFO -- : [ 90/885] 283998=test_file I, [2024-05-09T09:59:56.396031 #243109] INFO -- : [ 91/885] 283996=bom_test I, [2024-05-09T09:59:56.412334 #243109] INFO -- : [ 92/885] 283996=test_emitter I, [2024-05-09T09:59:56.418621 #243109] INFO -- : [ 93/885] 283996=test_x509ext I, [2024-05-09T09:59:56.422037 #243109] INFO -- : [ 94/885] 283996=test_rb_str_dup I, [2024-05-09T09:59:56.430529 #243109] INFO -- : [ 95/885] 283996=test_lambda I, [2024-05-09T09:59:56.494969 #243109] INFO -- : [ 96/885] 283996=test_scalar_scanner I, [2024-05-09T09:59:56.499868 #243109] INFO -- : [ 97/885] 283996=test_win32ole_type_event I, [2024-05-09T09:59:56.532735 #243109] INFO -- : [ 98/885] 283996=test_keyword I, [2024-05-09T09:59:56.984922 #243109] INFO -- : [ 99/885] 283996=test_gem_path_support I, [2024-05-09T09:59:57.018548 #243109] INFO -- : [100/885] 283996=test_arity I, [2024-05-09T09:59:57.029919 #243109] INFO -- : [101/885] 283996=test_trace I, [2024-05-09T09:59:57.078623 #243109] INFO -- : [102/885] 283996=test_gem_request_set I, [2024-05-09T09:59:57.509938 #243109] INFO -- : [103/885] 283996=test_gem_bundler_version_finder I, [2024-05-09T09:59:57.570652 #243109] INFO -- : [104/885] 283996=test_gc I, [2024-05-09T10:00:02.244880 #243109] INFO -- : [105/885] 283998=test_pattern_matching I, [2024-05-09T10:00:02.257234 #243109] INFO -- : [106/885] 283998=test_folderitem2_invokeverb I, [2024-05-09T10:00:02.262537 #243109] INFO -- : [107/885] 283998=test_interned_str I, [2024-05-09T10:00:02.272077 #243109] INFO -- : [108/885] 283998=constant_path_node_test I, [2024-05-09T10:00:02.280318 #243109] INFO -- : [109/885] 283998=test_set_len I, [2024-05-09T10:00:02.285450 #243109] INFO -- : [110/885] 283998=test_webauthn_listener_response I, [2024-05-09T10:00:02.553210 #243109] INFO -- : [111/885] 283998=test_sleep I, [2024-05-09T10:00:03.865776 #243109] INFO -- : [112/885] 283997=test_gem_resolver_index_set I, [2024-05-09T10:00:03.909417 #243109] INFO -- : [113/885] 283997=ruby_api_test I, [2024-05-09T10:00:04.098082 #243109] INFO -- : [114/885] 283997=test_popen_deadlock I, [2024-05-09T10:00:04.592020 #243109] INFO -- : [115/885] 283997=test_time I, [2024-05-09T10:00:04.746511 #243109] INFO -- : [116/885] 283997=test_alias_and_anchor I, [2024-05-09T10:00:04.752414 #243109] INFO -- : [117/885] 283997=test_key_stroke I, [2024-05-09T10:00:04.757799 #243109] INFO -- : [118/885] 283997=test_rdoc_markup I, [2024-05-09T10:00:04.763145 #243109] INFO -- : [119/885] 283997=test_euc_jp I, [2024-05-09T10:00:04.819132 #243109] INFO -- : [120/885] 283997=test_ensured I, [2024-05-09T10:00:04.829163 #243109] INFO -- : [121/885] 283997=test_delegate I, [2024-05-09T10:00:04.840116 #243109] INFO -- : [122/885] 283997=test_chilled I, [2024-05-09T10:00:04.855486 #243109] INFO -- : [123/885] 283997=location_test I, [2024-05-09T10:00:04.892643 #243109] INFO -- : [124/885] 283997=test_symbol I, [2024-05-09T10:00:04.944464 #243109] INFO -- : [125/885] 283997=test_project_sanity I, [2024-05-09T10:00:04.956847 #243109] INFO -- : [126/885] 283997=test_gem_commands_build_command I, [2024-05-09T10:00:05.269990 #243109] INFO -- : [127/885] 283997=test_call I, [2024-05-09T10:00:05.292678 #243109] INFO -- : [128/885] 283996=test_ellipsize I, [2024-05-09T10:00:05.369123 #243109] INFO -- : [129/885] 283996=test_reline I, [2024-05-09T10:00:05.390224 #243109] INFO -- : [130/885] 283997=test_history I, [2024-05-09T10:00:05.488861 #243109] INFO -- : [131/885] 283997=test_to_ary_concat I, [2024-05-09T10:00:05.692769 #243109] INFO -- : [132/885] 283996=test_gem_ext_builder I, [2024-05-09T10:00:06.493681 #243109] INFO -- : [133/885] 283996=test_windows_1251 I, [2024-05-09T10:00:06.500627 #243109] INFO -- : [134/885] 283996=test_to_ruby I, [2024-05-09T10:00:06.520388 #243109] INFO -- : [135/885] 283996=test_addrinfo I, [2024-05-09T10:00:06.530544 #243109] INFO -- : .Leaked file descriptor: TestSocketAddrinfo#test_addrinfo_timeout: 7 # I, [2024-05-09T10:00:06.555431 #243109] INFO -- : COMMAND PID USER FD TYPE DEVICE SIZE/OFF NODE NAME I, [2024-05-09T10:00:06.555506 #243109] INFO -- : ruby 283996 opc 7u unix 0x0000000000000000 0t0 2904062714 type=STREAM I, [2024-05-09T10:00:06.623910 #243109] INFO -- : [136/885] 283996=test_time_tz I, [2024-05-09T10:00:06.690963 #243109] INFO -- : [137/885] 283996=test_thread I, [2024-05-09T10:00:06.789900 #243109] INFO -- : [138/885] 283997=test_terminfo I, [2024-05-09T10:00:06.799112 #243109] INFO -- : [139/885] 283997=test_socket I, [2024-05-09T10:00:07.317984 #243109] INFO -- : [140/885] 283998=test_inlinecache I, [2024-05-09T10:00:07.388274 #243109] INFO -- : [141/885] 283998=test_bug-14834.Leaked thread: TestSocket#test_accept_loop_multi_port: # I, [2024-05-09T10:00:07.435658 #243109] INFO -- : I, [2024-05-09T10:00:07.439730 #243109] INFO -- : [142/885] 283998=test_data I, [2024-05-09T10:00:07.465958 #243109] INFO -- : [143/885] 283998=test_ssl I, [2024-05-09T10:00:07.567676 #243109] INFO -- : [144/885] 283998=test_scheduler I, [2024-05-09T10:00:07.590374 #243109] INFO -- : .Finished thread: TestSocket#test_closed_read: # I, [2024-05-09T10:00:07.717095 #243109] INFO -- : [145/885] 283997=test_gem_commands_help_command I, [2024-05-09T10:00:07.756973 #243109] INFO -- : [146/885] 283998=test_ractor I, [2024-05-09T10:00:07.799805 #243109] INFO -- : [147/885] 283997=test_gem_resolver_conflict I, [2024-05-09T10:00:07.844626 #243109] INFO -- : [148/885] 283997=test_nesting_parser I, [2024-05-09T10:00:07.925765 #243109] INFO -- : [149/885] 283997=ractor_test I, [2024-05-09T10:00:07.927246 #243109] INFO -- : [150/885] 283997=test_ancdata I, [2024-05-09T10:00:07.947610 #243109] INFO -- : [151/885] 283997=test_marshal I, [2024-05-09T10:00:08.093107 #243109] INFO -- : [152/885] 283998=test_rdoc_markup_hard_break I, [2024-05-09T10:00:08.112457 #243109] INFO -- : [153/885] 283998=newline_test I, [2024-05-09T10:00:08.178555 #243109] INFO -- : [154/885] 283998=test_bignum I, [2024-05-09T10:00:08.625157 #243109] INFO -- : [155/885] 283997=test_enc_str_buf_cat I, [2024-05-09T10:00:08.633506 #243109] INFO -- : [156/885] 283997=test_cgi_core I, [2024-05-09T10:00:08.640354 #243109] INFO -- : [157/885] 283997=test_gem_resolver_best_set I, [2024-05-09T10:00:08.727434 #243109] INFO -- : [158/885] 283997=test_rdoc_markup_to_label I, [2024-05-09T10:00:08.764848 #243109] INFO -- : [159/885] 283997=test_parser I, [2024-05-09T10:00:08.784303 #243109] INFO -- : [160/885] 283997=test_ractor I, [2024-05-09T10:00:08.792670 #243109] INFO -- : [161/885] 283997=test_ansi_without_terminfo I, [2024-05-09T10:00:08.798902 #243109] INFO -- : [162/885] 283997=json_generator_test I, [2024-05-09T10:00:08.887857 #243109] INFO -- : [163/885] 283997=test_gem I, [2024-05-09T10:00:11.149441 #243109] INFO -- : [164/885] 283997=test_registry I, [2024-05-09T10:00:11.167739 #243109] INFO -- : [165/885] 283997=test_ts I, [2024-05-09T10:00:11.437553 #243109] INFO -- : [166/885] 283997=test_locale I, [2024-05-09T10:00:11.461313 #243109] INFO -- : [167/885] 283997=test_rdoc_attr I, [2024-05-09T10:00:11.521253 #243109] INFO -- : [168/885] 283997=test_ractor I, [2024-05-09T10:00:11.796116 #243109] INFO -- : [169/885] 283997=test_trick I, [2024-05-09T10:00:11.804107 #243109] INFO -- : [170/885] 283998=test_stream I, [2024-05-09T10:00:11.817810 #243109] INFO -- : [171/885] 283998=test_address_resolve I, [2024-05-09T10:00:11.839131 #243109] INFO -- : [172/885] 283998=test_enum I, [2024-05-09T10:00:12.654769 #243109] INFO -- : [173/885] 283998=test_rdoc_markup_include I, [2024-05-09T10:00:12.758883 #243109] INFO -- : [174/885] 283998=test_require I, [2024-05-09T10:00:13.859735 #243109] INFO -- : [175/885] 283997=test_recursion I, [2024-05-09T10:00:13.876419 #243109] INFO -- : [176/885] 283997=test_gem_commands_signin_command I, [2024-05-09T10:00:13.928323 #243109] INFO -- : [177/885] 283998=test_range I, [2024-05-09T10:00:14.035809 #243109] INFO -- : [178/885] 283997=test_iter_break I, [2024-05-09T10:00:14.105819 #243109] INFO -- : [179/885] 283997=test_extlibs I, [2024-05-09T10:00:14.650231 #243109] INFO -- : [180/885] 283998=test_num2int I, [2024-05-09T10:00:14.665612 #243109] INFO -- : [181/885] 283998=test_rbconfig I, [2024-05-09T10:00:14.679651 #243109] INFO -- : [182/885] 283998=test_integer I, [2024-05-09T10:00:15.583304 #243109] INFO -- : [183/885] 283996=test_unix I, [2024-05-09T10:00:15.622743 #243109] INFO -- : [184/885] 283997=test_formatter I, [2024-05-09T10:00:15.629748 #243109] INFO -- : [185/885] 283997=test_coder I, [2024-05-09T10:00:15.645823 #243109] INFO -- : [186/885] 283996=test_rdoc_servlet I, [2024-05-09T10:00:15.656660 #243109] INFO -- : [187/885] 283997=test_gem_commands_search_command I, [2024-05-09T10:00:15.725175 #243109] INFO -- : [188/885] 283997=test_symbol I, [2024-05-09T10:00:16.042535 #243109] INFO -- : [189/885] 283996=test_udp I, [2024-05-09T10:00:16.051443 #243109] INFO -- : [190/885] 283996=test_context I, [2024-05-09T10:00:16.284937 #243109] INFO -- : [191/885] 283996=test_gem_commands_contents_command I, [2024-05-09T10:00:16.423169 #243109] INFO -- : [192/885] 283996=test_gem_commands_list_command I, [2024-05-09T10:00:16.437263 #243109] INFO -- : [193/885] 283996=test_date_new I, [2024-05-09T10:00:16.462825 #243109] INFO -- : [194/885] 283996=test_configuration I, [2024-05-09T10:00:16.592271 #243109] INFO -- : [195/885] 283996=test_gem_resolver_local_specification I, [2024-05-09T10:00:17.314311 #243109] INFO -- : [196/885] 283996=test_have_func I, [2024-05-09T10:00:17.321725 #243109] INFO -- : [197/885] 283998=test_date_marshal I, [2024-05-09T10:00:17.331384 #243109] INFO -- : [198/885] 283998=test_fiber I, [2024-05-09T10:00:18.114641 #243109] INFO -- : [199/885] 283996=test_gem_commands_mirror I, [2024-05-09T10:00:18.201883 #243109] INFO -- : [200/885] 283996=test_engine I, [2024-05-09T10:00:18.611023 #243109] INFO -- : [201/885] 283996=test_win32ole_param I, [2024-05-09T10:00:18.617403 #243109] INFO -- : [202/885] 283996=test_key_error I, [2024-05-09T10:00:18.629163 #243109] INFO -- : [203/885] 283996=test_resize I, [2024-05-09T10:00:18.690649 #243109] INFO -- : [204/885] 283996=test_lock_native_thread I, [2024-05-09T10:00:18.918876 #243109] INFO -- : [205/885] 283996=test_gem_package_task I, [2024-05-09T10:00:19.050669 #243109] INFO -- : [206/885] 283996=test_ssl I, [2024-05-09T10:00:19.109127 #243109] INFO -- : [207/885] 283997=test_bundled_ca I, [2024-05-09T10:00:20.201697 #243109] INFO -- : [208/885] 283997=test_integer_comb I, [2024-05-09T10:00:22.356171 #243109] INFO -- : [209/885] 283997=test_load I, [2024-05-09T10:00:22.358351 #243109] INFO -- : Leaked file descriptor: TestOptionParserLoad#test_load_xdg_config_dirs: 11 # I, [2024-05-09T10:00:22.390736 #243109] INFO -- : COMMAND PID USER FD TYPE DEVICE SIZE/OFF NODE NAME I, [2024-05-09T10:00:22.390811 #243109] INFO -- : ruby 283997 opc 11r REG 252,0 9253600 13705411 /var/lib/sss/mc/passwd I, [2024-05-09T10:00:22.486342 #243109] INFO -- : [210/885] 283997=test_abi I, [2024-05-09T10:00:22.601704 #243109] INFO -- : [211/885] 283997=test_gem_validator I, [2024-05-09T10:00:22.622923 #243109] INFO -- : [212/885] 283997=test_gem_source_installed I, [2024-05-09T10:00:22.628568 #243109] INFO -- : [213/885] 283997=test_usrmarshal I, [2024-05-09T10:00:22.821541 #243109] INFO -- : [214/885] 283997=test_erb_command I, [2024-05-09T10:00:22.864651 #243109] INFO -- : [215/885] 283997=test_module I, [2024-05-09T10:00:23.504751 #243109] INFO -- : [216/885] 283998=test_gem_security_trust_dir I, [2024-05-09T10:00:23.555365 #243109] INFO -- : [217/885] 283998=test_change_word I, [2024-05-09T10:00:23.561392 #243109] INFO -- : [218/885] 283998=test_depth_first I, [2024-05-09T10:00:23.569050 #243109] INFO -- : [219/885] 283998=test_ostruct I, [2024-05-09T10:00:23.708132 #243109] INFO -- : [220/885] 283998=test_config I, [2024-05-09T10:00:23.781415 #243109] INFO -- : [221/885] 283998=test_c_struct_entry I, [2024-05-09T10:00:24.283993 #243109] INFO -- : [222/885] 283998=static_inspect_test I, [2024-05-09T10:00:24.289775 #243109] INFO -- : [223/885] 283998=test_struct I, [2024-05-09T10:00:24.331399 #243109] INFO -- : [224/885] 283998=test_cparser I, [2024-05-09T10:00:25.159939 #243109] INFO -- : [225/885] 283997=fuzzer_test I, [2024-05-09T10:00:25.164693 #243109] INFO -- : [226/885] 283997=test_rubyvm I, [2024-05-09T10:00:25.168205 #243109] INFO -- : [227/885] 283997=test_custom_command I, [2024-05-09T10:00:25.181786 #243109] INFO -- : [228/885] 283997=test_rdoc_parser_markdown I, [2024-05-09T10:00:25.185855 #243109] INFO -- : [229/885] 283997=test_load I, [2024-05-09T10:00:25.202869 #243109] INFO -- : [230/885] 283997=test_rdoc_rd_inline_parser I, [2024-05-09T10:00:25.233678 #243109] INFO -- : [231/885] 283997=test_win32ole_type I, [2024-05-09T10:00:25.238013 #243109] INFO -- : [232/885] 283997=test_new I, [2024-05-09T10:00:25.241077 #243109] INFO -- : [233/885] 283997=test_update I, [2024-05-09T10:00:25.256842 #243109] INFO -- : [234/885] 283997=test_cipher I, [2024-05-09T10:00:25.275200 #243109] INFO -- : [235/885] 283997=test_gem_source_lock I, [2024-05-09T10:00:25.339810 #243109] INFO -- : [236/885] 283997=test_rdoc_markup_attribute_manager I, [2024-05-09T10:00:25.396028 #243109] INFO -- : [237/885] 283997=test_wss I, [2024-05-09T10:00:25.406772 #243109] INFO -- : [238/885] 283997=test_option I, [2024-05-09T10:00:25.530897 #243109] INFO -- : [239/885] 283997=test_not I, [2024-05-09T10:00:25.540084 #243109] INFO -- : [240/885] 283997=test_cgi_cookie I, [2024-05-09T10:00:25.545745 #243109] INFO -- : [241/885] 283997=test_tracer I, [2024-05-09T10:00:25.550560 #243109] INFO -- : [242/885] 283997=test_my_integer I, [2024-05-09T10:00:25.559404 #243109] INFO -- : [243/885] 283997=test_gem_resolver_composed_set I, [2024-05-09T10:00:25.580534 #243109] INFO -- : [244/885] 283997=test_debugger_integration I, [2024-05-09T10:00:25.593801 #243109] INFO -- : [245/885] 283998=test_objectspace I, [2024-05-09T10:00:25.603968 #243109] INFO -- : [246/885] 283997=test_require I, [2024-05-09T10:00:26.511752 #243109] INFO -- : [247/885] 283998=test_metaclass I, [2024-05-09T10:00:26.532841 #243109] INFO -- : [248/885] 283998=test_gem_gem_runner I, [2024-05-09T10:00:26.645200 #243109] INFO -- : [249/885] 283998=test_require_lib I, [2024-05-09T10:00:28.329361 #243109] INFO -- : [250/885] 283997=test_rdoc_generator_pot I, [2024-05-09T10:00:28.332373 #243109] INFO -- : [251/885] 283997=test_rdoc_markup_to_markdown I, [2024-05-09T10:00:28.413788 #243109] INFO -- : [252/885] 283997=test_rdoc_markup_to_joined_paragraph I, [2024-05-09T10:00:28.418557 #243109] INFO -- : [253/885] 283997=test_rdoc_rd I, [2024-05-09T10:00:28.425069 #243109] INFO -- : [254/885] 283997=test_x509store I, [2024-05-09T10:00:28.928072 #243109] INFO -- : [255/885] 283997=test_rdoc_rd_block_parser I, [2024-05-09T10:00:28.960285 #243109] INFO -- : [256/885] 283997=test_continuation I, [2024-05-09T10:00:28.972857 #243109] INFO -- : [257/885] 283997=test_fixnum I, [2024-05-09T10:00:28.985574 #243109] INFO -- : [258/885] 283997=test_gem_silent_ui I, [2024-05-09T10:00:29.056540 #243109] INFO -- : [259/885] 283997=test_signal I, [2024-05-09T10:00:29.554643 #243109] INFO -- : [260/885] 283996=test_gem_ci_detector I, [2024-05-09T10:00:29.576124 #243109] INFO -- : [261/885] 283996=test_io_wait_uncommon I, [2024-05-09T10:00:29.602864 #243109] INFO -- : [262/885] 283996=test_gem_security_policy I, [2024-05-09T10:00:29.802867 #243109] INFO -- : [263/885] 283998=test_delete I, [2024-05-09T10:00:29.835605 #243109] INFO -- : [264/885] 283998=test_rdoc_markup_document I, [2024-05-09T10:00:29.849344 #243109] INFO -- : [265/885] 283998=parse_stream_test I, [2024-05-09T10:00:29.860531 #243109] INFO -- : [266/885] 283998=test_handle I, [2024-05-09T10:00:30.052163 #243109] INFO -- : [267/885] 283996=test_completion I, [2024-05-09T10:00:30.482897 #243109] INFO -- : [268/885] 283998=test_file_exhaustive I, [2024-05-09T10:00:30.522726 #243109] INFO -- : Leaked file descriptor: TestFileExhaustive#test_expand_path_home_dir_string: 9 # I, [2024-05-09T10:00:30.523054 #243109] INFO -- : Leaked file descriptor: TestFileExhaustive#test_expand_path_home_dir_string: 10 # I, [2024-05-09T10:00:30.548422 #243109] INFO -- : COMMAND PID USER FD TYPE DEVICE SIZE/OFF NODE NAME I, [2024-05-09T10:00:30.548510 #243109] INFO -- : ruby 283998 opc 9r REG 252,0 9253600 13705411 /var/lib/sss/mc/passwd I, [2024-05-09T10:00:30.548538 #243109] INFO -- : ruby 283998 opc 10u unix 0x0000000000000000 0t0 2904068129 type=STREAM I, [2024-05-09T10:00:31.097862 #243109] INFO -- : [269/885] 283997=test_placearg I, [2024-05-09T10:00:31.214374 #243109] INFO -- : [270/885] 283997=test_logperiod I, [2024-05-09T10:00:31.241609 #243109] INFO -- : [271/885] 283997=test_case_comprehensive I, [2024-05-09T10:00:31.277929 #243109] INFO -- : [272/885] 283996=test_rational2 I, [2024-05-09T10:00:31.293589 #243109] INFO -- : [273/885] 283996=test_gem_package_tar_header I, [2024-05-09T10:00:31.494924 #243109] INFO -- : [274/885] 283996=test_ssl_session I, [2024-05-09T10:00:32.307730 #243109] INFO -- : [275/885] 283996=test_ast I, [2024-05-09T10:00:38.707327 #243109] INFO -- : [276/885] 283998=test_logdevice I, [2024-05-09T10:00:39.663608 #243109] INFO -- : [277/885] 283998=test_variable_name_check I, [2024-05-09T10:00:39.746824 #243109] INFO -- : [278/885] 283998=test_bn I, [2024-05-09T10:00:39.785270 #243109] INFO -- : [279/885] 283998=test_require_path_check I, [2024-05-09T10:00:39.832706 #243109] INFO -- : [280/885] 283998=test_rdoc_markup_paragraph I, [2024-05-09T10:00:39.839350 #243109] INFO -- : [281/885] 283998=test_x509cert I, [2024-05-09T10:00:39.936929 #243109] INFO -- : [282/885] 283998=test_irb I, [2024-05-09T10:00:40.199888 #243109] INFO -- : [283/885] 283998=test_name_error_extension I, [2024-05-09T10:00:40.206603 #243109] INFO -- : [284/885] 283998=test_gem_request_set_gem_dependency_api I, [2024-05-09T10:00:40.513228 #243109] INFO -- : [285/885] 283998=test_object_create_start I, [2024-05-09T10:00:40.528457 #243109] INFO -- : [286/885] 283998=test_gem_commands_info_command I, [2024-05-09T10:00:40.550225 #243109] INFO -- : [287/885] 283998=test_https I, [2024-05-09T10:00:40.743250 #243109] INFO -- : [288/885] 283998=test_evaluation I, [2024-05-09T10:00:40.791110 #243109] INFO -- : [289/885] 283998=test_protocol I, [2024-05-09T10:00:41.113994 #243109] INFO -- : [290/885] 283998=test_weakkeymap I, [2024-05-09T10:00:41.444224 #243109] INFO -- : [291/885] 283998=test_files_test I, [2024-05-09T10:00:41.526921 #243109] INFO -- : [292/885] 283998=test_rdoc_markup_to_ansi I, [2024-05-09T10:00:41.572054 #243109] INFO -- : [293/885] 283998=test_digest I, [2024-05-09T10:00:42.344667 #243109] INFO -- : [294/885] 283998=test_signedness I, [2024-05-09T10:00:44.305249 #243109] INFO -- : [295/885] 283998=test_gem_resolver_git_set I, [2024-05-09T10:00:44.953434 #243109] INFO -- : [296/885] 283998=test_gem_commands_check_command I, [2024-05-09T10:00:45.040819 #243109] INFO -- : [297/885] 283998=test_ractor I, [2024-05-09T10:00:45.054414 #243109] INFO -- : [298/885] 283998=test_httpheader I, [2024-05-09T10:00:45.073121 #243109] INFO -- : [299/885] 283998=test_sexp I, [2024-05-09T10:00:45.099154 #243109] INFO -- : [300/885] 283998=test_rdoc_ri_driver I, [2024-05-09T10:00:45.503328 #243109] INFO -- : [301/885] 283998=test_gem_safe_marshal I, [2024-05-09T10:00:46.382421 #243109] INFO -- : [302/885] 283998=test_gem_resolver_vendor_specification I, [2024-05-09T10:00:46.429811 #243109] INFO -- : [303/885] 283998=test_date_arith I, [2024-05-09T10:00:46.440856 #243109] INFO -- : [304/885] 283998=json_generic_object_test I, [2024-05-09T10:00:46.485084 #243109] INFO -- : [305/885] 283998=test_fiddle I, [2024-05-09T10:00:46.602935 #243109] INFO -- : [306/885] 283998=test_stringscanner I, [2024-05-09T10:00:46.663957 #243109] INFO -- : [307/885] 283998=test_gem_resolver_installed_specification I, [2024-05-09T10:00:46.688705 #243109] INFO -- : [308/885] 283998=test_exception_at_throwing I, [2024-05-09T10:00:46.747933 #243109] INFO -- : [309/885] 283998=test_ractor I, [2024-05-09T10:00:46.838411 #243109] INFO -- : [310/885] 283998=test_struct I, [2024-05-09T10:00:47.415978 #243109] INFO -- : [311/885] 283998=test_tmpdir I, [2024-05-09T10:00:47.495776 #243109] INFO -- : [312/885] 283998=test_type I, [2024-05-09T10:00:47.504124 #243109] INFO -- : [313/885] 283998=heredoc_dedent_test I, [2024-05-09T10:00:47.552883 #243109] INFO -- : [314/885] 283998=test_mutex I, [2024-05-09T10:00:48.637266 #243109] INFO -- : [315/885] 283998=test_rdoc_token_stream I, [2024-05-09T10:00:48.654390 #243109] INFO -- : [316/885] 283998=test_gem_local_remote_options I, [2024-05-09T10:00:48.772103 #243109] INFO -- : [317/885] 283998=test_gem_ext_cargo_builder_link_flag_converter I, [2024-05-09T10:00:48.868924 #243109] INFO -- : [318/885] 283998=test_acceptable I, [2024-05-09T10:00:48.942724 #243109] INFO -- : [319/885] 283998=test_dup I, [2024-05-09T10:00:49.112351 #243109] INFO -- : [320/885] 283998=test_rdoc_single_class I, [2024-05-09T10:00:49.114795 #243109] INFO -- : [321/885] 283998=test_unicode I, [2024-05-09T10:00:49.122918 #243109] INFO -- : [322/885] 283998=test_eval_history I, [2024-05-09T10:00:49.136385 #243109] INFO -- : [323/885] 283998=dispatcher_test I, [2024-05-09T10:00:49.158072 #243109] INFO -- : [324/885] 283998=test_random I, [2024-05-09T10:00:49.167687 #243109] INFO -- : [325/885] 283998=test_thread_cv I, [2024-05-09T10:00:49.821919 #243109] INFO -- : [326/885] 283998=test_stringio I, [2024-05-09T10:00:49.906879 #243109] INFO -- : [327/885] 283998=test_assembler I, [2024-05-09T10:00:49.908459 #243109] INFO -- : [328/885] 283998=test_files_ext I, [2024-05-09T10:00:49.912762 #243109] INFO -- : [329/885] 283998=test_ripper I, [2024-05-09T10:00:50.240796 #243109] INFO -- : [330/885] 283998=test_win32ole_method I, [2024-05-09T10:00:50.250970 #243109] INFO -- : [331/885] 283998=test_lexer I, [2024-05-09T10:00:50.298995 #243109] INFO -- : [332/885] 283998=test_regex_casefold I, [2024-05-09T10:00:50.719961 #243109] INFO -- : [333/885] 283998=test_gem_source_git I, [2024-05-09T10:00:51.439216 #243109] INFO -- : [334/885] 283997=test_class I, [2024-05-09T10:00:51.499979 #243109] INFO -- : [335/885] 283997=test_have_macro I, [2024-05-09T10:00:51.728284 #243109] INFO -- : [336/885] 283998=test_gem_source I, [2024-05-09T10:00:51.732901 #243109] INFO -- : [337/885] 283997=test_mkmf I, [2024-05-09T10:00:51.773586 #243109] INFO -- : [338/885] 283997=test_at_exit I, [2024-05-09T10:00:51.794283 #243109] INFO -- : [339/885] 283997=test_benchmark I, [2024-05-09T10:00:52.098668 #243109] INFO -- : [340/885] 283998=test_array I, [2024-05-09T10:00:53.326499 #243109] INFO -- : [341/885] 283997=test_gem_package I, [2024-05-09T10:00:54.150199 #243109] INFO -- : [342/885] 283997=test_autoload I, [2024-05-09T10:00:58.636369 #243109] INFO -- : [343/885] 283997=test_rdoc_comment I, [2024-05-09T10:00:58.771745 #243109] INFO -- : [344/885] 283997=test_install I, [2024-05-09T10:00:58.874444 #243109] INFO -- : [345/885] 283997=test_encoding I, [2024-05-09T10:00:58.896424 #243109] INFO -- : [346/885] 283997=test_gem_source_fetch_problem I, [2024-05-09T10:00:58.906350 #243109] INFO -- : [347/885] 283997=test_ftp I, [2024-05-09T10:00:58.916364 #243109] INFO -- : [348/885] 283997=test_sockopt I, [2024-05-09T10:00:58.927289 #243109] INFO -- : [349/885] 283997=test_find_executable I, [2024-05-09T10:00:58.930123 #243109] INFO -- : [350/885] 283997=test_autoconf I, [2024-05-09T10:00:58.941729 #243109] INFO -- : [351/885] 283997=integer_parse_test I, [2024-05-09T10:00:58.991455 #243109] INFO -- : [352/885] 283997=test_ractor_compatibility I, [2024-05-09T10:00:59.380746 #243109] INFO -- : [353/885] 283997=test_arithmetic_sequence I, [2024-05-09T10:00:59.395301 #243109] INFO -- : [354/885] 283997=test_gem_request_set_lockfile_tokenizer I, [2024-05-09T10:00:59.475447 #243109] INFO -- : [355/885] 283997=test_lazy_enumerator I, [2024-05-09T10:00:59.944321 #243109] INFO -- : [356/885] 283997=test_cgi_multipart I, [2024-05-09T10:01:00.068018 #243109] INFO -- : [357/885] 283997=test_rdoc_ri_paths I, [2024-05-09T10:01:00.107233 #243109] INFO -- : [358/885] 283997=test_parser I, [2024-05-09T10:01:00.127563 #243109] INFO -- : [359/885] 283997=test_primitive I, [2024-05-09T10:01:00.141053 #243109] INFO -- : [360/885] 283997=test_iseq I, [2024-05-09T10:01:00.761399 #243109] INFO -- : [361/885] 283997=test_singleton_function I, [2024-05-09T10:01:00.764037 #243109] INFO -- : [362/885] 283997=test_gem_commands_setup_command I, [2024-05-09T10:01:01.652754 #243109] INFO -- : [363/885] 283997=test_history I, [2024-05-09T10:01:01.677782 #243109] INFO -- : [364/885] 283998=test_document I, [2024-05-09T10:01:01.687830 #243109] INFO -- : [365/885] 283998=test_eval I, [2024-05-09T10:01:01.691440 #243109] INFO -- : [366/885] 283998=test_gem_safe_yaml I, [2024-05-09T10:01:01.700313 #243109] INFO -- : [367/885] 283997=test_gem_package_tar_reader I, [2024-05-09T10:01:01.710979 #243109] INFO -- : [368/885] 283998=test_gem_commands_signout_command I, [2024-05-09T10:01:01.733204 #243109] INFO -- : [369/885] 283998=test_env I, [2024-05-09T10:01:01.756460 #243109] INFO -- : [370/885] 283997=test_win32ole_variant_m I, [2024-05-09T10:01:01.797400 #243109] INFO -- : [371/885] 283997=test_pair I, [2024-05-09T10:01:04.424017 #243109] INFO -- : [372/885] 283998=command_line_test I, [2024-05-09T10:01:04.452653 #243109] INFO -- : [373/885] 283998=test_io I, [2024-05-09T10:01:07.075136 #243109] INFO -- : [374/885] 283997=test_uncorrectable_name_check I, [2024-05-09T10:01:07.083230 #243109] INFO -- : [375/885] 283997=test_rdoc_rd_inline I, [2024-05-09T10:01:07.091230 #243109] INFO -- : [376/885] 283997=test_digest I, [2024-05-09T10:01:07.099259 #243109] INFO -- : [377/885] 283997=test_path I, [2024-05-09T10:01:07.105699 #243109] INFO -- : [378/885] 283997=test_rubygems I, [2024-05-09T10:01:07.316129 #243109] INFO -- : [379/885] 283997=test_resolve_symbol I, [2024-05-09T10:01:07.326680 #243109] INFO -- : [380/885] 283997=test_closure I, [2024-05-09T10:01:09.836339 #243109] INFO -- : [381/885] 283997=test_files_test_1 I, [2024-05-09T10:01:12.505888 #243109] INFO -- : [382/885] 283997=test_dir I, [2024-05-09T10:01:12.839867 #243109] INFO -- : [383/885] 283997=test_stat I, [2024-05-09T10:01:12.842011 #243109] INFO -- : [384/885] 283997=test_etc I, [2024-05-09T10:01:12.966780 #243109] INFO -- : [385/885] 283997=test_gem_commands_rebuild_command I, [2024-05-09T10:01:13.008703 #243109] INFO -- : [386/885] 283997=test_nomethod_error I, [2024-05-09T10:01:13.015084 #243109] INFO -- : [387/885] 283997=test_rdoc_parser I, [2024-05-09T10:01:13.047758 #243109] INFO -- : [388/885] 283997=test_https_proxy I, [2024-05-09T10:01:13.078859 #243109] INFO -- : [389/885] 283997=test_win32ole_param_event I, [2024-05-09T10:01:13.083892 #243109] INFO -- : [390/885] 283997=test_cgi_modruby I, [2024-05-09T10:01:13.091265 #243109] INFO -- : [391/885] 283997=magic_comment_test I, [2024-05-09T10:01:13.098644 #243109] INFO -- : [392/885] 283997=test_win32ole_variant I, [2024-05-09T10:01:13.104596 #243109] INFO -- : [393/885] 283997=test_workspace I, [2024-05-09T10:01:13.239731 #243109] INFO -- : [394/885] 283997=test_printf I, [2024-05-09T10:01:13.273731 #243109] INFO -- : [395/885] 283997=test_x509attr I, [2024-05-09T10:01:13.278176 #243109] INFO -- : [396/885] 283997=test_rdoc_parser_simple I, [2024-05-09T10:01:13.305629 #243109] INFO -- : [397/885] 283997=test_nonblock I, [2024-05-09T10:01:13.364708 #243109] INFO -- : [398/885] 283997=test_gem_ext_configure_builder I, [2024-05-09T10:01:13.398577 #243109] INFO -- : [399/885] 283997=json_ext_parser_test I, [2024-05-09T10:01:13.407957 #243109] INFO -- : [400/885] 283997=test_shellwords I, [2024-05-09T10:01:13.421330 #243109] INFO -- : [401/885] 283997=test_mul I, [2024-05-09T10:01:13.430732 #243109] INFO -- : [402/885] 283997=test_rdoc_generator_pot_po I, [2024-05-09T10:01:13.438922 #243109] INFO -- : [403/885] 283997=test_omap I, [2024-05-09T10:01:13.476288 #243109] INFO -- : [404/885] 283997=test_date_strptime I, [2024-05-09T10:01:13.576684 #243109] INFO -- : [405/885] 283997=test_ipaddr I, [2024-05-09T10:01:13.606149 #243109] INFO -- : [406/885] 283997=test_scanner_events I, [2024-05-09T10:01:13.636889 #243109] INFO -- : [407/885] 283997=test_ocsp I, [2024-05-09T10:01:13.744868 #243109] INFO -- : [408/885] 283997=test_rdoc_generator_ri I, [2024-05-09T10:01:13.757422 #243109] INFO -- : [409/885] 283997=test_gem_stream_ui I, [2024-05-09T10:01:13.918402 #243109] INFO -- : [410/885] 283997=test_unicode_normalize I, [2024-05-09T10:01:14.869601 #243109] INFO -- : [411/885] 283998=test_reline_key I, [2024-05-09T10:01:14.877207 #243109] INFO -- : [412/885] 283998=test_gem_commands_lock_command I, [2024-05-09T10:01:14.931106 #243109] INFO -- : [413/885] 283998=test_gb18030 I, [2024-05-09T10:01:14.967279 #243109] INFO -- : [414/885] 283998=test_propertyputref I, [2024-05-09T10:01:14.984703 #243109] INFO -- : [415/885] 283998=test_color I, [2024-05-09T10:01:15.058374 #243109] INFO -- : [416/885] 283998=test_float I, [2024-05-09T10:01:16.966404 #243109] INFO -- : [417/885] 283998=test_gem_stub_specification I, [2024-05-09T10:01:17.061188 #243109] INFO -- : [418/885] 283996=test_cmethod I, [2024-05-09T10:01:17.092879 #243109] INFO -- : [419/885] 283996=test_io_m17n I, [2024-05-09T10:01:17.179379 #243109] INFO -- : [420/885] 283998=test_rdoc_top_level I, [2024-05-09T10:01:17.497378 #243109] INFO -- : [421/885] 283998=test_gem_package_old I, [2024-05-09T10:01:17.561376 #243109] INFO -- : [422/885] 283998=test_gem_request I, [2024-05-09T10:01:17.845827 #243109] INFO -- : [423/885] 283998=test_gem_commands_which_command I, [2024-05-09T10:01:17.878304 #243109] INFO -- : [424/885] 283998=test_gem_commands_specification_command I, [2024-05-09T10:01:17.954519 #243109] INFO -- : [425/885] 283997=test_scan_args I, [2024-05-09T10:01:17.987401 #243109] INFO -- : [426/885] 283997=encoding_test I, [2024-05-09T10:01:18.046852 #243109] INFO -- : [427/885] 283998=test_hash I, [2024-05-09T10:01:18.081163 #243109] INFO -- : [428/885] 283997=parser_test I, [2024-05-09T10:01:18.086935 #243109] INFO -- : [429/885] 283997=test_http I, [2024-05-09T10:01:18.101708 #243109] INFO -- : [430/885] 283997=test_gem_dependency_installer I, [2024-05-09T10:01:18.497108 #243109] INFO -- : [431/885] 283996=test_pty I, [2024-05-09T10:01:18.969995 #243109] INFO -- : [432/885] 283996=test_backtrace I, [2024-05-09T10:01:20.427652 #243109] INFO -- : [433/885] 283996=test_tracepoint I, [2024-05-09T10:01:20.765208 #243109] INFO -- : [434/885] 283996=test_gem_text I, [2024-05-09T10:01:20.856973 #243109] INFO -- : [435/885] 283996=test_settracefunc I, [2024-05-09T10:01:21.038696 #243109] INFO -- : [436/885] 283997=test_rdoc_task I, [2024-05-09T10:01:21.051516 #243109] INFO -- : [437/885] 283997=test_gem_gemcutter_utilities I, [2024-05-09T10:01:21.577409 #243109] INFO -- : [438/885] 283997=test_rendering I, [2024-05-09T10:01:21.582668 #243109] INFO -- : [439/885] 283997=test_win32ole I, [2024-05-09T10:01:21.594321 #243109] INFO -- : [440/885] 283997=test_internal_ivar I, [2024-05-09T10:01:21.596880 #243109] INFO -- : [441/885] 283997=test_gem_source_local I, [2024-05-09T10:01:21.875462 #243109] INFO -- : [442/885] 283997=desugar_compiler_test I, [2024-05-09T10:01:21.883862 #243109] INFO -- : [443/885] 283998=test_sprintf_comb I, [2024-05-09T10:01:21.889371 #243109] INFO -- : [444/885] 283997=test_too_many_dummy_encodings I, [2024-05-09T10:01:21.947960 #243109] INFO -- : [445/885] 283997=test_method_cache I, [2024-05-09T10:01:21.958937 #243109] INFO -- : [446/885] 283997=locals_test I, [2024-05-09T10:01:21.995325 #243109] INFO -- : [447/885] 283996=test_gem_commands_push_command I, [2024-05-09T10:01:22.089894 #243109] INFO -- : [448/885] 283998=test_rdoc_markup_to_rdoc I, [2024-05-09T10:01:22.133569 #243109] INFO -- : [449/885] 283998=test_set I, [2024-05-09T10:01:22.141316 #243109] INFO -- : [450/885] 283998=test_http I, [2024-05-09T10:01:22.462472 #243109] INFO -- : [451/885] 283997=test_utf16 I, [2024-05-09T10:01:22.477801 #243109] INFO -- : [452/885] 283997=attribute_write_test I, [2024-05-09T10:01:22.499789 #243109] INFO -- : [453/885] 283997=test_gem_package_tar_writer I, [2024-05-09T10:01:22.720771 #243109] INFO -- : [454/885] 283997=test_str2big I, [2024-05-09T10:01:22.724691 #243109] INFO -- : [455/885] 283996=test_severity I, [2024-05-09T10:01:22.729867 #243109] INFO -- : [456/885] 283997=test_case I, [2024-05-09T10:01:22.740594 #243109] INFO -- : [457/885] 283997=test_ractor I, [2024-05-09T10:01:22.756577 #243109] INFO -- : [458/885] 283996=test_gem_remote_fetcher I, [2024-05-09T10:01:22.760215 #243109] INFO -- : [459/885] 283997=test_koi8 I, [2024-05-09T10:01:22.769119 #243109] INFO -- : [460/885] 283997=test_json_tree I, [2024-05-09T10:01:22.783408 #243109] INFO -- : [461/885] 283997=test_pkcs12 I, [2024-05-09T10:01:23.500680 #243109] INFO -- : [462/885] 283997=test_filter I, [2024-05-09T10:01:23.530677 #243109] INFO -- : [463/885] 283997=test_parser_events I, [2024-05-09T10:01:23.612782 #243109] INFO -- : [464/885] 283997=test_m17n I, [2024-05-09T10:01:23.702853 #243109] INFO -- : [465/885] 283997=test_method I, [2024-05-09T10:01:24.919971 #243109] INFO -- : [466/885] 283996=test_cclass I, [2024-05-09T10:01:25.066950 #243109] INFO -- : [467/885] 283996=test_gem_uninstaller I, [2024-05-09T10:01:26.387373 #243109] INFO -- : [468/885] 283996=test_yjit I, [2024-05-09T10:01:26.409611 #243109] INFO -- : [469/885] 283996=test_gem_dependency I, [2024-05-09T10:01:26.623830 #243109] INFO -- : [470/885] 283996=test_x509name I, [2024-05-09T10:01:26.640183 #243109] INFO -- : [471/885] 283996=test_yaml I, [2024-05-09T10:01:26.784654 #243109] INFO -- : [472/885] 283996=test_argf I, [2024-05-09T10:01:30.474409 #243109] INFO -- : [473/885] 283996=test_rdoc_class_module I, [2024-05-09T10:01:30.932799 #243109] INFO -- : [474/885] 283998=test_rdoc_cross_reference I, [2024-05-09T10:01:30.994058 #243109] INFO -- : [475/885] 283996=test_parse I, [2024-05-09T10:01:31.329360 #243109] INFO -- : [476/885] 283998=test_method_cache I, [2024-05-09T10:01:31.334159 #243109] INFO -- : [477/885] 283998=test_win32ole_variable I, [2024-05-09T10:01:31.340654 #243109] INFO -- : [478/885] 283998=test_numhash I, [2024-05-09T10:01:31.354332 #243109] INFO -- : [479/885] 283998=test_system I, [2024-05-09T10:01:31.506631 #243109] INFO -- : [480/885] 283996=test_pkey_rsa I, [2024-05-09T10:01:31.786751 #243109] INFO -- : [481/885] 283996=test_flush I, [2024-05-09T10:01:31.817656 #243109] INFO -- : [482/885] 283996=test_gem_specification I, [2024-05-09T10:01:32.246697 #243109] INFO -- : [483/885] 283998=test_gem_install_update_options I, [2024-05-09T10:01:32.398088 #243109] INFO -- : [484/885] 283998=test_econv I, [2024-05-09T10:01:33.309742 #243109] INFO -- : [485/885] 283998=warnings_test I, [2024-05-09T10:01:33.328408 #243109] INFO -- : [486/885] 283998=test_stringchar I, [2024-05-09T10:01:33.415964 #243109] INFO -- : [487/885] 283998=test_date_attr I, [2024-05-09T10:01:33.421211 #243109] INFO -- : [488/885] 283998=test_sizeof I, [2024-05-09T10:01:34.792647 #243109] INFO -- : [489/885] 283996=test_gem_request_set_lockfile_parser I, [2024-05-09T10:01:34.964122 #243109] INFO -- : [490/885] 283996=test_face I, [2024-05-09T10:01:34.996076 #243109] INFO -- : [491/885] 283996=test_windows_1252 I, [2024-05-09T10:01:35.289190 #243109] INFO -- : [492/885] 283996=test_stack I, [2024-05-09T10:01:35.933990 #243109] INFO -- : [493/885] 283998=test_sorted_set I, [2024-05-09T10:01:36.077901 #243109] INFO -- : [494/885] 283998=test_emoji I, [2024-05-09T10:01:36.106721 #243109] INFO -- : [495/885] 283998=test_mixed_unicode_escapes I, [2024-05-09T10:01:36.119608 #243109] INFO -- : [496/885] 283998=test_sleep I, [2024-05-09T10:01:36.145484 #243109] INFO -- : [497/885] 283996=test_fileutils I, [2024-05-09T10:01:36.300971 #243109] INFO -- : Leaked file descriptor: TestFileUtils#test_chown_error: 11 # I, [2024-05-09T10:01:36.332668 #243109] INFO -- : COMMAND PID USER FD TYPE DEVICE SIZE/OFF NODE NAME I, [2024-05-09T10:01:36.332743 #243109] INFO -- : ruby 283996 opc 11r REG 252,0 9253600 13705411 /var/lib/sss/mc/passwd I, [2024-05-09T10:01:36.702326 #243109] INFO -- : [498/885] 283996=test_gem_dependency_resolution_error I, [2024-05-09T10:01:36.709164 #243109] INFO -- : [499/885] 283996=test_condition I, [2024-05-09T10:01:36.721992 #243109] INFO -- : [500/885] 283996=test_gem_resolver_vendor_set I, [2024-05-09T10:01:36.759297 #243109] INFO -- : [501/885] 283996=test_cp949 I, [2024-05-09T10:01:36.771892 #243109] INFO -- : [502/885] 283996=test_jaro_winkler I, [2024-05-09T10:01:36.777171 #243109] INFO -- : [503/885] 283996=test_nil2vtempty I, [2024-05-09T10:01:36.784297 #243109] INFO -- : [504/885] 283996=test_date_time I, [2024-05-09T10:01:36.799753 #243109] INFO -- : [505/885] 283996=test_rdoc_generator_json_index I, [2024-05-09T10:01:36.875937 #243109] INFO -- : [506/885] 283996=test_pinned I, [2024-05-09T10:01:36.976598 #243109] INFO -- : [507/885] 283996=test_pack I, [2024-05-09T10:01:36.991432 #243109] INFO -- : [508/885] 283996=test_cgi_tag_helper I, [2024-05-09T10:01:37.001663 #243109] INFO -- : [509/885] 283996=test_inadvertent_creation I, [2024-05-09T10:01:37.091393 #243109] INFO -- : [510/885] 283996=test_ansi_with_terminfo I, [2024-05-09T10:01:37.098984 #243109] INFO -- : [511/885] 283996=test_coderange I, [2024-05-09T10:01:37.129089 #243109] INFO -- : [512/885] 283996=test_weakmap I, [2024-05-09T10:01:37.476028 #243109] INFO -- : [513/885] 283997=test_framework I, [2024-05-09T10:01:37.485421 #243109] INFO -- : [514/885] 283997=test_name_error I, [2024-05-09T10:01:37.571205 #243109] INFO -- : [515/885] 283997=json_addition_test I, [2024-05-09T10:01:37.585836 #243109] INFO -- : [516/885] 283997=test_gem_source_list I, [2024-05-09T10:01:37.669964 #243109] INFO -- : [517/885] 283997=test_gem_commands_sources_command I, [2024-05-09T10:01:37.879476 #243109] INFO -- : [518/885] 283997=test_yaml_special_cases I, [2024-05-09T10:01:37.891498 #243109] INFO -- : [519/885] 283997=test_recorder I, [2024-05-09T10:01:37.899198 #243109] INFO -- : [520/885] 283997=test_const I, [2024-05-09T10:01:37.907907 #243109] INFO -- : [521/885] 283997=index_write_test I, [2024-05-09T10:01:37.915506 #243109] INFO -- : [522/885] 283997=test_rdoc_parser_rd I, [2024-05-09T10:01:38.157343 #243109] INFO -- : [523/885] 283997=test_class I, [2024-05-09T10:01:38.167868 #243109] INFO -- : [524/885] 283998=test_exit I, [2024-05-09T10:01:38.438403 #243109] INFO -- : [525/885] 283998=test_sprintf I, [2024-05-09T10:01:38.460238 #243109] INFO -- : [526/885] 283998=test_safe_load I, [2024-05-09T10:01:38.470773 #243109] INFO -- : [527/885] 283998=comments_test I, [2024-05-09T10:01:38.476277 #243109] INFO -- : [528/885] 283998=test_qsort I, [2024-05-09T10:01:38.478382 #243109] INFO -- : [529/885] 283998=test_gc I, [2024-05-09T10:01:38.490424 #243109] INFO -- : [530/885] 283998=test_math I, [2024-05-09T10:01:38.507979 #243109] INFO -- : [531/885] 283998=test_libs I, [2024-05-09T10:01:38.520604 #243109] INFO -- : [532/885] 283998=test_iso_8859 I, [2024-05-09T10:01:38.583552 #243109] INFO -- : [533/885] 283998=ripper_test I, [2024-05-09T10:01:39.158399 #243109] INFO -- : [534/885] 283998=test_array I, [2024-05-09T10:01:39.171370 #243109] INFO -- : [535/885] 283998=test_rdoc_context I, [2024-05-09T10:01:39.874501 #243109] INFO -- : [536/885] 283998=test_gem_command_manager I, [2024-05-09T10:01:40.446393 #243109] INFO -- : [537/885] 283998=test_enumerator I, [2024-05-09T10:01:40.642080 #243109] INFO -- : [538/885] 283997=test_enc_associate I, [2024-05-09T10:01:41.203638 #243109] INFO -- : [539/885] 283997=test_open-uri I, [2024-05-09T10:01:41.616133 #243109] INFO -- : [540/885] 283997=test_case I, [2024-05-09T10:01:41.644701 #243109] INFO -- : [541/885] 283997=test_complex I, [2024-05-09T10:01:42.743303 #243109] INFO -- : [542/885] 283997=test_threadgroup I, [2024-05-09T10:01:42.852750 #243109] INFO -- : [543/885] 283997=test_dir_m17n I, [2024-05-09T10:01:43.984660 #243109] INFO -- : [544/885] 283997=test_memory_view I, [2024-05-09T10:01:44.893049 #243109] INFO -- : [545/885] 283997=test_array_create I, [2024-05-09T10:01:44.933082 #243109] INFO -- : [546/885] 283997=test_process I, [2024-05-09T10:01:44.948241 #243109] INFO -- : [547/885] 283997=test_forwardable I, [2024-05-09T10:01:44.963021 #243109] INFO -- : [548/885] 283997=test_fd_setsize I, [2024-05-09T10:01:44.964405 #243109] INFO -- : [549/885] 283997=!Nothing_to_test I, [2024-05-09T10:01:44.986906 #243109] INFO -- : [550/885] 283997=test_gem_rdoc I, [2024-05-09T10:01:45.143324 #243109] INFO -- : [551/885] 283997=test_dot_dot I, [2024-05-09T10:01:45.154670 #243109] INFO -- : [552/885] 283997=pattern_test I, [2024-05-09T10:01:45.217398 #243109] INFO -- : [553/885] 283997=test_kernel I, [2024-05-09T10:01:45.814556 #243109] INFO -- : [554/885] 283997=test_rendering I, [2024-05-09T10:01:45.834888 #243109] INFO -- : [555/885] 283997=test_gem_commands_install_command I, [2024-05-09T10:01:46.868741 #243109] INFO -- : [556/885] 283996=test_iterator I, [2024-05-09T10:01:46.934543 #243109] INFO -- : [557/885] 283996=test_string I, [2024-05-09T10:01:46.943329 #243109] INFO -- : [558/885] 283996=test_merge_keys I, [2024-05-09T10:01:46.951268 #243109] INFO -- : [559/885] 283996=test_method_name_check I, [2024-05-09T10:01:47.001849 #243109] INFO -- : [560/885] 283996=test_err_in_callback I, [2024-05-09T10:01:47.004248 #243109] INFO -- : [561/885] 283996=test_storage I, [2024-05-09T10:01:47.034776 #243109] INFO -- : [562/885] 283996=test_rdoc_extend I, [2024-05-09T10:01:47.056205 #243109] INFO -- : [563/885] 283996=test_cesu8 I, [2024-05-09T10:01:47.064834 #243109] INFO -- : [564/885] 283996=test_shapes I, [2024-05-09T10:01:47.073607 #243109] INFO -- : [565/885] 283996=test_did_you_mean I, [2024-05-09T10:01:47.151839 #243109] INFO -- : [566/885] 283996=test_raise_exception I, [2024-05-09T10:01:47.739419 #243109] INFO -- : [567/885] 283996=test_arith_seq_beg_len_step I, [2024-05-09T10:01:47.751060 #243109] INFO -- : [568/885] 283996=test_exception I, [2024-05-09T10:01:47.768657 #243109] INFO -- : [569/885] 283996=test_noarg I, [2024-05-09T10:01:47.893509 #243109] INFO -- : [570/885] 283996=test_gem_resolver_requirement_list I, [2024-05-09T10:01:47.900675 #243109] INFO -- : [571/885] 283996=memsize_test I, [2024-05-09T10:01:47.912003 #243109] INFO -- : [572/885] 283996=test_pp I, [2024-05-09T10:01:47.976937 #243109] INFO -- : [573/885] 283997=test_gem_impossible_dependencies_error I, [2024-05-09T10:01:47.992721 #243109] INFO -- : [574/885] 283997=test_gem_commands_pristine_command I, [2024-05-09T10:01:48.043111 #243109] INFO -- : [575/885] 283996=test_optarg I, [2024-05-09T10:01:48.108895 #243109] INFO -- : [576/885] 283996=test_rdoc_tom_doc I, [2024-05-09T10:01:48.140770 #243109] INFO -- : [577/885] 283996=test_hash I, [2024-05-09T10:01:48.157924 #243109] INFO -- : [578/885] 283996=test_variable I, [2024-05-09T10:01:48.262429 #243109] INFO -- : [579/885] 283996=test_erb I, [2024-05-09T10:01:48.349537 #243109] INFO -- : [580/885] 283996=test_date_ractor I, [2024-05-09T10:01:48.581123 #243109] INFO -- : [581/885] 283996=test_key_actor_emacs I, [2024-05-09T10:01:48.855528 #243109] INFO -- : [582/885] 283996=test_gem_security I, [2024-05-09T10:01:49.452135 #243109] INFO -- : [583/885] 283997=test_utf32 I, [2024-05-09T10:01:49.485437 #243109] INFO -- : [584/885] 283997=test_gem_resolver_git_specification I, [2024-05-09T10:01:49.772143 #243109] INFO -- : [585/885] 283997=test_basicinstructions I, [2024-05-09T10:01:49.839103 #243109] INFO -- : [586/885] 283997=test_assignment I, [2024-05-09T10:01:51.223218 #243109] INFO -- : [587/885] 283997=test_gem_update_suggestion I, [2024-05-09T10:01:51.225600 #243109] INFO -- : [588/885] 283997=test_normalize I, [2024-05-09T10:01:51.235928 #243109] INFO -- : [589/885] 283997=test_emoji_breaks I, [2024-05-09T10:01:51.244990 #243109] INFO -- : [590/885] 283997=test_verbose I, [2024-05-09T10:01:51.300003 #243109] INFO -- : [591/885] 283997=test_gem_commands_open_command I, [2024-05-09T10:01:51.404267 #243109] INFO -- : [592/885] 283997=test_asn1 I, [2024-05-09T10:01:51.430445 #243109] INFO -- : [593/885] 283997=test_gem_command I, [2024-05-09T10:01:51.591699 #243109] INFO -- : [594/885] 283997=test_rdoc_generator_darkfish I, [2024-05-09T10:01:51.903331 #243109] INFO -- : [595/885] 283997=test_gem_resolver_lock_set I, [2024-05-09T10:01:51.934485 #243109] INFO -- : [596/885] 283997=test_random I, [2024-05-09T10:01:51.943058 #243109] INFO -- : [597/885] 283997=test_undef I, [2024-05-09T10:01:51.963660 #243109] INFO -- : [598/885] 283997=test_show_source I, [2024-05-09T10:01:51.981330 #243109] INFO -- : [599/885] 283997=test_remote_fetch_error I, [2024-05-09T10:01:52.002595 #243109] INFO -- : [600/885] 283997=test_yield I, [2024-05-09T10:01:53.429789 #243109] INFO -- : [601/885] 283996=regexp_test I, [2024-05-09T10:01:53.466762 #243109] INFO -- : [602/885] 283996=test_rdoc_store I, [2024-05-09T10:01:54.147990 #243109] INFO -- : [603/885] 283996=test_shift_jis I, [2024-05-09T10:01:54.158868 #243109] INFO -- : [604/885] 283996=test_force_exit I, [2024-05-09T10:01:54.173995 #243109] INFO -- : [605/885] 283996=test_optimization I, [2024-05-09T10:01:54.930510 #243109] INFO -- : [606/885] 283997=test_rubyoptions I, [2024-05-09T10:02:01.011794 #243109] INFO -- : [607/885] 283996=test_data_error I, [2024-05-09T10:02:01.021899 #243109] INFO -- : [608/885] 283996=test_rdoc_stats I, [2024-05-09T10:02:01.063595 #243109] INFO -- : [609/885] 283996=test_files_sample I, [2024-05-09T10:02:01.136558 #243109] INFO -- : [610/885] 283996=test_enc_raise I, [2024-05-09T10:02:01.146298 #243109] INFO -- : [611/885] 283996=test_clone I, [2024-05-09T10:02:01.243977 #243109] INFO -- : [612/885] 283997=test_cgi_util I, [2024-05-09T10:02:01.302748 #243109] INFO -- : [613/885] 283996=test_ole_methods I, [2024-05-09T10:02:01.307531 #243109] INFO -- : [614/885] 283996=test_prettyprint I, [2024-05-09T10:02:01.376186 #243109] INFO -- : [615/885] 283996=test_gem_uri_formatter I, [2024-05-09T10:02:01.404733 #243109] INFO -- : [616/885] 283996=test_dryrun I, [2024-05-09T10:02:01.474536 #243109] INFO -- : [617/885] 283997=test_rdoc_i18n_locale I, [2024-05-09T10:02:01.489000 #243109] INFO -- : [618/885] 283997=test_gc_compact I, [2024-05-09T10:02:01.508547 #243109] INFO -- : [619/885] 283996=test_boolean I, [2024-05-09T10:02:01.535356 #243109] INFO -- : [620/885] 283996=test_gem_resolver_lock_specification I, [2024-05-09T10:02:01.568116 #243109] INFO -- : [621/885] 283996=test_queue I, [2024-05-09T10:02:01.585482 #243109] INFO -- : [622/885] 283996=test_hash_create I, [2024-05-09T10:02:01.610946 #243109] INFO -- : [623/885] 283996=test_grapheme_breaks I, [2024-05-09T10:02:01.630504 #243109] INFO -- : [624/885] 283996=static_literals_test I, [2024-05-09T10:02:01.641388 #243109] INFO -- : [625/885] 283996=test_tree_spell_checker I, [2024-05-09T10:02:01.719693 #243109] INFO -- : [626/885] 283996=test_set I, [2024-05-09T10:02:01.759109 #243109] INFO -- : [627/885] 283996=test_rdoc_method_attr I, [2024-05-09T10:02:01.874046 #243109] INFO -- : [628/885] 283996=test_enumerable I, [2024-05-09T10:02:01.896474 #243109] INFO -- : [629/885] 283996=test_gem_commands_dependency_command I, [2024-05-09T10:02:02.008223 #243109] INFO -- : [630/885] 283996=test_gbk I, [2024-05-09T10:02:02.017239 #243109] INFO -- : [631/885] 283996=test_backtrace I, [2024-05-09T10:02:02.029112 #243109] INFO -- : [632/885] 283996=test_switch_hitter I, [2024-05-09T10:02:02.087900 #243109] INFO -- : [633/885] 283996=test_default_gems I, [2024-05-09T10:02:02.171188 #243109] INFO -- : [634/885] 283996=test_unicode_escape I, [2024-05-09T10:02:02.190401 #243109] INFO -- : [635/885] 283996=test_gem_spec_fetcher I, [2024-05-09T10:02:02.412293 #243109] INFO -- : [636/885] 283996=test_yamldbm I, [2024-05-09T10:02:02.424719 #243109] INFO -- : [637/885] 283996=test_buffering I, [2024-05-09T10:02:02.434522 #243109] INFO -- : [638/885] 283996=test_svcb_https I, [2024-05-09T10:02:02.462994 #243109] INFO -- : [639/885] 283996=test_pkey_ec I, [2024-05-09T10:02:02.480728 #243109] INFO -- : [640/885] 283996=test_thread I, [2024-05-09T10:02:02.500898 #243109] INFO -- : [641/885] 283996=test_arity I, [2024-05-09T10:02:02.606099 #243109] INFO -- : [642/885] 283996=test_date_parse I, [2024-05-09T10:02:02.699540 #243109] INFO -- : [643/885] 283996=test_open3 I, [2024-05-09T10:02:05.470342 #243109] INFO -- : [644/885] 283996=test_mdns I, [2024-05-09T10:02:05.472770 #243109] INFO -- : [645/885] 283996=test_key_event_record I, [2024-05-09T10:02:05.488670 #243109] INFO -- : [646/885] 283996=test_webauthn_listener I, [2024-05-09T10:02:05.637565 #243109] INFO -- : [647/885] 283996=test_gem_resolver_api_specification I, [2024-05-09T10:02:05.689589 #243109] INFO -- : [648/885] 283996=test_rdoc_rubygems_hook I, [2024-05-09T10:02:05.693984 #243109] INFO -- : [649/885] 283997=test_ractor I, [2024-05-09T10:02:05.726084 #243109] INFO -- : [650/885] 283997=test_gem_ext_cargo_builder_unit I, [2024-05-09T10:02:05.750771 #243109] INFO -- : [651/885] 283997=test_case_mapping I, [2024-05-09T10:02:05.767005 #243109] INFO -- : [652/885] 283997=test_rational I, [2024-05-09T10:02:05.776970 #243109] INFO -- : [653/885] 283996=test_rdoc_i18n_text I, [2024-05-09T10:02:05.789484 #243109] INFO -- : [654/885] 283997=test_io I, [2024-05-09T10:02:05.803283 #243109] INFO -- : [655/885] 283996=test_input_method I, [2024-05-09T10:02:05.924943 #243109] INFO -- : [656/885] 283996=test_gem_util I, [2024-05-09T10:02:05.992347 #243109] INFO -- : [657/885] 283997=test_complex2 I, [2024-05-09T10:02:06.030697 #243109] INFO -- : [658/885] 283997=test_config I, [2024-05-09T10:02:06.032201 #243109] INFO -- : [659/885] 283996=test_gem_security_signer I, [2024-05-09T10:02:06.081838 #243109] INFO -- : [660/885] 283997=test_thread I, [2024-05-09T10:02:06.175465 #243109] INFO -- : [661/885] 283996=test_literal I, [2024-05-09T10:02:06.319387 #243109] INFO -- : [662/885] 283997=test_gem_unsatisfiable_dependency_error I, [2024-05-09T10:02:06.346613 #243109] INFO -- : [663/885] 283997=test_gem_platform I, [2024-05-09T10:02:06.507644 #243109] INFO -- : [664/885] 283997=test_gem_commands_query_command I, [2024-05-09T10:02:06.674856 #243109] INFO -- : [665/885] 283996=test_bigzero I, [2024-05-09T10:02:06.698584 #243109] INFO -- : [666/885] 283996=test_external_new I, [2024-05-09T10:02:06.700818 #243109] INFO -- : [667/885] 283996=test_pkey I, [2024-05-09T10:02:06.713937 #243109] INFO -- : [668/885] 283996=test_win32ole_typelib I, [2024-05-09T10:02:06.772101 #243109] INFO -- : [669/885] 283996=test_m17n_comb I, [2024-05-09T10:02:07.096749 #243109] INFO -- : [670/885] 283998=test_pkey_dh I, [2024-05-09T10:02:07.187669 #243109] INFO -- : [671/885] 283997=test_multi_irb_commands I, [2024-05-09T10:02:07.198931 #243109] INFO -- : [672/885] 283997=test_memory_view I, [2024-05-09T10:02:07.219115 #243109] INFO -- : [673/885] 283997=test_data I, [2024-05-09T10:02:07.279739 #243109] INFO -- : [674/885] 283997=test_ractor I, [2024-05-09T10:02:07.297559 #243109] INFO -- : [675/885] 283997=test_null I, [2024-05-09T10:02:07.313177 #243109] INFO -- : [676/885] 283997=test_rdoc_alias I, [2024-05-09T10:02:07.706636 #243109] INFO -- : [677/885] 283997=test_instrumentation_api I, [2024-05-09T10:02:08.460248 #243109] INFO -- : [678/885] 283998=test_weakref I, [2024-05-09T10:02:08.742370 #243109] INFO -- : [679/885] 283998=test_rdoc_markup_raw I, [2024-05-09T10:02:08.743477 #243109] INFO -- : [680/885] 283998=test_rdoc_markup_to_bs I, [2024-05-09T10:02:08.786888 #243109] INFO -- : [681/885] 283998=test_key_name_check I, [2024-05-09T10:02:08.794591 #243109] INFO -- : [682/885] 283998=test_timeout I, [2024-05-09T10:02:09.593859 #243109] INFO -- : [683/885] 283996=test_word I, [2024-05-09T10:02:09.604183 #243109] INFO -- : [684/885] 283996=test_rdoc_require I, [2024-05-09T10:02:09.620110 #243109] INFO -- : [685/885] 283998=test_gem_ext_rake_builder I, [2024-05-09T10:02:09.630594 #243109] INFO -- : [686/885] 283996=test_numeric I, [2024-05-09T10:02:09.643481 #243109] INFO -- : [687/885] 283996=test_fstring I, [2024-05-09T10:02:09.758271 #243109] INFO -- : [688/885] 283996=test_singleton I, [2024-05-09T10:02:09.777513 #243109] INFO -- : [689/885] 283996=test_gem_commands_cert_command I, [2024-05-09T10:02:10.232956 #243109] INFO -- : [690/885] 283998=json_parser_test I, [2024-05-09T10:02:10.280680 #243109] INFO -- : [691/885] 283997=test_date_strftime I, [2024-05-09T10:02:10.324643 #243109] INFO -- : [692/885] 283998=test_ws I, [2024-05-09T10:02:10.338773 #243109] INFO -- : [693/885] 283998=test_rdoc_markup_to_tt_only I, [2024-05-09T10:02:10.376837 #243109] INFO -- : [694/885] 283998=ruby_parser_test I, [2024-05-09T10:02:10.378286 #243109] INFO -- : [695/885] 283998=test_gem_commands_stale_command I, [2024-05-09T10:02:10.408031 #243109] INFO -- : [696/885] 283998=test_pack I, [2024-05-09T10:02:10.589455 #243109] INFO -- : [697/885] 283998=test_pkcs7 I, [2024-05-09T10:02:10.678631 #243109] INFO -- : [698/885] 283997=test_gem_commands_environment_command I, [2024-05-09T10:02:10.744351 #243109] INFO -- : [699/885] 283998=test_basicsocket I, [2024-05-09T10:02:10.751333 #243109] INFO -- : [700/885] 283997=test_zsh_completion I, [2024-05-09T10:02:10.761557 #243109] INFO -- : [701/885] 283997=test_scalar I, [2024-05-09T10:02:10.764723 #243109] INFO -- : [702/885] 283997=test_syntax I, [2024-05-09T10:02:10.780084 #243109] INFO -- : [703/885] 283998=test_class_name_check I, [2024-05-09T10:02:10.816031 #243109] INFO -- : [704/885] 283998=test_div I, [2024-05-09T10:02:10.818082 #243109] INFO -- : [705/885] 283998=test_files_test_2 I, [2024-05-09T10:02:10.838180 #243109] INFO -- : [706/885] 283998=test_rdoc_markup_to_html_crossref I, [2024-05-09T10:02:11.160614 #243109] INFO -- : [707/885] 283998=test_exception I, [2024-05-09T10:02:11.665983 #243109] INFO -- : [708/885] 283996=test_bash_completion I, [2024-05-09T10:02:11.670196 #243109] INFO -- : [709/885] 283996=test_optparse I, [2024-05-09T10:02:11.678869 #243109] INFO -- : [710/885] 283996=test_deprecated I, [2024-05-09T10:02:11.687819 #243109] INFO -- : [711/885] 283996=test_io_buffer I, [2024-05-09T10:02:11.806999 #243109] INFO -- : [712/885] 283996=test_rdoc_context_section I, [2024-05-09T10:02:11.828334 #243109] INFO -- : [713/885] 283996=test_ns_spki I, [2024-05-09T10:02:12.167669 #243109] INFO -- : [714/885] 283996=test_have_library I, [2024-05-09T10:02:12.701861 #243109] INFO -- : [715/885] 283996=test_stream I, [2024-05-09T10:02:12.716831 #243109] INFO -- : [716/885] 283996=test_iseq_load I, [2024-05-09T10:02:13.932122 #243109] INFO -- : [717/885] 283996=test_rdoc_markup_parser I, [2024-05-09T10:02:14.004716 #243109] INFO -- : [718/885] 283996=test_rdoc_markup_indented_paragraph I, [2024-05-09T10:02:14.019071 #243109] INFO -- : [719/885] 283996=library_symbols_test I, [2024-05-09T10:02:14.029373 #243109] INFO -- : [720/885] 283996=test_rdoc_text I, [2024-05-09T10:02:14.107122 #243109] INFO -- : [721/885] 283996=test_objspace I, [2024-05-09T10:02:15.624112 #243109] INFO -- : [722/885] 283998=test_stringify_symbols I, [2024-05-09T10:02:15.628209 #243109] INFO -- : [723/885] 283998=test_require I, [2024-05-09T10:02:15.638619 #243109] INFO -- : [724/885] 283998=test_rdoc_markup_to_html_snippet I, [2024-05-09T10:02:15.716260 #243109] INFO -- : [725/885] 283998=test_common I, [2024-05-09T10:02:15.952721 #243109] INFO -- : [726/885] 283998=test_generic I, [2024-05-09T10:02:15.979492 #243109] INFO -- : [727/885] 283998=test_rdoc_constant I, [2024-05-09T10:02:16.060111 #243109] INFO -- : [728/885] 283998=test_deprecate I, [2024-05-09T10:02:16.107340 #243109] INFO -- : [729/885] 283998=test_httpresponses I, [2024-05-09T10:02:16.119612 #243109] INFO -- : [730/885] 283998=test_rdoc_markdown I, [2024-05-09T10:02:16.373433 #243109] INFO -- : [731/885] 283998=test_gem_request_set_lockfile I, [2024-05-09T10:02:16.867399 #243109] INFO -- : [732/885] 283998=test_postponed_job I, [2024-05-09T10:02:17.148297 #243109] INFO -- : [733/885] 283998=test_key_actor_vi I, [2024-05-09T10:02:17.243124 #243109] INFO -- : [734/885] 283998=test_win32ole_variant_outarg I, [2024-05-09T10:02:17.243292 #243109] INFO -- : [735/885] 283998=test_rdoc_encoding I, [2024-05-09T10:02:17.368599 #243109] INFO -- : [736/885] 283998=test_euc_kr I, [2024-05-09T10:02:17.370756 #243109] INFO -- : [737/885] 283998=test_provider I, [2024-05-09T10:02:17.387205 #243109] INFO -- : [738/885] 283998=test_gem_source_specific_file I, [2024-05-09T10:02:17.486856 #243109] INFO -- : [739/885] 283998=test_bmethod I, [2024-05-09T10:02:17.541087 #243109] INFO -- : [740/885] 283998=test_process I, [2024-05-09T10:02:22.227347 #243109] INFO -- : [741/885] 283997=test_rdoc_code_object I, [2024-05-09T10:02:22.663924 #243109] INFO -- : [742/885] 283997=test_rdoc_markup_attributes I, [2024-05-09T10:02:22.674926 #243109] INFO -- : [743/885] 283997=test_string_processing I, [2024-05-09T10:02:22.686416 #243109] INFO -- : [744/885] 283997=test_random_formatter I, [2024-05-09T10:02:22.716433 #243109] INFO -- : [745/885] 283997=test_rand I, [2024-05-09T10:02:23.320035 #243109] INFO -- : [746/885] 283997=redundant_return_test I, [2024-05-09T10:02:23.351607 #243109] INFO -- : [747/885] 283997=test_rdoc_parser_changelog I, [2024-05-09T10:02:23.477605 #243109] INFO -- : [748/885] 283997=parameters_signature_test I, [2024-05-09T10:02:23.492781 #243109] INFO -- : [749/885] 283997=test_gem_dependency_list I, [2024-05-09T10:02:23.624050 #243109] INFO -- : [750/885] 283997=test_gem_commands_outdated_command I, [2024-05-09T10:02:23.681762 #243109] INFO -- : [751/885] 283997=test_securerandom I, [2024-05-09T10:02:23.695501 #243109] INFO -- : [752/885] 283997=test_typeddata I, [2024-05-09T10:02:23.971692 #243109] INFO -- : [753/885] 283997=test_gem_commands_fetch_command I, [2024-05-09T10:02:24.163767 #243109] INFO -- : [754/885] 283997=test_tsort I, [2024-05-09T10:02:24.212434 #243109] INFO -- : [755/885] 283997=parse_test I, [2024-05-09T10:02:26.957193 #243109] INFO -- : [756/885] 283997=test_io_wait I, [2024-05-09T10:02:27.331893 #243109] INFO -- : [757/885] 283997=test_pack I, [2024-05-09T10:02:27.501319 #243109] INFO -- : [758/885] 283997=test_rdoc_parser_c I, [2024-05-09T10:02:28.297036 #243109] INFO -- : [759/885] 283997=test_kwargs I, [2024-05-09T10:02:28.307392 #243109] INFO -- : [760/885] 283997=test_len I, [2024-05-09T10:02:28.320055 #243109] INFO -- : [761/885] 283997=json_fixtures_test I, [2024-05-09T10:02:28.340417 #243109] INFO -- : [762/885] 283997=test_gem_doctor I, [2024-05-09T10:02:28.423647 #243109] INFO -- : [763/885] 283997=test_gem_requirement I, [2024-05-09T10:02:28.663129 #243109] INFO -- : [764/885] 283997=test_integer I, [2024-05-09T10:02:28.700277 #243109] INFO -- : [765/885] 283997=test_gem_name_tuple I, [2024-05-09T10:02:28.727117 #243109] INFO -- : [766/885] 283997=test_rdoc_markup_to_table_of_contents I, [2024-05-09T10:02:28.769989 #243109] INFO -- : [767/885] 283997=parse_comments_test I, [2024-05-09T10:02:28.780272 #243109] INFO -- : [768/885] 283997=test_tcp I, [2024-05-09T10:02:28.864213 #243109] INFO -- : [769/885] 283997=test_win32ole_method_event I, [2024-05-09T10:02:28.970710 #243109] INFO -- : [770/885] 283997=test_gem_commands_server_command I, [2024-05-09T10:02:28.986078 #243109] INFO -- : [771/885] 283997=test_function I, [2024-05-09T10:02:29.272642 #243109] INFO -- : [772/885] 283997=test_gem_resolver_activation_request I, [2024-05-09T10:02:29.292788 #243109] INFO -- : [773/885] 283997=test_pipe I, [2024-05-09T10:02:29.412271 #243109] INFO -- : [774/885] 283997=test_macro I, [2024-05-09T10:02:29.440968 #243109] INFO -- : [775/885] 283997=test_string I, [2024-05-09T10:02:34.920467 #243109] INFO -- : [776/885] 283998=test_find I, [2024-05-09T10:02:35.111344 #243109] INFO -- : [777/885] 283998=test_constant I, [2024-05-09T10:02:36.786265 #243109] INFO -- : [778/885] 283998=test_rdoc_generator_markup I, [2024-05-09T10:02:36.796865 #243109] INFO -- : [779/885] 283998=test_encoding I, [2024-05-09T10:02:36.981838 #243109] INFO -- : [780/885] 283998=test_hmac I, [2024-05-09T10:02:37.000603 #243109] INFO -- : [781/885] 283998=test_gem_commands_owner_command I, [2024-05-09T10:02:37.692251 #243109] INFO -- : [782/885] 283998=test_nextafter I, [2024-05-09T10:02:37.833054 #243109] INFO -- : [783/885] 283998=test_capacity I, [2024-05-09T10:02:37.840413 #243109] INFO -- : [784/885] 283998=test_file I, [2024-05-09T10:02:37.856866 #243109] INFO -- : [785/885] 283998=test_time I, [2024-05-09T10:02:37.982257 #243109] INFO -- : [786/885] 283998=test_bug-3571 I, [2024-05-09T10:02:37.993332 #243109] INFO -- : [787/885] 283998=test_yamlstore I, [2024-05-09T10:02:38.017401 #243109] INFO -- : [788/885] 283998=test_numeric I, [2024-05-09T10:02:38.273683 #243109] INFO -- : [789/885] 283998=test_flags I, [2024-05-09T10:02:38.668989 #243109] INFO -- : [790/885] 283998=test_gem_request_connection_pools I, [2024-05-09T10:02:39.733211 #243109] INFO -- : [791/885] 283998=test_init I, [2024-05-09T10:02:40.042016 #243109] INFO -- : [792/885] 283998=test_rat I, [2024-05-09T10:02:40.069928 #243109] INFO -- : [793/885] 283998=test_rdoc_options I, [2024-05-09T10:02:40.329129 #243109] INFO -- : [794/885] 283998=test_zlib I, [2024-05-09T10:02:49.828279 #243109] INFO -- : [795/885] 283998=test_gem_commands_unpack_command I, [2024-05-09T10:02:50.213644 #243109] INFO -- : [796/885] 283998=test_proc I, [2024-05-09T10:02:51.096009 #243109] INFO -- : [797/885] 283998=test_console_attr I, [2024-05-09T10:02:51.130551 #243109] INFO -- : [798/885] 283998=test_gem_ext_cargo_builder I, [2024-05-09T10:02:51.136181 #243109] INFO -- : [799/885] 283998=test_date_compat I, [2024-05-09T10:02:51.147638 #243109] INFO -- : [800/885] 283998=test_gem_version_option I, [2024-05-09T10:02:51.206493 #243109] INFO -- : [801/885] 283998=test_win32ole_record I, [2024-05-09T10:02:51.226517 #243109] INFO -- : [802/885] 283998=test_rdoc_include I, [2024-05-09T10:02:51.258735 #243109] INFO -- : [803/885] 283998=test_pstore I, [2024-05-09T10:02:51.506583 #243109] INFO -- : [804/885] 283998=test_ubf_async_safe I, [2024-05-09T10:02:51.574583 #243109] INFO -- : [805/885] 283998=test_c_struct_builder I, [2024-05-09T10:02:51.872539 #243109] INFO -- : [806/885] 283998=test_yield_block I, [2024-05-09T10:02:51.878665 #243109] INFO -- : [807/885] 283998=test_bug-5832 I, [2024-05-09T10:02:51.889923 #243109] INFO -- : [808/885] 283998=test_gem_uri I, [2024-05-09T10:02:51.935295 #243109] INFO -- : [809/885] 283998=test_resource I, [2024-05-09T10:02:51.957459 #243109] INFO -- : [810/885] 283998=test_gem_package_tar_reader_entry I, [2024-05-09T10:02:52.301106 #243109] INFO -- : [811/885] 283998=test_spell_checker I, [2024-05-09T10:02:52.315103 #243109] INFO -- : [812/885] 283998=test_gem_version I, [2024-05-09T10:02:52.456945 #243109] INFO -- : [813/885] 283998=test_gem_ext_ext_conf_builder I, [2024-05-09T10:02:53.540699 #243109] INFO -- : [814/885] 283998=test_frozen_error I, [2024-05-09T10:02:53.551718 #243109] INFO -- : [815/885] 283998=test_reqarg I, [2024-05-09T10:02:53.914103 #243109] INFO -- : [816/885] 283998=test_enumerator I, [2024-05-09T10:02:53.920230 #243109] INFO -- : [817/885] 283998=test_path_to_class I, [2024-05-09T10:02:53.936170 #243109] INFO -- : [818/885] 283998=test_defined I, [2024-05-09T10:02:54.014078 #243109] INFO -- : [819/885] 283998=test_passing_block I, [2024-05-09T10:02:54.023475 #243109] INFO -- : [820/885] 283998=test_nowrite I, [2024-05-09T10:02:54.065802 #243109] INFO -- : [821/885] 283998=test_thread_queue I, [2024-05-09T10:03:00.821850 #243109] INFO -- : [822/885] 283998=test_kdf I, [2024-05-09T10:03:00.879010 #243109] INFO -- : [823/885] 283998=test_ldap I, [2024-05-09T10:03:00.890506 #243109] INFO -- : [824/885] 283998=test_io_buffer I, [2024-05-09T10:03:00.954765 #243109] INFO -- : [825/885] 283998=test_io_timeout I, [2024-05-09T10:03:00.969886 #243109] INFO -- : [826/885] 283998=test_rdoc_normal_module I, [2024-05-09T10:03:01.012786 #243109] INFO -- : [827/885] 283998=test_type_completor I, [2024-05-09T10:03:01.087684 #243109] INFO -- : [828/885] 283998=test_rdoc_markdown_test I, [2024-05-09T10:03:02.242027 #243109] INFO -- : [829/885] 283998=test_yjit_exit_locations I, [2024-05-09T10:03:02.252135 #243109] INFO -- : [830/885] 283998=test_rdoc_rdoc I, [2024-05-09T10:03:02.342285 #243109] INFO -- : [831/885] 283998=test_comparable I, [2024-05-09T10:03:02.361571 #243109] INFO -- : [832/885] 283998=test_gem_config_file I, [2024-05-09T10:03:02.616978 #243109] INFO -- : [833/885] 283998=json_string_matching_test I, [2024-05-09T10:03:02.632835 #243109] INFO -- : [834/885] 283998=test_pkey_dsa I, [2024-05-09T10:03:05.088629 #243109] INFO -- : [835/885] 283996=test_logger I, [2024-05-09T10:03:05.131903 #243109] INFO -- : [836/885] 283996=test_gem_resolver_specification I, [2024-05-09T10:03:05.155069 #243109] INFO -- : [837/885] 283996=test_big2str I, [2024-05-09T10:03:05.164700 #243109] INFO -- : [838/885] 283996=test_euc_tw I, [2024-05-09T10:03:05.191677 #243109] INFO -- : [839/885] 283996=test_command I, [2024-05-09T10:03:05.535801 #243109] INFO -- : [840/885] 283996=test_gem_resolver_dependency_request I, [2024-05-09T10:03:06.079373 #243109] INFO -- : [841/885] 283996=test_cstr I, [2024-05-09T10:03:06.248618 #243109] INFO -- : [842/885] 283998=test_yaml_tree I, [2024-05-09T10:03:06.278319 #243109] INFO -- : [843/885] 283998=test_gem_commands_yank_command I, [2024-05-09T10:03:06.818093 #243109] INFO -- : [844/885] 283998=test_nil I, [2024-05-09T10:03:06.828957 #243109] INFO -- : [845/885] 283998=test_psych I, [2024-05-09T10:03:06.854875 #243109] INFO -- : [846/885] 283998=test_human_typo I, [2024-05-09T10:03:06.930570 #243109] INFO -- : [847/885] 283998=test_import I, [2024-05-09T10:03:07.911208 #243109] INFO -- : [848/885] 283996=test_wait I, [2024-05-09T10:03:07.968933 #243109] INFO -- : [849/885] 283996=version_test I, [2024-05-09T10:03:07.971184 #243109] INFO -- : [850/885] 283996=test_raise I, [2024-05-09T10:03:07.972724 #243109] INFO -- : [851/885] 283996=test_complexrational I, [2024-05-09T10:03:07.983780 #243109] INFO -- : [852/885] 283996=test_function_entry I, [2024-05-09T10:03:08.014056 #243109] INFO -- : [853/885] 283996=test_error_highlight I, [2024-05-09T10:03:08.713242 #243109] INFO -- : [854/885] 283996=test_rdoc_any_method I, [2024-05-09T10:03:09.120664 #243109] INFO -- : [855/885] 283996=json_common_interface_test I, [2024-05-09T10:03:09.141444 #243109] INFO -- : [856/885] 283996=test_string I, [2024-05-09T10:03:09.167846 #243109] INFO -- : [857/885] 283996=reflection_test I, [2024-05-09T10:03:09.176725 #243109] INFO -- : [858/885] 283996=test_marshalable I, [2024-05-09T10:03:09.187684 #243109] INFO -- : [859/885] 283996=test_line_editor I, [2024-05-09T10:03:09.195796 #243109] INFO -- : [860/885] 283996=test_enumerator_kw I, [2024-05-09T10:03:09.204373 #243109] INFO -- : [861/885] 283996=test_help I, [2024-05-09T10:03:09.267811 #243109] INFO -- : [862/885] 283996=test_string_memory I, [2024-05-09T10:03:09.493114 #243109] INFO -- : [863/885] 283996=test_files_lib I, [2024-05-09T10:03:09.512733 #243109] INFO -- : [864/885] 283996=test_egrep_cpp I, [2024-05-09T10:03:09.611963 #243109] INFO -- : [865/885] 283996=test_frozen I, [2024-05-09T10:03:09.629660 #243109] INFO -- : [866/885] 283996=test_gem_resolver_index_specification I, [2024-05-09T10:03:09.690221 #243109] INFO -- : [867/885] 283996=test_serialize_subclasses I, [2024-05-09T10:03:09.706678 #243109] INFO -- : [868/885] 283996=test_date_conv I, [2024-05-09T10:03:09.718825 #243109] INFO -- : [869/885] 283996=test_rdoc_markup_verbatim I, [2024-05-09T10:03:09.735483 #243109] INFO -- : [870/885] 283996=test_webauthn_poller I, [2024-05-09T10:03:09.912875 #243109] INFO -- : [871/885] 283996=test_timeout I, [2024-05-09T10:03:09.922344 #243109] INFO -- : [872/885] 283996=test_rdoc_generator_pot_po_entry I, [2024-05-09T10:03:09.939340 #243109] INFO -- : [873/885] 283996=test_erb_m17n I, [2024-05-09T10:03:09.962639 #243109] INFO -- : [874/885] 283996=test_coverage I, [2024-05-09T10:03:10.049740 #243109] INFO -- : [875/885] 283998=test_http_request I, [2024-05-09T10:03:10.059663 #243109] INFO -- : [876/885] 283998=test_tempfile I, [2024-05-09T10:03:10.273790 #243109] INFO -- : [877/885] 283998=test_rdoc_markup_pre_process I, [2024-05-09T10:03:10.505212 #243109] INFO -- : [878/885] 283998=test_store I, [2024-05-09T10:03:10.717506 #243109] INFO -- : [879/885] 283996=test_fnmatch I, [2024-05-09T10:03:10.756169 #243109] INFO -- : [880/885] 283998=test_pathname I, [2024-05-09T10:03:10.837323 #243109] INFO -- : [881/885] 283996=test_gem_commands_update_command I, [2024-05-09T10:03:11.071466 #243109] INFO -- : [882/885] 283998=test_date I, [2024-05-09T10:03:11.079742 #243109] INFO -- : [883/885] 283998=test_big5 I, [2024-05-09T10:03:11.086137 #243109] INFO -- : [884/885] 283998=test_protect I, [2024-05-09T10:03:11.092115 #243109] INFO -- : [885/885] 283998=test_tree_builder I, [2024-05-09T10:03:26.549440 #243109] INFO -- : Finished tests in 225.229069s, 116.6013 tests/s, 41522.9217 assertions/s. E, [2024-05-09T10:03:26.549746 #243109] ERROR -- : Children under /tmp/rubytest.jwfsbq: E, [2024-05-09T10:03:26.549948 #243109] ERROR -- : * drwx------ 4 28 2024-05-09 10:01:12 +0000 gem_rebuild20240509-283997-gc65mm/ E, [2024-05-09T10:03:26.549969 #243109] ERROR -- : * drwxrwxr-x 2 40 2024-05-09 10:01:12 +0000 old/ E, [2024-05-09T10:03:26.550002 #243109] ERROR -- : * -rw-rw-r-- 1 4096 2024-05-09 10:01:12 +0000 rebuild_test_gem-1.0.0.gem E, [2024-05-09T10:03:26.550138 #243109] ERROR -- : * drwxrwxr-x 2 40 2024-05-09 10:01:12 +0000 new/ E, [2024-05-09T10:03:26.550173 #243109] ERROR -- : * -rw-rw-r-- 1 4096 2024-05-09 10:01:12 +0000 rebuild_test_gem-1.0.0.gem I, [2024-05-09T10:03:26.556069 #243109] INFO -- : 26262 tests, 9352169 assertions, 0 failures, 0 errors, 320 skips I, [2024-05-09T10:03:26.556103 #243109] INFO -- : I, [2024-05-09T10:03:26.556115 #243109] INFO -- : ruby -v: ruby 3.4.0dev (2024-05-09T09:53:28Z master 8b3280bebd) [aarch64-linux] I, [2024-05-09T10:03:26.557392 #243109] INFO -- : $$$[end] "make yes-test-all TESTOPTS='--stderr-on-failure' TESTS='-j3'" exit with 0. I, [2024-05-09T10:03:26.557550 #243109] INFO -- : $$$[beg] make yes-test-rubyspec MSPECOPT='--error-output stderr --debug -j' TESTS='-j3' I, [2024-05-09T10:03:26.687438 #243109] INFO -- : BASERUBY = /usr/local/bin/ruby --disable=gems I, [2024-05-09T10:03:26.687513 #243109] INFO -- : CC = gcc I, [2024-05-09T10:03:26.687525 #243109] INFO -- : LD = ld I, [2024-05-09T10:03:26.687534 #243109] INFO -- : LDSHARED = gcc -shared I, [2024-05-09T10:03:26.687546 #243109] INFO -- : CFLAGS = -O3 -fno-fast-math -ggdb3 -Wall -Wextra -Wdeprecated-declarations -Wdiv-by-zero -Wduplicated-cond -Wimplicit-function-declaration -Wimplicit-int -Wpointer-arith -Wwrite-strings -Wold-style-definition -Wimplicit-fallthrough=0 -Wmissing-noreturn -Wno-cast-function-type -Wno-constant-logical-operand -Wno-long-long -Wno-missing-field-initializers -Wno-overlength-strings -Wno-packed-bitfield-compat -Wno-parentheses-equality -Wno-self-assign -Wno-tautological-compare -Wno-unused-parameter -Wno-unused-value -Wsuggest-attribute=format -Wsuggest-attribute=noreturn -Wunused-variable -Wmisleading-indentation -Wundef I, [2024-05-09T10:03:26.687557 #243109] INFO -- : XCFLAGS = -U_FORTIFY_SOURCE -D_FORTIFY_SOURCE=2 -fstack-protector-strong -msign-return-address=all -fno-strict-overflow -fvisibility=hidden -fexcess-precision=standard -DRUBY_EXPORT -fPIE -I. -I.ext/include/aarch64-linux -I/home/opc/ruby/src/master/include -I/home/opc/ruby/src/master -I/home/opc/ruby/src/master/prism -I/home/opc/ruby/src/master/enc/unicode/15.0.0 I, [2024-05-09T10:03:26.687566 #243109] INFO -- : CPPFLAGS = I, [2024-05-09T10:03:26.687576 #243109] INFO -- : DLDFLAGS = -Wl,--compress-debug-sections=zlib -fstack-protector-strong -pie I, [2024-05-09T10:03:26.687585 #243109] INFO -- : SOLIBS = -lz -lrt -lrt -ldl -lcrypt -lm -lpthread I, [2024-05-09T10:03:26.687593 #243109] INFO -- : LANG = en_US.UTF-8 I, [2024-05-09T10:03:26.687601 #243109] INFO -- : LC_ALL = I, [2024-05-09T10:03:26.687609 #243109] INFO -- : LC_CTYPE = I, [2024-05-09T10:03:26.687617 #243109] INFO -- : MFLAGS = I, [2024-05-09T10:03:26.687625 #243109] INFO -- : RUSTC = rustc I, [2024-05-09T10:03:26.687633 #243109] INFO -- : YJIT_RUSTC_ARGS = --crate-name=yjit --crate-type=staticlib --edition=2021 -g -C lto=thin -C opt-level=3 -C overflow-checks=on '--out-dir=/home/opc/ruby/build/master/yjit/target/release/' /home/opc/ruby/src/master/yjit/src/lib.rs I, [2024-05-09T10:03:26.688579 #243109] INFO -- : gcc (GCC) 8.5.0 20210514 (Red Hat 8.5.0-10.1.0.1) I, [2024-05-09T10:03:26.688605 #243109] INFO -- : Copyright (C) 2018 Free Software Foundation, Inc. I, [2024-05-09T10:03:26.688616 #243109] INFO -- : This is free software; see the source for copying conditions. There is NO I, [2024-05-09T10:03:26.688625 #243109] INFO -- : warranty; not even for MERCHANTABILITY or FITNESS FOR A PARTICULAR PURPOSE. I, [2024-05-09T10:03:26.688633 #243109] INFO -- : I, [2024-05-09T10:03:26.690685 #243109] INFO -- : generating enc.mk I, [2024-05-09T10:03:26.920978 #243109] INFO -- : generating encdb.h I, [2024-05-09T10:03:26.957535 #243109] INFO -- : encdb.h unchanged I, [2024-05-09T10:03:26.958847 #243109] INFO -- : making enc I, [2024-05-09T10:03:26.985990 #243109] INFO -- : make[1]: Entering directory '/home/opc/ruby/build/master' I, [2024-05-09T10:03:26.986040 #243109] INFO -- : make[1]: Nothing to be done for 'enc'. I, [2024-05-09T10:03:26.986052 #243109] INFO -- : make[1]: Leaving directory '/home/opc/ruby/build/master' I, [2024-05-09T10:03:26.986779 #243109] INFO -- : making srcs under enc I, [2024-05-09T10:03:27.028398 #243109] INFO -- : make[1]: Entering directory '/home/opc/ruby/build/master' I, [2024-05-09T10:03:27.028469 #243109] INFO -- : make[1]: Nothing to be done for 'srcs'. I, [2024-05-09T10:03:27.028479 #243109] INFO -- : make[1]: Leaving directory '/home/opc/ruby/build/master' I, [2024-05-09T10:03:27.029928 #243109] INFO -- : generating transdb.h I, [2024-05-09T10:03:27.173162 #243109] INFO -- : transdb.h unchanged I, [2024-05-09T10:03:27.174509 #243109] INFO -- : making trans I, [2024-05-09T10:03:27.224044 #243109] INFO -- : make[1]: Entering directory '/home/opc/ruby/build/master' I, [2024-05-09T10:03:27.224309 #243109] INFO -- : make[1]: Nothing to be done for 'trans'. I, [2024-05-09T10:03:27.224322 #243109] INFO -- : make[1]: Leaving directory '/home/opc/ruby/build/master' I, [2024-05-09T10:03:27.224921 #243109] INFO -- : making encs I, [2024-05-09T10:03:27.277173 #243109] INFO -- : make[1]: Entering directory '/home/opc/ruby/build/master' I, [2024-05-09T10:03:27.277243 #243109] INFO -- : make[1]: Nothing to be done for 'encs'. I, [2024-05-09T10:03:27.277254 #243109] INFO -- : make[1]: Leaving directory '/home/opc/ruby/build/master' I, [2024-05-09T10:03:27.279170 #243109] INFO -- : generating makefiles ext/configure-ext.mk I, [2024-05-09T10:03:27.319172 #243109] INFO -- : ext/configure-ext.mk updated I, [2024-05-09T10:03:27.322227 #243109] INFO -- : make[1]: Entering directory '/home/opc/ruby/build/master' I, [2024-05-09T10:03:29.381428 #243109] INFO -- : make[1]: Leaving directory '/home/opc/ruby/build/master' I, [2024-05-09T10:03:29.382116 #243109] INFO -- : generating makefile exts.mk I, [2024-05-09T10:03:29.440179 #243109] INFO -- : exts.mk unchanged I, [2024-05-09T10:03:29.445030 #243109] INFO -- : make[1]: Entering directory '/home/opc/ruby/build/master' I, [2024-05-09T10:03:29.740661 #243109] INFO -- : make[2]: Entering directory '/home/opc/ruby/build/master/ext/coverage' I, [2024-05-09T10:03:29.745371 #243109] INFO -- : make[2]: Leaving directory '/home/opc/ruby/build/master/ext/coverage' I, [2024-05-09T10:03:29.750963 #243109] INFO -- : make[2]: Entering directory '/home/opc/ruby/build/master/ext/date' I, [2024-05-09T10:03:29.756313 #243109] INFO -- : make[2]: Leaving directory '/home/opc/ruby/build/master/ext/date' I, [2024-05-09T10:03:29.759818 #243109] INFO -- : make[2]: Entering directory '/home/opc/ruby/build/master/ext/digest' I, [2024-05-09T10:03:29.768894 #243109] INFO -- : make[2]: Leaving directory '/home/opc/ruby/build/master/ext/digest' I, [2024-05-09T10:03:29.791226 #243109] INFO -- : make[2]: Entering directory '/home/opc/ruby/build/master/ext/digest/sha2' I, [2024-05-09T10:03:29.796332 #243109] INFO -- : make[2]: Leaving directory '/home/opc/ruby/build/master/ext/digest/sha2' I, [2024-05-09T10:03:29.814534 #243109] INFO -- : make[2]: Entering directory '/home/opc/ruby/build/master/ext/fiddle' I, [2024-05-09T10:03:29.824632 #243109] INFO -- : make[2]: Leaving directory '/home/opc/ruby/build/master/ext/fiddle' I, [2024-05-09T10:03:29.828843 #243109] INFO -- : make[2]: Entering directory '/home/opc/ruby/build/master/ext/io/console' I, [2024-05-09T10:03:29.833099 #243109] INFO -- : make[2]: Leaving directory '/home/opc/ruby/build/master/ext/io/console' I, [2024-05-09T10:03:29.843834 #243109] INFO -- : make[2]: Entering directory '/home/opc/ruby/build/master/ext/json' I, [2024-05-09T10:03:29.853109 #243109] INFO -- : make[2]: Leaving directory '/home/opc/ruby/build/master/ext/json' I, [2024-05-09T10:03:29.865923 #243109] INFO -- : make[2]: Entering directory '/home/opc/ruby/build/master/ext/monitor' I, [2024-05-09T10:03:29.870058 #243109] INFO -- : make[2]: Leaving directory '/home/opc/ruby/build/master/ext/monitor' I, [2024-05-09T10:03:29.875985 #243109] INFO -- : make[2]: Entering directory '/home/opc/ruby/build/master/ext/objspace' I, [2024-05-09T10:03:29.881832 #243109] INFO -- : make[2]: Leaving directory '/home/opc/ruby/build/master/ext/objspace' I, [2024-05-09T10:03:29.901591 #243109] INFO -- : make[2]: Entering directory '/home/opc/ruby/build/master/ext/openssl' I, [2024-05-09T10:03:29.923073 #243109] INFO -- : make[2]: Leaving directory '/home/opc/ruby/build/master/ext/openssl' I, [2024-05-09T10:03:29.927215 #243109] INFO -- : make[2]: Entering directory '/home/opc/ruby/build/master/ext/pathname' I, [2024-05-09T10:03:29.931309 #243109] INFO -- : make[2]: Leaving directory '/home/opc/ruby/build/master/ext/pathname' I, [2024-05-09T10:03:29.937477 #243109] INFO -- : make[2]: Entering directory '/home/opc/ruby/build/master/ext/psych' I, [2024-05-09T10:03:29.958604 #243109] INFO -- : make[2]: Leaving directory '/home/opc/ruby/build/master/ext/psych' I, [2024-05-09T10:03:29.963009 #243109] INFO -- : make[2]: Entering directory '/home/opc/ruby/build/master/ext/pty' I, [2024-05-09T10:03:29.967212 #243109] INFO -- : make[2]: Leaving directory '/home/opc/ruby/build/master/ext/pty' I, [2024-05-09T10:03:29.980313 #243109] INFO -- : make[2]: Entering directory '/home/opc/ruby/build/master/ext/ripper' I, [2024-05-09T10:03:29.988134 #243109] INFO -- : make[2]: Leaving directory '/home/opc/ruby/build/master/ext/ripper' I, [2024-05-09T10:03:29.990157 #243109] INFO -- : make[2]: Entering directory '/home/opc/ruby/build/master/ext/rubyvm' I, [2024-05-09T10:03:29.993830 #243109] INFO -- : make[2]: Leaving directory '/home/opc/ruby/build/master/ext/rubyvm' I, [2024-05-09T10:03:30.005900 #243109] INFO -- : make[2]: Entering directory '/home/opc/ruby/build/master/ext/socket' I, [2024-05-09T10:03:30.016626 #243109] INFO -- : make[2]: Leaving directory '/home/opc/ruby/build/master/ext/socket' I, [2024-05-09T10:03:30.031934 #243109] INFO -- : make[2]: Entering directory '/home/opc/ruby/build/master/.bundle/gems/bigdecimal-3.1.7/ext/bigdecimal' I, [2024-05-09T10:03:30.062178 #243109] INFO -- : make[2]: Leaving directory '/home/opc/ruby/build/master/.bundle/gems/bigdecimal-3.1.7/ext/bigdecimal' I, [2024-05-09T10:03:30.064784 #243109] INFO -- : make[2]: Entering directory '/home/opc/ruby/build/master/.bundle/gems/bigdecimal-3.1.8/ext/bigdecimal' I, [2024-05-09T10:03:30.095121 #243109] INFO -- : make[2]: Leaving directory '/home/opc/ruby/build/master/.bundle/gems/bigdecimal-3.1.8/ext/bigdecimal' I, [2024-05-09T10:03:30.097617 #243109] INFO -- : make[2]: Entering directory '/home/opc/ruby/build/master/.bundle/gems/debug-1.9.2/ext/debug' I, [2024-05-09T10:03:30.127417 #243109] INFO -- : make[2]: Leaving directory '/home/opc/ruby/build/master/.bundle/gems/debug-1.9.2/ext/debug' I, [2024-05-09T10:03:30.129883 #243109] INFO -- : make[2]: Entering directory '/home/opc/ruby/build/master/.bundle/gems/nkf-0.2.0/ext/nkf' I, [2024-05-09T10:03:30.159742 #243109] INFO -- : make[2]: Leaving directory '/home/opc/ruby/build/master/.bundle/gems/nkf-0.2.0/ext/nkf' I, [2024-05-09T10:03:30.162186 #243109] INFO -- : make[2]: Entering directory '/home/opc/ruby/build/master/.bundle/gems/racc-1.7.3/ext/racc/cparse' I, [2024-05-09T10:03:30.191900 #243109] INFO -- : make[2]: Leaving directory '/home/opc/ruby/build/master/.bundle/gems/racc-1.7.3/ext/racc/cparse' I, [2024-05-09T10:03:30.194849 #243109] INFO -- : make[2]: Entering directory '/home/opc/ruby/build/master/.bundle/gems/rbs-3.4.4/ext/rbs_extension' I, [2024-05-09T10:03:30.224809 #243109] INFO -- : make[2]: Leaving directory '/home/opc/ruby/build/master/.bundle/gems/rbs-3.4.4/ext/rbs_extension' I, [2024-05-09T10:03:30.227354 #243109] INFO -- : make[2]: Entering directory '/home/opc/ruby/build/master/.bundle/gems/syslog-0.1.2/ext/syslog' I, [2024-05-09T10:03:30.257033 #243109] INFO -- : make[2]: Leaving directory '/home/opc/ruby/build/master/.bundle/gems/syslog-0.1.2/ext/syslog' I, [2024-05-09T10:03:30.295112 #243109] INFO -- : make[2]: Entering directory '/home/opc/ruby/build/master' I, [2024-05-09T10:03:30.378008 #243109] INFO -- : make[2]: 'ruby' is up to date. I, [2024-05-09T10:03:30.378099 #243109] INFO -- : make[2]: Leaving directory '/home/opc/ruby/build/master' I, [2024-05-09T10:03:30.378285 #243109] INFO -- : make[1]: Leaving directory '/home/opc/ruby/build/master' I, [2024-05-09T10:03:30.382681 #243109] INFO -- : make[1]: Entering directory '/home/opc/ruby/build/master' I, [2024-05-09T10:03:30.382720 #243109] INFO -- : make[1]: Nothing to be done for 'note'. I, [2024-05-09T10:03:30.382731 #243109] INFO -- : make[1]: Leaving directory '/home/opc/ruby/build/master' E, [2024-05-09T10:03:30.457803 #243109] ERROR -- : $ /home/opc/ruby/build/master/miniruby -I/home/opc/ruby/src/master/lib /home/opc/ruby/src/master/tool/runruby.rb --archdir=/home/opc/ruby/build/master --extout=.ext -- /home/opc/ruby/src/master/spec/mspec/bin/mspec-run -B /home/opc/ruby/src/master/spec/default.mspec --error-output stderr --debug -fy -o /tmp/rubytest.dkdlpq/1-mspec-multi-0 E, [2024-05-09T10:03:30.458172 #243109] ERROR -- : $ /home/opc/ruby/build/master/miniruby -I/home/opc/ruby/src/master/lib /home/opc/ruby/src/master/tool/runruby.rb --archdir=/home/opc/ruby/build/master --extout=.ext -- /home/opc/ruby/src/master/spec/mspec/bin/mspec-run -B /home/opc/ruby/src/master/spec/default.mspec --error-output stderr --debug -fy -o /tmp/rubytest.dkdlpq/2-mspec-multi-1 E, [2024-05-09T10:03:30.458496 #243109] ERROR -- : $ /home/opc/ruby/build/master/miniruby -I/home/opc/ruby/src/master/lib /home/opc/ruby/src/master/tool/runruby.rb --archdir=/home/opc/ruby/build/master --extout=.ext -- /home/opc/ruby/src/master/spec/mspec/bin/mspec-run -B /home/opc/ruby/src/master/spec/default.mspec --error-output stderr --debug -fy -o /tmp/rubytest.dkdlpq/3-mspec-multi-2 I, [2024-05-09T10:03:30.591862 #243109] INFO -- : ruby 3.4.0dev (2024-05-09T09:53:28Z master 8b3280bebd) [aarch64-linux] I, [2024-05-09T10:03:35.905594 #243109] INFO -- : 0 ......................................................................... I, [2024-05-09T10:03:38.311677 #243109] INFO -- : 73 ......................................................................... I, [2024-05-09T10:03:38.490608 #243109] INFO -- : 146 ......................................................................... I, [2024-05-09T10:03:38.782229 #243109] INFO -- : 219 ......................................................................... I, [2024-05-09T10:03:38.938892 #243109] INFO -- : 292 ......................................................................... I, [2024-05-09T10:03:39.177694 #243109] INFO -- : 365 ......................................................................... I, [2024-05-09T10:03:39.299359 #243109] INFO -- : 438 ......................................................................... I, [2024-05-09T10:03:39.357232 #243109] INFO -- : 511 ......................................................................... I, [2024-05-09T10:03:39.418889 #243109] INFO -- : 584 ......................................................................... I, [2024-05-09T10:03:40.020943 #243109] INFO -- : 657 ......................................................................... I, [2024-05-09T10:03:40.116446 #243109] INFO -- : 730 ......................................................................... I, [2024-05-09T10:03:40.164240 #243109] INFO -- : 803 ......................................................................... I, [2024-05-09T10:03:40.362344 #243109] INFO -- : 876 ......................................................................... I, [2024-05-09T10:03:40.466067 #243109] INFO -- : 949 ......................................................................... I, [2024-05-09T10:03:41.066733 #243109] INFO -- : 1022 ......................................................................... I, [2024-05-09T10:03:43.326032 #243109] INFO -- : 1095 ......................................................................... I, [2024-05-09T10:03:44.121732 #243109] INFO -- : 1168 ......................................................................... I, [2024-05-09T10:03:44.319058 #243109] INFO -- : 1241 ......................................................................... I, [2024-05-09T10:03:44.496550 #243109] INFO -- : 1314 ......................................................................... I, [2024-05-09T10:03:44.590701 #243109] INFO -- : 1387 ......................................................................... I, [2024-05-09T10:03:46.632928 #243109] INFO -- : 1460 ......................................................................... I, [2024-05-09T10:03:49.931465 #243109] INFO -- : 1533 ......................................................................... I, [2024-05-09T10:03:50.071297 #243109] INFO -- : 1606 ......................................................................... I, [2024-05-09T10:03:50.898672 #243109] INFO -- : 1679 ......................................................................... I, [2024-05-09T10:03:51.234294 #243109] INFO -- : 1752 ......................................................................... I, [2024-05-09T10:03:51.522299 #243109] INFO -- : 1825 ......................................................................... I, [2024-05-09T10:03:51.842920 #243109] INFO -- : 1898 ......................................................................... I, [2024-05-09T10:03:52.236182 #243109] INFO -- : 1971 ......................................................................... I, [2024-05-09T10:03:52.750806 #243109] INFO -- : 2044 ......................................................................... I, [2024-05-09T10:03:52.838259 #243109] INFO -- : 2117 ......................................................................... I, [2024-05-09T10:03:52.902509 #243109] INFO -- : 2190 ......................................................................... I, [2024-05-09T10:03:52.950369 #243109] INFO -- : 2263 ......................................................................... I, [2024-05-09T10:03:52.998871 #243109] INFO -- : 2336 ......................................................................... I, [2024-05-09T10:03:53.092642 #243109] INFO -- : 2409 ......................................................................... I, [2024-05-09T10:03:53.367519 #243109] INFO -- : 2482 ......................................................................... I, [2024-05-09T10:03:53.502514 #243109] INFO -- : 2555 ......................................................................... I, [2024-05-09T10:03:54.679861 #243109] INFO -- : 2628 ......................................................................... I, [2024-05-09T10:03:54.856428 #243109] INFO -- : 2701 ......................................................................... I, [2024-05-09T10:03:54.998416 #243109] INFO -- : 2774 ......................................................................... I, [2024-05-09T10:03:55.345945 #243109] INFO -- : 2847 ......................................................................... I, [2024-05-09T10:03:55.597544 #243109] INFO -- : 2920 ......................................................................... I, [2024-05-09T10:03:55.718348 #243109] INFO -- : 2993 ......................................................................... I, [2024-05-09T10:03:55.780303 #243109] INFO -- : 3066 ......................................................................... I, [2024-05-09T10:03:55.832054 #243109] INFO -- : 3139 ......................................................................... I, [2024-05-09T10:03:55.886811 #243109] INFO -- : 3212 ......................................................................... I, [2024-05-09T10:03:55.956326 #243109] INFO -- : 3285 ......................................................................... I, [2024-05-09T10:03:59.806107 #243109] INFO -- : 3358 ........................................................................ I, [2024-05-09T10:03:59.806180 #243109] INFO -- : I, [2024-05-09T10:03:59.806192 #243109] INFO -- : Finished in 29.348323 seconds I, [2024-05-09T10:03:59.806201 #243109] INFO -- : I, [2024-05-09T10:03:59.806210 #243109] INFO -- : 3429 files, 32606 examples, 181338 expectations, 0 failures, 0 errors, 0 tagged I, [2024-05-09T10:03:59.807404 #243109] INFO -- : $$$[end] "make yes-test-rubyspec MSPECOPT='--error-output stderr --debug -j' TESTS='-j3'" exit with 0.