# Logfile created on 2024-05-07 13:55:28 +0000 by logger.rb/v1.5.3 I, [2024-05-07T13:55:28.605820 #197937] INFO -- : #, @formatter=nil, @logdev=#, @binmode=false, @mon_data=#, @mon_data_owner_object_id=860>>> I, [2024-05-07T13:55:28.606103 #197937] INFO -- : $$$[beg] make update-unicode -j3 I, [2024-05-07T13:55:28.695296 #197937] INFO -- : Downloading Unicode emoji 15.0 files... I, [2024-05-07T13:55:28.695464 #197937] INFO -- : Downloading Unicode emoji 15.0 files... I, [2024-05-07T13:55:28.695614 #197937] INFO -- : Downloading Unicode emoji 15.0 files... I, [2024-05-07T13:55:28.772768 #197937] INFO -- : made symlink emoji/15.0/emoji-sequences.txt to /home/opc/ruby/src/master/.downloaded-cache/emoji/15.0/emoji-sequences.txt I, [2024-05-07T13:55:28.774239 #197937] INFO -- : downloading emoji/15.0/emoji-test.txt ... /home/opc/ruby/src/master/enc/unicode/data/emoji/15.0/emoji-sequences.txt already exists I, [2024-05-07T13:55:28.775715 #197937] INFO -- : downloading emoji/15.0/emoji-test.txt ... /home/opc/ruby/src/master/enc/unicode/data/emoji/15.0/emoji-sequences.txt already exists E, [2024-05-07T13:55:29.349907 #197937] ERROR -- : /home/opc/ruby/src/master/tool/downloader.rb:302:in `rescue in download': failed to download emoji/15.0/emoji-test.txt (RuntimeError) E, [2024-05-07T13:55:29.349966 #197937] ERROR -- : OpenURI::HTTPError: 403 Forbidden: https://www.unicode.org/Public/emoji/15.0/emoji-test.txt E, [2024-05-07T13:55:29.349976 #197937] ERROR -- : from /home/opc/ruby/src/master/tool/downloader.rb:201:in `download' E, [2024-05-07T13:55:29.349986 #197937] ERROR -- : from /home/opc/ruby/src/master/tool/downloader.rb:136:in `download' E, [2024-05-07T13:55:29.349994 #197937] ERROR -- : from /home/opc/ruby/src/master/tool/downloader.rb:482:in `block in
' E, [2024-05-07T13:55:29.350003 #197937] ERROR -- : from /home/opc/ruby/src/master/tool/downloader.rb:465:in `each' E, [2024-05-07T13:55:29.350011 #197937] ERROR -- : from /home/opc/ruby/src/master/tool/downloader.rb:465:in `
' E, [2024-05-07T13:55:29.350019 #197937] ERROR -- : /usr/local/lib/ruby/3.2.0/open-uri.rb:369:in `open_http': 403 Forbidden (OpenURI::HTTPError) E, [2024-05-07T13:55:29.350027 #197937] ERROR -- : from /usr/local/lib/ruby/3.2.0/open-uri.rb:760:in `buffer_open' E, [2024-05-07T13:55:29.350035 #197937] ERROR -- : from /usr/local/lib/ruby/3.2.0/open-uri.rb:214:in `block in open_loop' E, [2024-05-07T13:55:29.350043 #197937] ERROR -- : from /usr/local/lib/ruby/3.2.0/open-uri.rb:212:in `catch' E, [2024-05-07T13:55:29.350052 #197937] ERROR -- : from /usr/local/lib/ruby/3.2.0/open-uri.rb:212:in `open_loop' E, [2024-05-07T13:55:29.350060 #197937] ERROR -- : from /usr/local/lib/ruby/3.2.0/open-uri.rb:153:in `open_uri' E, [2024-05-07T13:55:29.350067 #197937] ERROR -- : from /usr/local/lib/ruby/3.2.0/open-uri.rb:740:in `open' E, [2024-05-07T13:55:29.350079 #197937] ERROR -- : from /usr/local/lib/ruby/3.2.0/open-uri.rb:748:in `read' E, [2024-05-07T13:55:29.350087 #197937] ERROR -- : from /home/opc/ruby/src/master/tool/downloader.rb:247:in `block in download' E, [2024-05-07T13:55:29.350095 #197937] ERROR -- : from /home/opc/ruby/src/master/tool/downloader.rb:378:in `with_retry' E, [2024-05-07T13:55:29.350103 #197937] ERROR -- : from /home/opc/ruby/src/master/tool/downloader.rb:246:in `download' E, [2024-05-07T13:55:29.350111 #197937] ERROR -- : from /home/opc/ruby/src/master/tool/downloader.rb:136:in `download' E, [2024-05-07T13:55:29.350119 #197937] ERROR -- : from /home/opc/ruby/src/master/tool/downloader.rb:482:in `block in
' E, [2024-05-07T13:55:29.350127 #197937] ERROR -- : from /home/opc/ruby/src/master/tool/downloader.rb:465:in `each' E, [2024-05-07T13:55:29.350135 #197937] ERROR -- : from /home/opc/ruby/src/master/tool/downloader.rb:465:in `
' E, [2024-05-07T13:55:29.350221 #197937] ERROR -- : /home/opc/ruby/src/master/tool/downloader.rb:302:in `rescue in download': failed to download emoji/15.0/emoji-test.txt (RuntimeError) E, [2024-05-07T13:55:29.350259 #197937] ERROR -- : OpenURI::HTTPError: 403 Forbidden: https://www.unicode.org/Public/emoji/15.0/emoji-test.txt E, [2024-05-07T13:55:29.350269 #197937] ERROR -- : from /home/opc/ruby/src/master/tool/downloader.rb:201:in `download' E, [2024-05-07T13:55:29.350279 #197937] ERROR -- : from /home/opc/ruby/src/master/tool/downloader.rb:136:in `download' E, [2024-05-07T13:55:29.350287 #197937] ERROR -- : from /home/opc/ruby/src/master/tool/downloader.rb:482:in `block in
' E, [2024-05-07T13:55:29.350295 #197937] ERROR -- : from /home/opc/ruby/src/master/tool/downloader.rb:465:in `each' E, [2024-05-07T13:55:29.350303 #197937] ERROR -- : from /home/opc/ruby/src/master/tool/downloader.rb:465:in `
' E, [2024-05-07T13:55:29.350311 #197937] ERROR -- : /usr/local/lib/ruby/3.2.0/open-uri.rb:369:in `open_http': 403 Forbidden (OpenURI::HTTPError) E, [2024-05-07T13:55:29.350320 #197937] ERROR -- : from /usr/local/lib/ruby/3.2.0/open-uri.rb:760:in `buffer_open' E, [2024-05-07T13:55:29.350328 #197937] ERROR -- : from /usr/local/lib/ruby/3.2.0/open-uri.rb:214:in `block in open_loop' E, [2024-05-07T13:55:29.350336 #197937] ERROR -- : from /usr/local/lib/ruby/3.2.0/open-uri.rb:212:in `catch' E, [2024-05-07T13:55:29.350344 #197937] ERROR -- : from /usr/local/lib/ruby/3.2.0/open-uri.rb:212:in `open_loop' E, [2024-05-07T13:55:29.350352 #197937] ERROR -- : from /usr/local/lib/ruby/3.2.0/open-uri.rb:153:in `open_uri' E, [2024-05-07T13:55:29.350359 #197937] ERROR -- : from /usr/local/lib/ruby/3.2.0/open-uri.rb:740:in `open' E, [2024-05-07T13:55:29.350368 #197937] ERROR -- : from /usr/local/lib/ruby/3.2.0/open-uri.rb:748:in `read' E, [2024-05-07T13:55:29.350376 #197937] ERROR -- : from /home/opc/ruby/src/master/tool/downloader.rb:247:in `block in download' E, [2024-05-07T13:55:29.350384 #197937] ERROR -- : from /home/opc/ruby/src/master/tool/downloader.rb:378:in `with_retry' E, [2024-05-07T13:55:29.350392 #197937] ERROR -- : from /home/opc/ruby/src/master/tool/downloader.rb:246:in `download' E, [2024-05-07T13:55:29.350400 #197937] ERROR -- : from /home/opc/ruby/src/master/tool/downloader.rb:136:in `download' E, [2024-05-07T13:55:29.350408 #197937] ERROR -- : from /home/opc/ruby/src/master/tool/downloader.rb:482:in `block in
' E, [2024-05-07T13:55:29.350416 #197937] ERROR -- : from /home/opc/ruby/src/master/tool/downloader.rb:465:in `each' E, [2024-05-07T13:55:29.350424 #197937] ERROR -- : from /home/opc/ruby/src/master/tool/downloader.rb:465:in `
' E, [2024-05-07T13:55:29.350434 #197937] ERROR -- : /home/opc/ruby/src/master/tool/downloader.rb:302:in `rescue in download': failed to download emoji/15.0/emoji-test.txt (RuntimeError) E, [2024-05-07T13:55:29.350442 #197937] ERROR -- : OpenURI::HTTPError: 403 Forbidden: https://www.unicode.org/Public/emoji/15.0/emoji-test.txt E, [2024-05-07T13:55:29.350450 #197937] ERROR -- : from /home/opc/ruby/src/master/tool/downloader.rb:201:in `download' E, [2024-05-07T13:55:29.350461 #197937] ERROR -- : from /home/opc/ruby/src/master/tool/downloader.rb:136:in `download' E, [2024-05-07T13:55:29.350469 #197937] ERROR -- : from /home/opc/ruby/src/master/tool/downloader.rb:482:in `block in
' E, [2024-05-07T13:55:29.350477 #197937] ERROR -- : from /home/opc/ruby/src/master/tool/downloader.rb:465:in `each' E, [2024-05-07T13:55:29.350486 #197937] ERROR -- : from /home/opc/ruby/src/master/tool/downloader.rb:465:in `
' E, [2024-05-07T13:55:29.350494 #197937] ERROR -- : /usr/local/lib/ruby/3.2.0/open-uri.rb:369:in `open_http': 403 Forbidden (OpenURI::HTTPError) E, [2024-05-07T13:55:29.350502 #197937] ERROR -- : from /usr/local/lib/ruby/3.2.0/open-uri.rb:760:in `buffer_open' E, [2024-05-07T13:55:29.350509 #197937] ERROR -- : from /usr/local/lib/ruby/3.2.0/open-uri.rb:214:in `block in open_loop' E, [2024-05-07T13:55:29.350518 #197937] ERROR -- : from /usr/local/lib/ruby/3.2.0/open-uri.rb:212:in `catch' E, [2024-05-07T13:55:29.350526 #197937] ERROR -- : from /usr/local/lib/ruby/3.2.0/open-uri.rb:212:in `open_loop' E, [2024-05-07T13:55:29.350534 #197937] ERROR -- : from /usr/local/lib/ruby/3.2.0/open-uri.rb:153:in `open_uri' E, [2024-05-07T13:55:29.350542 #197937] ERROR -- : from /usr/local/lib/ruby/3.2.0/open-uri.rb:740:in `open' E, [2024-05-07T13:55:29.350550 #197937] ERROR -- : from /usr/local/lib/ruby/3.2.0/open-uri.rb:748:in `read' E, [2024-05-07T13:55:29.350558 #197937] ERROR -- : from /home/opc/ruby/src/master/tool/downloader.rb:247:in `block in download' E, [2024-05-07T13:55:29.350566 #197937] ERROR -- : from /home/opc/ruby/src/master/tool/downloader.rb:378:in `with_retry' E, [2024-05-07T13:55:29.350574 #197937] ERROR -- : from /home/opc/ruby/src/master/tool/downloader.rb:246:in `download' E, [2024-05-07T13:55:29.350582 #197937] ERROR -- : from /home/opc/ruby/src/master/tool/downloader.rb:136:in `download' E, [2024-05-07T13:55:29.350590 #197937] ERROR -- : from /home/opc/ruby/src/master/tool/downloader.rb:482:in `block in
' E, [2024-05-07T13:55:29.350598 #197937] ERROR -- : from /home/opc/ruby/src/master/tool/downloader.rb:465:in `each' E, [2024-05-07T13:55:29.350606 #197937] ERROR -- : from /home/opc/ruby/src/master/tool/downloader.rb:465:in `
' E, [2024-05-07T13:55:29.353843 #197937] ERROR -- : make: *** [uncommon.mk:1787: /home/opc/ruby/src/master/enc/unicode/data/emoji/15.0/emoji-sequences.txt] Error 1 E, [2024-05-07T13:55:29.353900 #197937] ERROR -- : make: *** Deleting file '/home/opc/ruby/src/master/enc/unicode/data/emoji/15.0/emoji-sequences.txt' E, [2024-05-07T13:55:29.353912 #197937] ERROR -- : make: *** Waiting for unfinished jobs.... E, [2024-05-07T13:55:29.353921 #197937] ERROR -- : make: *** [uncommon.mk:1787: /home/opc/ruby/src/master/enc/unicode/data/emoji/15.0/emoji-zwj-sequences.txt] Error 1 E, [2024-05-07T13:55:29.354188 #197937] ERROR -- : make: *** [uncommon.mk:1787: /home/opc/ruby/src/master/enc/unicode/data/emoji/15.0/emoji-test.txt] Error 1 I, [2024-05-07T13:55:29.354287 #197937] INFO -- : downloading emoji/15.0/emoji-test.txt ... I, [2024-05-07T13:55:29.354412 #197937] INFO -- : $$$[end] "make update-unicode -j3" exit with 512. I, [2024-05-07T13:55:29.354440 #197937] INFO -- : $$$[beg] make update-download -j3 I, [2024-05-07T13:55:29.518142 #197937] INFO -- : tool/config.guess already exists I, [2024-05-07T13:55:29.518212 #197937] INFO -- : tool/config.sub already exists I, [2024-05-07T13:55:29.521000 #197937] INFO -- : Update minitest to ea9caafc0754b1d6236a490d59e624b53209734a I, [2024-05-07T13:55:29.521182 #197937] INFO -- : Update power_assert to 84e85124c5014a139af39161d484156cfe87a9ed I, [2024-05-07T13:55:29.521447 #197937] INFO -- : Update rbs to ba7872795d5de04adb8ff500c0e6afdc81a041dd I, [2024-05-07T13:55:29.524788 #197937] INFO -- : echo ea9caafc0754b1d6236a490d59e624b53209734a | /bin/sh /home/opc/ruby/src/master/tool/ifchange /home/opc/ruby/src/master/.bundle/.timestamp/minitest.revision - I, [2024-05-07T13:55:29.524972 #197937] INFO -- : echo 84e85124c5014a139af39161d484156cfe87a9ed | /bin/sh /home/opc/ruby/src/master/tool/ifchange /home/opc/ruby/src/master/.bundle/.timestamp/power_assert.revision - I, [2024-05-07T13:55:29.525150 #197937] INFO -- : echo ba7872795d5de04adb8ff500c0e6afdc81a041dd | /bin/sh /home/opc/ruby/src/master/tool/ifchange /home/opc/ruby/src/master/.bundle/.timestamp/rbs.revision - I, [2024-05-07T13:55:29.530912 #197937] INFO -- : /home/opc/ruby/src/master/.bundle/.timestamp/rbs.revision unchanged I, [2024-05-07T13:55:29.531061 #197937] INFO -- : /home/opc/ruby/src/master/.bundle/.timestamp/minitest.revision unchanged I, [2024-05-07T13:55:29.532462 #197937] INFO -- : /home/opc/ruby/src/master/.bundle/.timestamp/power_assert.revision unchanged I, [2024-05-07T13:55:29.533693 #197937] INFO -- : Update typeprof to b19a6416da3a05d57fadd6ffdadb382b6d236ca5 I, [2024-05-07T13:55:29.539372 #197937] INFO -- : echo b19a6416da3a05d57fadd6ffdadb382b6d236ca5 | /bin/sh /home/opc/ruby/src/master/tool/ifchange /home/opc/ruby/src/master/.bundle/.timestamp/typeprof.revision - I, [2024-05-07T13:55:29.545297 #197937] INFO -- : /home/opc/ruby/src/master/.bundle/.timestamp/typeprof.revision unchanged I, [2024-05-07T13:55:29.623646 #197937] INFO -- : Building power_assert@84e85124c5014a139af39161d484156cfe87a9ed to /home/opc/ruby/src/master/gems/power_assert-2.0.3.gem I, [2024-05-07T13:55:29.735483 #197937] INFO -- : Successfully built RubyGem I, [2024-05-07T13:55:29.735544 #197937] INFO -- : Name: power_assert I, [2024-05-07T13:55:29.735554 #197937] INFO -- : Version: 2.0.4dev I, [2024-05-07T13:55:29.735563 #197937] INFO -- : File: power_assert-2.0.4dev.gem I, [2024-05-07T13:55:29.815151 #197937] INFO -- : $$$[end] "make update-download -j3" exit with 0. I, [2024-05-07T13:55:29.815223 #197937] INFO -- : $$$[beg] make update-rubyspec -j3 I, [2024-05-07T13:55:29.903438 #197937] INFO -- : make: Nothing to be done for 'update-rubyspec'. I, [2024-05-07T13:55:29.903609 #197937] INFO -- : $$$[end] "make update-rubyspec -j3" exit with 0. I, [2024-05-07T13:55:29.903658 #197937] INFO -- : $$$[beg] make update-src -j3 I, [2024-05-07T13:55:30.812181 #197937] INFO -- : Already up to date. I, [2024-05-07T13:55:30.827004 #197937] INFO -- : Latest commit hash = e1e6b4972f I, [2024-05-07T13:55:30.827595 #197937] INFO -- : $$$[end] "make update-src -j3" exit with 0. I, [2024-05-07T13:55:30.827640 #197937] INFO -- : $$$[beg] make after-update -j3 I, [2024-05-07T13:55:30.931095 #197937] INFO -- : generating /home/opc/ruby/src/master/ext/ripper/eventids2table.c I, [2024-05-07T13:55:30.937858 #197937] INFO -- : make[1]: Entering directory '/home/opc/ruby/src/master/ext/ripper' I, [2024-05-07T13:55:30.937968 #197937] INFO -- : make[1]: Nothing to be done for 'src'. I, [2024-05-07T13:55:30.938005 #197937] INFO -- : make[1]: Leaving directory '/home/opc/ruby/src/master/ext/ripper' I, [2024-05-07T13:55:30.964648 #197937] INFO -- : /home/opc/ruby/src/master/revision.h updated I, [2024-05-07T13:55:30.966043 #197937] INFO -- : generating aarch64-linux-fake.rb I, [2024-05-07T13:55:31.024146 #197937] INFO -- : aarch64-linux-fake.rb updated I, [2024-05-07T13:55:31.025628 #197937] INFO -- : generating enc.mk I, [2024-05-07T13:55:31.255674 #197937] INFO -- : making srcs under enc I, [2024-05-07T13:55:31.297542 #197937] INFO -- : make[1]: Entering directory '/home/opc/ruby/build/master' I, [2024-05-07T13:55:31.297617 #197937] INFO -- : make[1]: Nothing to be done for 'srcs'. I, [2024-05-07T13:55:31.297627 #197937] INFO -- : make[1]: Leaving directory '/home/opc/ruby/build/master' I, [2024-05-07T13:55:31.376927 #197937] INFO -- : Update minitest to ea9caafc0754b1d6236a490d59e624b53209734a I, [2024-05-07T13:55:31.377235 #197937] INFO -- : Update power_assert to 84e85124c5014a139af39161d484156cfe87a9ed I, [2024-05-07T13:55:31.377429 #197937] INFO -- : Update rbs to ba7872795d5de04adb8ff500c0e6afdc81a041dd I, [2024-05-07T13:55:31.380124 #197937] INFO -- : echo ea9caafc0754b1d6236a490d59e624b53209734a | /bin/sh /home/opc/ruby/src/master/tool/ifchange /home/opc/ruby/src/master/.bundle/.timestamp/minitest.revision - I, [2024-05-07T13:55:31.380288 #197937] INFO -- : echo 84e85124c5014a139af39161d484156cfe87a9ed | /bin/sh /home/opc/ruby/src/master/tool/ifchange /home/opc/ruby/src/master/.bundle/.timestamp/power_assert.revision - I, [2024-05-07T13:55:31.380638 #197937] INFO -- : echo ba7872795d5de04adb8ff500c0e6afdc81a041dd | /bin/sh /home/opc/ruby/src/master/tool/ifchange /home/opc/ruby/src/master/.bundle/.timestamp/rbs.revision - I, [2024-05-07T13:55:31.386294 #197937] INFO -- : /home/opc/ruby/src/master/.bundle/.timestamp/power_assert.revision unchanged I, [2024-05-07T13:55:31.386354 #197937] INFO -- : /home/opc/ruby/src/master/.bundle/.timestamp/rbs.revision unchanged I, [2024-05-07T13:55:31.386365 #197937] INFO -- : /home/opc/ruby/src/master/.bundle/.timestamp/minitest.revision unchanged I, [2024-05-07T13:55:31.390283 #197937] INFO -- : Update typeprof to b19a6416da3a05d57fadd6ffdadb382b6d236ca5 I, [2024-05-07T13:55:31.397445 #197937] INFO -- : echo b19a6416da3a05d57fadd6ffdadb382b6d236ca5 | /bin/sh /home/opc/ruby/src/master/tool/ifchange /home/opc/ruby/src/master/.bundle/.timestamp/typeprof.revision - I, [2024-05-07T13:55:31.406560 #197937] INFO -- : /home/opc/ruby/src/master/.bundle/.timestamp/typeprof.revision unchanged I, [2024-05-07T13:55:31.479598 #197937] INFO -- : Building power_assert@84e85124c5014a139af39161d484156cfe87a9ed to /home/opc/ruby/src/master/gems/power_assert-2.0.3.gem I, [2024-05-07T13:55:31.589032 #197937] INFO -- : Successfully built RubyGem I, [2024-05-07T13:55:31.589090 #197937] INFO -- : Name: power_assert I, [2024-05-07T13:55:31.589101 #197937] INFO -- : Version: 2.0.4dev I, [2024-05-07T13:55:31.589136 #197937] INFO -- : File: power_assert-2.0.4dev.gem I, [2024-05-07T13:55:31.591497 #197937] INFO -- : Extracting bundle gem power_assert-2.0.3... I, [2024-05-07T13:55:31.689215 #197937] INFO -- : Try with hash version of bundled gems instead of gems/power_assert-2.0.3.gem. We don't use this gem with release version of Ruby. I, [2024-05-07T13:55:31.699967 #197937] INFO -- : Unpacked gems/power_assert-2.0.4dev.gem I, [2024-05-07T13:55:31.701993 #197937] INFO -- : $$$[end] "make after-update -j3" exit with 0. I, [2024-05-07T13:55:31.702142 #197937] INFO -- : $$$[beg] make miniruby -j3 I, [2024-05-07T13:55:31.790499 #197937] INFO -- : BASERUBY = /usr/local/bin/ruby --disable=gems I, [2024-05-07T13:55:31.790563 #197937] INFO -- : CC = gcc I, [2024-05-07T13:55:31.790574 #197937] INFO -- : LD = ld I, [2024-05-07T13:55:31.790597 #197937] INFO -- : LDSHARED = gcc -shared I, [2024-05-07T13:55:31.790610 #197937] INFO -- : CFLAGS = -O3 -fno-fast-math -ggdb3 -Wall -Wextra -Wdeprecated-declarations -Wdiv-by-zero -Wduplicated-cond -Wimplicit-function-declaration -Wimplicit-int -Wpointer-arith -Wwrite-strings -Wold-style-definition -Wimplicit-fallthrough=0 -Wmissing-noreturn -Wno-cast-function-type -Wno-constant-logical-operand -Wno-long-long -Wno-missing-field-initializers -Wno-overlength-strings -Wno-packed-bitfield-compat -Wno-parentheses-equality -Wno-self-assign -Wno-tautological-compare -Wno-unused-parameter -Wno-unused-value -Wsuggest-attribute=format -Wsuggest-attribute=noreturn -Wunused-variable -Wmisleading-indentation -Wundef I, [2024-05-07T13:55:31.790620 #197937] INFO -- : XCFLAGS = -U_FORTIFY_SOURCE -D_FORTIFY_SOURCE=2 -fstack-protector-strong -msign-return-address=all -fno-strict-overflow -fvisibility=hidden -fexcess-precision=standard -DRUBY_EXPORT -fPIE -I. -I.ext/include/aarch64-linux -I/home/opc/ruby/src/master/include -I/home/opc/ruby/src/master -I/home/opc/ruby/src/master/prism -I/home/opc/ruby/src/master/enc/unicode/15.0.0 I, [2024-05-07T13:55:31.790628 #197937] INFO -- : CPPFLAGS = I, [2024-05-07T13:55:31.790659 #197937] INFO -- : DLDFLAGS = -Wl,--compress-debug-sections=zlib -fstack-protector-strong -pie I, [2024-05-07T13:55:31.790669 #197937] INFO -- : SOLIBS = -lz -lrt -lrt -ldl -lcrypt -lm -lpthread I, [2024-05-07T13:55:31.790677 #197937] INFO -- : LANG = en_US.UTF-8 I, [2024-05-07T13:55:31.790687 #197937] INFO -- : LC_ALL = I, [2024-05-07T13:55:31.790695 #197937] INFO -- : LC_CTYPE = I, [2024-05-07T13:55:31.790703 #197937] INFO -- : MFLAGS = -j3 --jobserver-auth=4,5 I, [2024-05-07T13:55:31.790710 #197937] INFO -- : RUSTC = rustc I, [2024-05-07T13:55:31.790718 #197937] INFO -- : YJIT_RUSTC_ARGS = --crate-name=yjit --crate-type=staticlib --edition=2021 -g -C lto=thin -C opt-level=3 -C overflow-checks=on '--out-dir=/home/opc/ruby/build/master/yjit/target/release/' /home/opc/ruby/src/master/yjit/src/lib.rs I, [2024-05-07T13:55:31.791417 #197937] INFO -- : gcc (GCC) 8.5.0 20210514 (Red Hat 8.5.0-10.1.0.1) I, [2024-05-07T13:55:31.791447 #197937] INFO -- : Copyright (C) 2018 Free Software Foundation, Inc. I, [2024-05-07T13:55:31.791456 #197937] INFO -- : This is free software; see the source for copying conditions. There is NO I, [2024-05-07T13:55:31.791465 #197937] INFO -- : warranty; not even for MERCHANTABILITY or FITNESS FOR A PARTICULAR PURPOSE. I, [2024-05-07T13:55:31.791473 #197937] INFO -- : I, [2024-05-07T13:55:31.816535 #197937] INFO -- : compiling /home/opc/ruby/src/master/version.c I, [2024-05-07T13:55:31.957015 #197937] INFO -- : linking miniruby I, [2024-05-07T13:55:32.853007 #197937] INFO -- : $$$[end] "make miniruby -j3" exit with 0. I, [2024-05-07T13:55:32.853262 #197937] INFO -- : $$$[beg] make ruby -j3 I, [2024-05-07T13:55:32.944054 #197937] INFO -- : BASERUBY = /usr/local/bin/ruby --disable=gems I, [2024-05-07T13:55:32.944129 #197937] INFO -- : CC = gcc I, [2024-05-07T13:55:32.944140 #197937] INFO -- : LD = ld I, [2024-05-07T13:55:32.944152 #197937] INFO -- : LDSHARED = gcc -shared I, [2024-05-07T13:55:32.944161 #197937] INFO -- : CFLAGS = -O3 -fno-fast-math -ggdb3 -Wall -Wextra -Wdeprecated-declarations -Wdiv-by-zero -Wduplicated-cond -Wimplicit-function-declaration -Wimplicit-int -Wpointer-arith -Wwrite-strings -Wold-style-definition -Wimplicit-fallthrough=0 -Wmissing-noreturn -Wno-cast-function-type -Wno-constant-logical-operand -Wno-long-long -Wno-missing-field-initializers -Wno-overlength-strings -Wno-packed-bitfield-compat -Wno-parentheses-equality -Wno-self-assign -Wno-tautological-compare -Wno-unused-parameter -Wno-unused-value -Wsuggest-attribute=format -Wsuggest-attribute=noreturn -Wunused-variable -Wmisleading-indentation -Wundef I, [2024-05-07T13:55:32.944170 #197937] INFO -- : XCFLAGS = -U_FORTIFY_SOURCE -D_FORTIFY_SOURCE=2 -fstack-protector-strong -msign-return-address=all -fno-strict-overflow -fvisibility=hidden -fexcess-precision=standard -DRUBY_EXPORT -fPIE -I. -I.ext/include/aarch64-linux -I/home/opc/ruby/src/master/include -I/home/opc/ruby/src/master -I/home/opc/ruby/src/master/prism -I/home/opc/ruby/src/master/enc/unicode/15.0.0 I, [2024-05-07T13:55:32.944179 #197937] INFO -- : CPPFLAGS = I, [2024-05-07T13:55:32.944187 #197937] INFO -- : DLDFLAGS = -Wl,--compress-debug-sections=zlib -fstack-protector-strong -pie I, [2024-05-07T13:55:32.944196 #197937] INFO -- : SOLIBS = -lz -lrt -lrt -ldl -lcrypt -lm -lpthread I, [2024-05-07T13:55:32.944204 #197937] INFO -- : LANG = en_US.UTF-8 I, [2024-05-07T13:55:32.944212 #197937] INFO -- : LC_ALL = I, [2024-05-07T13:55:32.944220 #197937] INFO -- : LC_CTYPE = I, [2024-05-07T13:55:32.944228 #197937] INFO -- : MFLAGS = -j3 --jobserver-auth=4,5 I, [2024-05-07T13:55:32.944235 #197937] INFO -- : RUSTC = rustc I, [2024-05-07T13:55:32.944243 #197937] INFO -- : YJIT_RUSTC_ARGS = --crate-name=yjit --crate-type=staticlib --edition=2021 -g -C lto=thin -C opt-level=3 -C overflow-checks=on '--out-dir=/home/opc/ruby/build/master/yjit/target/release/' /home/opc/ruby/src/master/yjit/src/lib.rs I, [2024-05-07T13:55:32.944991 #197937] INFO -- : gcc (GCC) 8.5.0 20210514 (Red Hat 8.5.0-10.1.0.1) I, [2024-05-07T13:55:32.945029 #197937] INFO -- : Copyright (C) 2018 Free Software Foundation, Inc. I, [2024-05-07T13:55:32.945039 #197937] INFO -- : This is free software; see the source for copying conditions. There is NO I, [2024-05-07T13:55:32.945051 #197937] INFO -- : warranty; not even for MERCHANTABILITY or FITNESS FOR A PARTICULAR PURPOSE. I, [2024-05-07T13:55:32.945060 #197937] INFO -- : I, [2024-05-07T13:55:33.128063 #197937] INFO -- : builtin_binary.inc updated I, [2024-05-07T13:55:33.129691 #197937] INFO -- : c5234a9416e4f20f175185e840b25b0f08674d14078ed7083f37e655458e3ca9 builtin_binary.inc I, [2024-05-07T13:55:33.130476 #197937] INFO -- : compiling /home/opc/ruby/src/master/builtin.c I, [2024-05-07T13:55:33.460297 #197937] INFO -- : linking static-library libruby-static.a I, [2024-05-07T13:55:36.744673 #197937] INFO -- : linking ruby I, [2024-05-07T13:55:37.650694 #197937] INFO -- : $$$[end] "make ruby -j3" exit with 0. I, [2024-05-07T13:55:37.650863 #197937] INFO -- : $$$[beg] make all -j3 I, [2024-05-07T13:55:37.739456 #197937] INFO -- : BASERUBY = /usr/local/bin/ruby --disable=gems I, [2024-05-07T13:55:37.739522 #197937] INFO -- : CC = gcc I, [2024-05-07T13:55:37.739533 #197937] INFO -- : LD = ld I, [2024-05-07T13:55:37.739545 #197937] INFO -- : LDSHARED = gcc -shared I, [2024-05-07T13:55:37.739554 #197937] INFO -- : CFLAGS = -O3 -fno-fast-math -ggdb3 -Wall -Wextra -Wdeprecated-declarations -Wdiv-by-zero -Wduplicated-cond -Wimplicit-function-declaration -Wimplicit-int -Wpointer-arith -Wwrite-strings -Wold-style-definition -Wimplicit-fallthrough=0 -Wmissing-noreturn -Wno-cast-function-type -Wno-constant-logical-operand -Wno-long-long -Wno-missing-field-initializers -Wno-overlength-strings -Wno-packed-bitfield-compat -Wno-parentheses-equality -Wno-self-assign -Wno-tautological-compare -Wno-unused-parameter -Wno-unused-value -Wsuggest-attribute=format -Wsuggest-attribute=noreturn -Wunused-variable -Wmisleading-indentation -Wundef I, [2024-05-07T13:55:37.739564 #197937] INFO -- : XCFLAGS = -U_FORTIFY_SOURCE -D_FORTIFY_SOURCE=2 -fstack-protector-strong -msign-return-address=all -fno-strict-overflow -fvisibility=hidden -fexcess-precision=standard -DRUBY_EXPORT -fPIE -I. -I.ext/include/aarch64-linux -I/home/opc/ruby/src/master/include -I/home/opc/ruby/src/master -I/home/opc/ruby/src/master/prism -I/home/opc/ruby/src/master/enc/unicode/15.0.0 I, [2024-05-07T13:55:37.739572 #197937] INFO -- : CPPFLAGS = I, [2024-05-07T13:55:37.739580 #197937] INFO -- : DLDFLAGS = -Wl,--compress-debug-sections=zlib -fstack-protector-strong -pie I, [2024-05-07T13:55:37.739589 #197937] INFO -- : SOLIBS = -lz -lrt -lrt -ldl -lcrypt -lm -lpthread I, [2024-05-07T13:55:37.739597 #197937] INFO -- : LANG = en_US.UTF-8 I, [2024-05-07T13:55:37.739604 #197937] INFO -- : LC_ALL = I, [2024-05-07T13:55:37.739612 #197937] INFO -- : LC_CTYPE = I, [2024-05-07T13:55:37.739620 #197937] INFO -- : MFLAGS = -j3 --jobserver-auth=4,5 I, [2024-05-07T13:55:37.739628 #197937] INFO -- : RUSTC = rustc I, [2024-05-07T13:55:37.739636 #197937] INFO -- : YJIT_RUSTC_ARGS = --crate-name=yjit --crate-type=staticlib --edition=2021 -g -C lto=thin -C opt-level=3 -C overflow-checks=on '--out-dir=/home/opc/ruby/build/master/yjit/target/release/' /home/opc/ruby/src/master/yjit/src/lib.rs I, [2024-05-07T13:55:37.740425 #197937] INFO -- : gcc (GCC) 8.5.0 20210514 (Red Hat 8.5.0-10.1.0.1) I, [2024-05-07T13:55:37.740459 #197937] INFO -- : Copyright (C) 2018 Free Software Foundation, Inc. I, [2024-05-07T13:55:37.740469 #197937] INFO -- : This is free software; see the source for copying conditions. There is NO I, [2024-05-07T13:55:37.740478 #197937] INFO -- : warranty; not even for MERCHANTABILITY or FITNESS FOR A PARTICULAR PURPOSE. I, [2024-05-07T13:55:37.740513 #197937] INFO -- : I, [2024-05-07T13:55:37.774344 #197937] INFO -- : generating enc.mk I, [2024-05-07T13:55:38.009335 #197937] INFO -- : making enc I, [2024-05-07T13:55:38.009399 #197937] INFO -- : making srcs under enc I, [2024-05-07T13:55:38.036842 #197937] INFO -- : make[1]: Entering directory '/home/opc/ruby/build/master' I, [2024-05-07T13:55:38.036913 #197937] INFO -- : make[1]: Nothing to be done for 'enc'. I, [2024-05-07T13:55:38.036924 #197937] INFO -- : make[1]: Leaving directory '/home/opc/ruby/build/master' I, [2024-05-07T13:55:38.051365 #197937] INFO -- : make[1]: Entering directory '/home/opc/ruby/build/master' I, [2024-05-07T13:55:38.051425 #197937] INFO -- : make[1]: Nothing to be done for 'srcs'. I, [2024-05-07T13:55:38.051443 #197937] INFO -- : make[1]: Leaving directory '/home/opc/ruby/build/master' I, [2024-05-07T13:55:38.052196 #197937] INFO -- : generating transdb.h I, [2024-05-07T13:55:38.198007 #197937] INFO -- : transdb.h unchanged I, [2024-05-07T13:55:38.199369 #197937] INFO -- : generating makefiles ext/configure-ext.mk I, [2024-05-07T13:55:38.199494 #197937] INFO -- : making trans I, [2024-05-07T13:55:38.239455 #197937] INFO -- : ext/configure-ext.mk updated I, [2024-05-07T13:55:38.242950 #197937] INFO -- : make[1]: Entering directory '/home/opc/ruby/build/master' I, [2024-05-07T13:55:38.247928 #197937] INFO -- : make[1]: Entering directory '/home/opc/ruby/build/master' I, [2024-05-07T13:55:38.247993 #197937] INFO -- : make[1]: Nothing to be done for 'trans'. I, [2024-05-07T13:55:38.248029 #197937] INFO -- : make[1]: Leaving directory '/home/opc/ruby/build/master' I, [2024-05-07T13:55:38.941192 #197937] INFO -- : making encs I, [2024-05-07T13:55:38.970586 #197937] INFO -- : make[1]: Leaving directory '/home/opc/ruby/build/master' I, [2024-05-07T13:55:38.971232 #197937] INFO -- : generating makefile exts.mk I, [2024-05-07T13:55:38.997671 #197937] INFO -- : make[1]: Entering directory '/home/opc/ruby/build/master' I, [2024-05-07T13:55:38.997739 #197937] INFO -- : make[1]: Nothing to be done for 'encs'. I, [2024-05-07T13:55:38.997750 #197937] INFO -- : make[1]: Leaving directory '/home/opc/ruby/build/master' I, [2024-05-07T13:55:39.031844 #197937] INFO -- : exts.mk unchanged I, [2024-05-07T13:55:39.036731 #197937] INFO -- : make[1]: Entering directory '/home/opc/ruby/build/master' I, [2024-05-07T13:55:39.140169 #197937] INFO -- : make[2]: Entering directory '/home/opc/ruby/build/master/ext/coverage' I, [2024-05-07T13:55:39.141979 #197937] INFO -- : make[2]: Entering directory '/home/opc/ruby/build/master/ext/digest' I, [2024-05-07T13:55:39.142746 #197937] INFO -- : make[2]: Entering directory '/home/opc/ruby/build/master/ext/date' I, [2024-05-07T13:55:39.147357 #197937] INFO -- : make[2]: Leaving directory '/home/opc/ruby/build/master/ext/coverage' I, [2024-05-07T13:55:39.147890 #197937] INFO -- : make[2]: Leaving directory '/home/opc/ruby/build/master/ext/date' I, [2024-05-07T13:55:39.153025 #197937] INFO -- : make[2]: Leaving directory '/home/opc/ruby/build/master/ext/digest' I, [2024-05-07T13:55:39.158164 #197937] INFO -- : make[2]: Entering directory '/home/opc/ruby/build/master/ext/io/console' I, [2024-05-07T13:55:39.160106 #197937] INFO -- : make[2]: Entering directory '/home/opc/ruby/build/master/ext/fiddle' I, [2024-05-07T13:55:39.162608 #197937] INFO -- : make[2]: Leaving directory '/home/opc/ruby/build/master/ext/io/console' I, [2024-05-07T13:55:39.164612 #197937] INFO -- : make[2]: Entering directory '/home/opc/ruby/build/master/ext/json' I, [2024-05-07T13:55:39.167397 #197937] INFO -- : make[2]: Entering directory '/home/opc/ruby/build/master/ext/monitor' I, [2024-05-07T13:55:39.170347 #197937] INFO -- : make[2]: Leaving directory '/home/opc/ruby/build/master/ext/fiddle' I, [2024-05-07T13:55:39.172755 #197937] INFO -- : make[2]: Leaving directory '/home/opc/ruby/build/master/ext/monitor' I, [2024-05-07T13:55:39.174283 #197937] INFO -- : make[2]: Leaving directory '/home/opc/ruby/build/master/ext/json' I, [2024-05-07T13:55:39.176483 #197937] INFO -- : make[2]: Entering directory '/home/opc/ruby/build/master/ext/objspace' I, [2024-05-07T13:55:39.178275 #197937] INFO -- : make[2]: Entering directory '/home/opc/ruby/build/master/ext/pathname' I, [2024-05-07T13:55:39.182470 #197937] INFO -- : make[2]: Leaving directory '/home/opc/ruby/build/master/ext/pathname' I, [2024-05-07T13:55:39.183670 #197937] INFO -- : make[2]: Leaving directory '/home/opc/ruby/build/master/ext/objspace' I, [2024-05-07T13:55:39.187958 #197937] INFO -- : make[2]: Entering directory '/home/opc/ruby/build/master/ext/pty' I, [2024-05-07T13:55:39.188644 #197937] INFO -- : make[2]: Entering directory '/home/opc/ruby/build/master/ext/psych' I, [2024-05-07T13:55:39.191919 #197937] INFO -- : make[2]: Entering directory '/home/opc/ruby/build/master/ext/openssl' I, [2024-05-07T13:55:39.192357 #197937] INFO -- : make[2]: Leaving directory '/home/opc/ruby/build/master/ext/pty' I, [2024-05-07T13:55:39.207352 #197937] INFO -- : make[2]: Entering directory '/home/opc/ruby/build/master/ext/ripper' I, [2024-05-07T13:55:39.208840 #197937] INFO -- : make[2]: Leaving directory '/home/opc/ruby/build/master/ext/psych' I, [2024-05-07T13:55:39.210704 #197937] INFO -- : make[2]: Entering directory '/home/opc/ruby/build/master/ext/rubyvm' I, [2024-05-07T13:55:39.214136 #197937] INFO -- : make[2]: Leaving directory '/home/opc/ruby/build/master/ext/rubyvm' I, [2024-05-07T13:55:39.215037 #197937] INFO -- : make[2]: Leaving directory '/home/opc/ruby/build/master/ext/openssl' I, [2024-05-07T13:55:39.215209 #197937] INFO -- : make[2]: Leaving directory '/home/opc/ruby/build/master/ext/ripper' I, [2024-05-07T13:55:39.222122 #197937] INFO -- : make[2]: Entering directory '/home/opc/ruby/build/master/.bundle/gems/bigdecimal-3.1.7/ext/bigdecimal' I, [2024-05-07T13:55:39.226583 #197937] INFO -- : make[2]: Entering directory '/home/opc/ruby/build/master/ext/socket' I, [2024-05-07T13:55:39.228964 #197937] INFO -- : make[2]: Entering directory '/home/opc/ruby/build/master/.bundle/gems/bigdecimal-3.1.8/ext/bigdecimal' I, [2024-05-07T13:55:39.242117 #197937] INFO -- : make[2]: Leaving directory '/home/opc/ruby/build/master/ext/socket' I, [2024-05-07T13:55:39.244803 #197937] INFO -- : make[2]: Entering directory '/home/opc/ruby/build/master/.bundle/gems/debug-1.9.2/ext/debug' I, [2024-05-07T13:55:39.256411 #197937] INFO -- : make[2]: Leaving directory '/home/opc/ruby/build/master/.bundle/gems/bigdecimal-3.1.7/ext/bigdecimal' I, [2024-05-07T13:55:39.258950 #197937] INFO -- : make[2]: Entering directory '/home/opc/ruby/build/master/.bundle/gems/nkf-0.2.0/ext/nkf' I, [2024-05-07T13:55:39.259830 #197937] INFO -- : make[2]: Leaving directory '/home/opc/ruby/build/master/.bundle/gems/bigdecimal-3.1.8/ext/bigdecimal' I, [2024-05-07T13:55:39.267605 #197937] INFO -- : make[2]: Entering directory '/home/opc/ruby/build/master/.bundle/gems/racc-1.7.3/ext/racc/cparse' I, [2024-05-07T13:55:39.277333 #197937] INFO -- : make[2]: Leaving directory '/home/opc/ruby/build/master/.bundle/gems/debug-1.9.2/ext/debug' I, [2024-05-07T13:55:39.280450 #197937] INFO -- : make[2]: Entering directory '/home/opc/ruby/build/master/.bundle/gems/rbs-3.4.4/ext/rbs_extension' I, [2024-05-07T13:55:39.288886 #197937] INFO -- : make[2]: Leaving directory '/home/opc/ruby/build/master/.bundle/gems/nkf-0.2.0/ext/nkf' I, [2024-05-07T13:55:39.291640 #197937] INFO -- : make[2]: Entering directory '/home/opc/ruby/build/master/.bundle/gems/syslog-0.1.2/ext/syslog' I, [2024-05-07T13:55:39.299413 #197937] INFO -- : make[2]: Leaving directory '/home/opc/ruby/build/master/.bundle/gems/racc-1.7.3/ext/racc/cparse' I, [2024-05-07T13:55:39.311510 #197937] INFO -- : make[2]: Leaving directory '/home/opc/ruby/build/master/.bundle/gems/rbs-3.4.4/ext/rbs_extension' I, [2024-05-07T13:55:39.317971 #197937] INFO -- : make[2]: Entering directory '/home/opc/ruby/build/master/ext/digest/sha2' I, [2024-05-07T13:55:39.323593 #197937] INFO -- : make[2]: Leaving directory '/home/opc/ruby/build/master/ext/digest/sha2' I, [2024-05-07T13:55:39.323652 #197937] INFO -- : make[2]: Leaving directory '/home/opc/ruby/build/master/.bundle/gems/syslog-0.1.2/ext/syslog' I, [2024-05-07T13:55:39.365952 #197937] INFO -- : make[2]: Entering directory '/home/opc/ruby/build/master' I, [2024-05-07T13:55:39.449190 #197937] INFO -- : make[2]: 'ruby' is up to date. I, [2024-05-07T13:55:39.449265 #197937] INFO -- : make[2]: Leaving directory '/home/opc/ruby/build/master' I, [2024-05-07T13:55:39.449595 #197937] INFO -- : make[1]: Leaving directory '/home/opc/ruby/build/master' I, [2024-05-07T13:55:39.454031 #197937] INFO -- : make[1]: Entering directory '/home/opc/ruby/build/master' I, [2024-05-07T13:55:39.454063 #197937] INFO -- : make[1]: Nothing to be done for 'note'. I, [2024-05-07T13:55:39.454074 #197937] INFO -- : make[1]: Leaving directory '/home/opc/ruby/build/master' I, [2024-05-07T13:55:39.454370 #197937] INFO -- : $$$[end] "make all -j3" exit with 0. I, [2024-05-07T13:55:39.454494 #197937] INFO -- : $$$[beg] make install -j3 I, [2024-05-07T13:55:39.548015 #197937] INFO -- : Update minitest to ea9caafc0754b1d6236a490d59e624b53209734a I, [2024-05-07T13:55:39.548244 #197937] INFO -- : Update power_assert to 84e85124c5014a139af39161d484156cfe87a9ed I, [2024-05-07T13:55:39.548390 #197937] INFO -- : Update rbs to ba7872795d5de04adb8ff500c0e6afdc81a041dd I, [2024-05-07T13:55:39.551344 #197937] INFO -- : echo ea9caafc0754b1d6236a490d59e624b53209734a | /bin/sh /home/opc/ruby/src/master/tool/ifchange /home/opc/ruby/src/master/.bundle/.timestamp/minitest.revision - I, [2024-05-07T13:55:39.551472 #197937] INFO -- : echo 84e85124c5014a139af39161d484156cfe87a9ed | /bin/sh /home/opc/ruby/src/master/tool/ifchange /home/opc/ruby/src/master/.bundle/.timestamp/power_assert.revision - I, [2024-05-07T13:55:39.552675 #197937] INFO -- : echo ba7872795d5de04adb8ff500c0e6afdc81a041dd | /bin/sh /home/opc/ruby/src/master/tool/ifchange /home/opc/ruby/src/master/.bundle/.timestamp/rbs.revision - I, [2024-05-07T13:55:39.558495 #197937] INFO -- : /home/opc/ruby/src/master/.bundle/.timestamp/power_assert.revision unchanged I, [2024-05-07T13:55:39.558906 #197937] INFO -- : /home/opc/ruby/src/master/.bundle/.timestamp/minitest.revision unchanged I, [2024-05-07T13:55:39.559379 #197937] INFO -- : /home/opc/ruby/src/master/.bundle/.timestamp/rbs.revision unchanged I, [2024-05-07T13:55:39.561617 #197937] INFO -- : Update typeprof to b19a6416da3a05d57fadd6ffdadb382b6d236ca5 I, [2024-05-07T13:55:39.563981 #197937] INFO -- : BASERUBY = /usr/local/bin/ruby --disable=gems I, [2024-05-07T13:55:39.564015 #197937] INFO -- : CC = gcc I, [2024-05-07T13:55:39.564065 #197937] INFO -- : LD = ld I, [2024-05-07T13:55:39.564077 #197937] INFO -- : LDSHARED = gcc -shared I, [2024-05-07T13:55:39.564098 #197937] INFO -- : CFLAGS = -O3 -fno-fast-math -ggdb3 -Wall -Wextra -Wdeprecated-declarations -Wdiv-by-zero -Wduplicated-cond -Wimplicit-function-declaration -Wimplicit-int -Wpointer-arith -Wwrite-strings -Wold-style-definition -Wimplicit-fallthrough=0 -Wmissing-noreturn -Wno-cast-function-type -Wno-constant-logical-operand -Wno-long-long -Wno-missing-field-initializers -Wno-overlength-strings -Wno-packed-bitfield-compat -Wno-parentheses-equality -Wno-self-assign -Wno-tautological-compare -Wno-unused-parameter -Wno-unused-value -Wsuggest-attribute=format -Wsuggest-attribute=noreturn -Wunused-variable -Wmisleading-indentation -Wundef I, [2024-05-07T13:55:39.564108 #197937] INFO -- : XCFLAGS = -U_FORTIFY_SOURCE -D_FORTIFY_SOURCE=2 -fstack-protector-strong -msign-return-address=all -fno-strict-overflow -fvisibility=hidden -fexcess-precision=standard -DRUBY_EXPORT -fPIE -I. -I.ext/include/aarch64-linux -I/home/opc/ruby/src/master/include -I/home/opc/ruby/src/master -I/home/opc/ruby/src/master/prism -I/home/opc/ruby/src/master/enc/unicode/15.0.0 I, [2024-05-07T13:55:39.564116 #197937] INFO -- : CPPFLAGS = I, [2024-05-07T13:55:39.564126 #197937] INFO -- : DLDFLAGS = -Wl,--compress-debug-sections=zlib -fstack-protector-strong -pie I, [2024-05-07T13:55:39.564135 #197937] INFO -- : SOLIBS = -lz -lrt -lrt -ldl -lcrypt -lm -lpthread I, [2024-05-07T13:55:39.564142 #197937] INFO -- : LANG = en_US.UTF-8 I, [2024-05-07T13:55:39.564150 #197937] INFO -- : LC_ALL = I, [2024-05-07T13:55:39.564157 #197937] INFO -- : LC_CTYPE = I, [2024-05-07T13:55:39.564165 #197937] INFO -- : MFLAGS = -j3 --jobserver-auth=4,5 I, [2024-05-07T13:55:39.564172 #197937] INFO -- : RUSTC = rustc I, [2024-05-07T13:55:39.564180 #197937] INFO -- : YJIT_RUSTC_ARGS = --crate-name=yjit --crate-type=staticlib --edition=2021 -g -C lto=thin -C opt-level=3 -C overflow-checks=on '--out-dir=/home/opc/ruby/build/master/yjit/target/release/' /home/opc/ruby/src/master/yjit/src/lib.rs I, [2024-05-07T13:55:39.595266 #197937] INFO -- : echo b19a6416da3a05d57fadd6ffdadb382b6d236ca5 | /bin/sh /home/opc/ruby/src/master/tool/ifchange /home/opc/ruby/src/master/.bundle/.timestamp/typeprof.revision - I, [2024-05-07T13:55:39.596303 #197937] INFO -- : gcc (GCC) 8.5.0 20210514 (Red Hat 8.5.0-10.1.0.1) I, [2024-05-07T13:55:39.596338 #197937] INFO -- : Copyright (C) 2018 Free Software Foundation, Inc. I, [2024-05-07T13:55:39.596348 #197937] INFO -- : This is free software; see the source for copying conditions. There is NO I, [2024-05-07T13:55:39.596357 #197937] INFO -- : warranty; not even for MERCHANTABILITY or FITNESS FOR A PARTICULAR PURPOSE. I, [2024-05-07T13:55:39.596366 #197937] INFO -- : I, [2024-05-07T13:55:39.598249 #197937] INFO -- : generating enc.mk I, [2024-05-07T13:55:39.600732 #197937] INFO -- : /home/opc/ruby/src/master/.bundle/.timestamp/typeprof.revision unchanged I, [2024-05-07T13:55:39.699201 #197937] INFO -- : Building power_assert@84e85124c5014a139af39161d484156cfe87a9ed to /home/opc/ruby/src/master/gems/power_assert-2.0.3.gem I, [2024-05-07T13:55:39.817796 #197937] INFO -- : Successfully built RubyGem I, [2024-05-07T13:55:39.817863 #197937] INFO -- : Name: power_assert I, [2024-05-07T13:55:39.817873 #197937] INFO -- : Version: 2.0.4dev I, [2024-05-07T13:55:39.817882 #197937] INFO -- : File: power_assert-2.0.4dev.gem I, [2024-05-07T13:55:39.820299 #197937] INFO -- : Extracting bundle gem power_assert-2.0.3... I, [2024-05-07T13:55:39.837003 #197937] INFO -- : making srcs under enc I, [2024-05-07T13:55:39.837215 #197937] INFO -- : making enc I, [2024-05-07T13:55:39.864702 #197937] INFO -- : make[1]: Entering directory '/home/opc/ruby/build/master' I, [2024-05-07T13:55:39.864764 #197937] INFO -- : make[1]: Nothing to be done for 'enc'. I, [2024-05-07T13:55:39.864776 #197937] INFO -- : make[1]: Leaving directory '/home/opc/ruby/build/master' I, [2024-05-07T13:55:39.879791 #197937] INFO -- : make[1]: Entering directory '/home/opc/ruby/build/master' I, [2024-05-07T13:55:39.879858 #197937] INFO -- : make[1]: Nothing to be done for 'srcs'. I, [2024-05-07T13:55:39.879871 #197937] INFO -- : make[1]: Leaving directory '/home/opc/ruby/build/master' I, [2024-05-07T13:55:39.880712 #197937] INFO -- : generating transdb.h I, [2024-05-07T13:55:39.921251 #197937] INFO -- : Try with hash version of bundled gems instead of gems/power_assert-2.0.3.gem. We don't use this gem with release version of Ruby. I, [2024-05-07T13:55:39.931282 #197937] INFO -- : Unpacked gems/power_assert-2.0.4dev.gem I, [2024-05-07T13:55:40.024995 #197937] INFO -- : transdb.h unchanged I, [2024-05-07T13:55:40.026396 #197937] INFO -- : generating makefiles ext/configure-ext.mk I, [2024-05-07T13:55:40.026627 #197937] INFO -- : making trans I, [2024-05-07T13:55:40.065236 #197937] INFO -- : ext/configure-ext.mk unchanged I, [2024-05-07T13:55:40.068222 #197937] INFO -- : make[1]: Entering directory '/home/opc/ruby/build/master' I, [2024-05-07T13:55:40.074950 #197937] INFO -- : make[1]: Entering directory '/home/opc/ruby/build/master' I, [2024-05-07T13:55:40.075001 #197937] INFO -- : make[1]: Nothing to be done for 'trans'. I, [2024-05-07T13:55:40.075012 #197937] INFO -- : make[1]: Leaving directory '/home/opc/ruby/build/master' I, [2024-05-07T13:55:40.075704 #197937] INFO -- : making encs I, [2024-05-07T13:55:40.128626 #197937] INFO -- : make[1]: Entering directory '/home/opc/ruby/build/master' I, [2024-05-07T13:55:40.128697 #197937] INFO -- : make[1]: Nothing to be done for 'encs'. I, [2024-05-07T13:55:40.128710 #197937] INFO -- : make[1]: Leaving directory '/home/opc/ruby/build/master' I, [2024-05-07T13:55:40.821710 #197937] INFO -- : make[1]: Leaving directory '/home/opc/ruby/build/master' I, [2024-05-07T13:55:40.822402 #197937] INFO -- : generating makefile exts.mk I, [2024-05-07T13:55:40.880566 #197937] INFO -- : exts.mk unchanged I, [2024-05-07T13:55:40.885518 #197937] INFO -- : make[1]: Entering directory '/home/opc/ruby/build/master' I, [2024-05-07T13:55:40.989607 #197937] INFO -- : make[2]: Entering directory '/home/opc/ruby/build/master/ext/coverage' I, [2024-05-07T13:55:40.991652 #197937] INFO -- : make[2]: Entering directory '/home/opc/ruby/build/master/ext/digest' I, [2024-05-07T13:55:40.992739 #197937] INFO -- : make[2]: Entering directory '/home/opc/ruby/build/master/ext/date' I, [2024-05-07T13:55:40.994154 #197937] INFO -- : make[2]: Leaving directory '/home/opc/ruby/build/master/ext/coverage' I, [2024-05-07T13:55:40.998036 #197937] INFO -- : make[2]: Leaving directory '/home/opc/ruby/build/master/ext/date' I, [2024-05-07T13:55:40.999636 #197937] INFO -- : make[2]: Leaving directory '/home/opc/ruby/build/master/ext/digest' I, [2024-05-07T13:55:41.006214 #197937] INFO -- : make[2]: Entering directory '/home/opc/ruby/build/master/ext/io/console' I, [2024-05-07T13:55:41.007628 #197937] INFO -- : make[2]: Entering directory '/home/opc/ruby/build/master/ext/fiddle' I, [2024-05-07T13:55:41.012030 #197937] INFO -- : make[2]: Leaving directory '/home/opc/ruby/build/master/ext/io/console' I, [2024-05-07T13:55:41.013904 #197937] INFO -- : make[2]: Entering directory '/home/opc/ruby/build/master/ext/json' I, [2024-05-07T13:55:41.015997 #197937] INFO -- : make[2]: Entering directory '/home/opc/ruby/build/master/ext/monitor' I, [2024-05-07T13:55:41.017632 #197937] INFO -- : make[2]: Leaving directory '/home/opc/ruby/build/master/ext/fiddle' I, [2024-05-07T13:55:41.020431 #197937] INFO -- : make[2]: Leaving directory '/home/opc/ruby/build/master/ext/monitor' I, [2024-05-07T13:55:41.023722 #197937] INFO -- : make[2]: Entering directory '/home/opc/ruby/build/master/ext/objspace' I, [2024-05-07T13:55:41.024531 #197937] INFO -- : make[2]: Leaving directory '/home/opc/ruby/build/master/ext/json' I, [2024-05-07T13:55:41.029206 #197937] INFO -- : make[2]: Entering directory '/home/opc/ruby/build/master/ext/pathname' I, [2024-05-07T13:55:41.032575 #197937] INFO -- : make[2]: Leaving directory '/home/opc/ruby/build/master/ext/objspace' I, [2024-05-07T13:55:41.035858 #197937] INFO -- : make[2]: Leaving directory '/home/opc/ruby/build/master/ext/pathname' I, [2024-05-07T13:55:41.038929 #197937] INFO -- : make[2]: Entering directory '/home/opc/ruby/build/master/ext/psych' I, [2024-05-07T13:55:41.040231 #197937] INFO -- : make[2]: Entering directory '/home/opc/ruby/build/master/ext/pty' I, [2024-05-07T13:55:41.040913 #197937] INFO -- : make[2]: Entering directory '/home/opc/ruby/build/master/ext/openssl' I, [2024-05-07T13:55:41.044577 #197937] INFO -- : make[2]: Leaving directory '/home/opc/ruby/build/master/ext/pty' I, [2024-05-07T13:55:41.056220 #197937] INFO -- : make[2]: Leaving directory '/home/opc/ruby/build/master/ext/psych' I, [2024-05-07T13:55:41.058126 #197937] INFO -- : make[2]: Entering directory '/home/opc/ruby/build/master/ext/rubyvm' I, [2024-05-07T13:55:41.061478 #197937] INFO -- : make[2]: Leaving directory '/home/opc/ruby/build/master/ext/rubyvm' I, [2024-05-07T13:55:41.061618 #197937] INFO -- : make[2]: Entering directory '/home/opc/ruby/build/master/ext/ripper' I, [2024-05-07T13:55:41.064146 #197937] INFO -- : make[2]: Leaving directory '/home/opc/ruby/build/master/ext/openssl' I, [2024-05-07T13:55:41.069202 #197937] INFO -- : make[2]: Leaving directory '/home/opc/ruby/build/master/ext/ripper' I, [2024-05-07T13:55:41.074242 #197937] INFO -- : make[2]: Entering directory '/home/opc/ruby/build/master/ext/socket' I, [2024-05-07T13:55:41.075629 #197937] INFO -- : make[2]: Entering directory '/home/opc/ruby/build/master/.bundle/gems/bigdecimal-3.1.7/ext/bigdecimal' I, [2024-05-07T13:55:41.076525 #197937] INFO -- : make[2]: Entering directory '/home/opc/ruby/build/master/.bundle/gems/bigdecimal-3.1.8/ext/bigdecimal' I, [2024-05-07T13:55:41.086444 #197937] INFO -- : make[2]: Leaving directory '/home/opc/ruby/build/master/ext/socket' I, [2024-05-07T13:55:41.088992 #197937] INFO -- : make[2]: Entering directory '/home/opc/ruby/build/master/.bundle/gems/debug-1.9.2/ext/debug' I, [2024-05-07T13:55:41.106860 #197937] INFO -- : make[2]: Leaving directory '/home/opc/ruby/build/master/.bundle/gems/bigdecimal-3.1.7/ext/bigdecimal' I, [2024-05-07T13:55:41.106925 #197937] INFO -- : make[2]: Leaving directory '/home/opc/ruby/build/master/.bundle/gems/bigdecimal-3.1.8/ext/bigdecimal' I, [2024-05-07T13:55:41.109395 #197937] INFO -- : make[2]: Entering directory '/home/opc/ruby/build/master/.bundle/gems/nkf-0.2.0/ext/nkf' I, [2024-05-07T13:55:41.111563 #197937] INFO -- : make[2]: Entering directory '/home/opc/ruby/build/master/.bundle/gems/racc-1.7.3/ext/racc/cparse' I, [2024-05-07T13:55:41.127251 #197937] INFO -- : make[2]: Leaving directory '/home/opc/ruby/build/master/.bundle/gems/debug-1.9.2/ext/debug' I, [2024-05-07T13:55:41.130252 #197937] INFO -- : make[2]: Entering directory '/home/opc/ruby/build/master/.bundle/gems/rbs-3.4.4/ext/rbs_extension' I, [2024-05-07T13:55:41.142976 #197937] INFO -- : make[2]: Leaving directory '/home/opc/ruby/build/master/.bundle/gems/racc-1.7.3/ext/racc/cparse' I, [2024-05-07T13:55:41.146381 #197937] INFO -- : make[2]: Leaving directory '/home/opc/ruby/build/master/.bundle/gems/nkf-0.2.0/ext/nkf' I, [2024-05-07T13:55:41.148935 #197937] INFO -- : make[2]: Entering directory '/home/opc/ruby/build/master/.bundle/gems/syslog-0.1.2/ext/syslog' I, [2024-05-07T13:55:41.162598 #197937] INFO -- : make[2]: Leaving directory '/home/opc/ruby/build/master/.bundle/gems/rbs-3.4.4/ext/rbs_extension' I, [2024-05-07T13:55:41.167182 #197937] INFO -- : make[2]: Entering directory '/home/opc/ruby/build/master/ext/digest/sha2' I, [2024-05-07T13:55:41.171821 #197937] INFO -- : make[2]: Leaving directory '/home/opc/ruby/build/master/ext/digest/sha2' I, [2024-05-07T13:55:41.178977 #197937] INFO -- : make[2]: Leaving directory '/home/opc/ruby/build/master/.bundle/gems/syslog-0.1.2/ext/syslog' I, [2024-05-07T13:55:41.216942 #197937] INFO -- : make[2]: Entering directory '/home/opc/ruby/build/master' I, [2024-05-07T13:55:41.299104 #197937] INFO -- : make[2]: 'ruby' is up to date. I, [2024-05-07T13:55:41.299195 #197937] INFO -- : make[2]: Leaving directory '/home/opc/ruby/build/master' I, [2024-05-07T13:55:41.299280 #197937] INFO -- : make[1]: Leaving directory '/home/opc/ruby/build/master' I, [2024-05-07T13:55:41.303684 #197937] INFO -- : make[1]: Entering directory '/home/opc/ruby/build/master' I, [2024-05-07T13:55:41.303738 #197937] INFO -- : make[1]: Nothing to be done for 'note'. I, [2024-05-07T13:55:41.303754 #197937] INFO -- : make[1]: Leaving directory '/home/opc/ruby/build/master' I, [2024-05-07T13:55:41.303931 #197937] INFO -- : ./miniruby -I/home/opc/ruby/src/master/lib -I. -I.ext/common /home/opc/ruby/src/master/tool/runruby.rb --extout=.ext -- --disable-gems -r./aarch64-linux-fake /home/opc/ruby/src/master/tool/rbinstall.rb --make="make" --dest-dir="" --extout=".ext" --ext-build-dir="./ext" --mflags="-j3 --jobserver-auth=4,5" --make-flags=" -j3 --jobserver-auth=4,5" --data-mode=0644 --prog-mode=0755 --installed-list .installed.list --mantype="doc" --gnumake --install=all --exclude=doc I, [2024-05-07T13:55:41.452229 #197937] INFO -- : Installing to I, [2024-05-07T13:55:41.452312 #197937] INFO -- : installing binary commands: /home/opc/ruby/install/master/bin I, [2024-05-07T13:55:41.464268 #197937] INFO -- : installing base libraries: /home/opc/ruby/install/master/lib I, [2024-05-07T13:55:41.464804 #197937] INFO -- : installing arch files: /home/opc/ruby/install/master/lib/ruby/3.4.0+0/aarch64-linux I, [2024-05-07T13:55:41.464923 #197937] INFO -- : installing pkgconfig data: /home/opc/ruby/install/master/lib/pkgconfig I, [2024-05-07T13:55:41.464998 #197937] INFO -- : installing extension objects: /home/opc/ruby/install/master/lib/ruby/3.4.0+0/aarch64-linux I, [2024-05-07T13:55:41.477514 #197937] INFO -- : installing extension objects: /home/opc/ruby/install/master/lib/ruby/site_ruby/3.4.0+0/aarch64-linux I, [2024-05-07T13:55:41.477538 #197937] INFO -- : installing extension objects: /home/opc/ruby/install/master/lib/ruby/vendor_ruby/3.4.0+0/aarch64-linux I, [2024-05-07T13:55:41.477660 #197937] INFO -- : installing extension headers: /home/opc/ruby/install/master/include/ruby-3.4.0+0/aarch64-linux I, [2024-05-07T13:55:41.477949 #197937] INFO -- : installing extension scripts: /home/opc/ruby/install/master/lib/ruby/3.4.0+0 I, [2024-05-07T13:55:41.486256 #197937] INFO -- : installing extension scripts: /home/opc/ruby/install/master/lib/ruby/site_ruby/3.4.0+0 I, [2024-05-07T13:55:41.486284 #197937] INFO -- : installing extension scripts: /home/opc/ruby/install/master/lib/ruby/vendor_ruby/3.4.0+0 I, [2024-05-07T13:55:41.486297 #197937] INFO -- : installing extension headers: /home/opc/ruby/install/master/include/ruby-3.4.0+0/ruby I, [2024-05-07T13:55:41.486404 #197937] INFO -- : installing command scripts: /home/opc/ruby/install/master/bin I, [2024-05-07T13:55:41.486535 #197937] INFO -- : installing library scripts: /home/opc/ruby/install/master/lib/ruby/3.4.0+0 I, [2024-05-07T13:55:41.571795 #197937] INFO -- : installing common headers: /home/opc/ruby/install/master/include/ruby-3.4.0+0 I, [2024-05-07T13:55:41.586365 #197937] INFO -- : installing manpages: /home/opc/ruby/install/master/share/man/man1 I, [2024-05-07T13:55:41.586631 #197937] INFO -- : installing default gems from lib: /home/opc/ruby/install/master/lib/ruby/gems/3.4.0+0 I, [2024-05-07T13:55:41.626307 #197937] INFO -- : benchmark 0.3.0 I, [2024-05-07T13:55:41.639730 #197937] INFO -- : bundler 2.6.0.dev I, [2024-05-07T13:55:41.644463 #197937] INFO -- : cgi 0.4.1 I, [2024-05-07T13:55:41.645656 #197937] INFO -- : delegate 0.3.1 I, [2024-05-07T13:55:41.646733 #197937] INFO -- : did_you_mean 1.6.3 I, [2024-05-07T13:55:41.647813 #197937] INFO -- : english 0.8.0 I, [2024-05-07T13:55:41.649210 #197937] INFO -- : erb 4.0.4 I, [2024-05-07T13:55:41.651757 #197937] INFO -- : error_highlight 0.6.0 I, [2024-05-07T13:55:41.652869 #197937] INFO -- : fileutils 1.7.2 I, [2024-05-07T13:55:41.653976 #197937] INFO -- : find 0.2.0 I, [2024-05-07T13:55:41.655069 #197937] INFO -- : forwardable 1.3.3 I, [2024-05-07T13:55:41.656151 #197937] INFO -- : ipaddr 1.2.6 I, [2024-05-07T13:55:41.657287 #197937] INFO -- : irb 1.13.1 I, [2024-05-07T13:55:41.660156 #197937] INFO -- : logger 1.6.0 I, [2024-05-07T13:55:41.661285 #197937] INFO -- : net-http 0.4.1 I, [2024-05-07T13:55:41.664172 #197937] INFO -- : net-protocol 0.2.2 I, [2024-05-07T13:55:41.665365 #197937] INFO -- : open-uri 0.4.1 I, [2024-05-07T13:55:41.666517 #197937] INFO -- : open3 0.2.1 I, [2024-05-07T13:55:41.667603 #197937] INFO -- : optparse 0.5.0 I, [2024-05-07T13:55:41.668732 #197937] INFO -- : ostruct 0.6.0 I, [2024-05-07T13:55:41.669834 #197937] INFO -- : pp 0.5.0 I, [2024-05-07T13:55:41.670959 #197937] INFO -- : prettyprint 0.2.0 I, [2024-05-07T13:55:41.672068 #197937] INFO -- : prism 0.27.0 I, [2024-05-07T13:55:41.673308 #197937] INFO -- : pstore 0.1.3 I, [2024-05-07T13:55:41.674407 #197937] INFO -- : rdoc 6.6.3.1 I, [2024-05-07T13:55:41.678527 #197937] INFO -- : readline 0.0.4 I, [2024-05-07T13:55:41.679620 #197937] INFO -- : reline 0.5.5 I, [2024-05-07T13:55:41.680837 #197937] INFO -- : resolv 0.4.0 I, [2024-05-07T13:55:41.681988 #197937] INFO -- : ruby2_keywords 0.0.5 I, [2024-05-07T13:55:41.683080 #197937] INFO -- : securerandom 0.3.1 I, [2024-05-07T13:55:41.684174 #197937] INFO -- : set 1.1.0 I, [2024-05-07T13:55:41.685337 #197937] INFO -- : shellwords 0.2.0 I, [2024-05-07T13:55:41.686454 #197937] INFO -- : singleton 0.2.0 I, [2024-05-07T13:55:41.687549 #197937] INFO -- : syntax_suggest 2.0.0 I, [2024-05-07T13:55:41.691674 #197937] INFO -- : tempfile 0.2.1 I, [2024-05-07T13:55:41.692848 #197937] INFO -- : time 0.3.0 I, [2024-05-07T13:55:41.694036 #197937] INFO -- : timeout 0.4.1 I, [2024-05-07T13:55:41.695123 #197937] INFO -- : tmpdir 0.2.0 I, [2024-05-07T13:55:41.696270 #197937] INFO -- : tsort 0.2.0 I, [2024-05-07T13:55:41.697432 #197937] INFO -- : un 0.3.0 I, [2024-05-07T13:55:41.698546 #197937] INFO -- : uri 0.13.0 I, [2024-05-07T13:55:41.699686 #197937] INFO -- : weakref 0.1.3 I, [2024-05-07T13:55:41.700823 #197937] INFO -- : yaml 0.3.0 I, [2024-05-07T13:55:41.701791 #197937] INFO -- : installing default gems from ext: /home/opc/ruby/install/master/lib/ruby/gems/3.4.0+0 I, [2024-05-07T13:55:41.711439 #197937] INFO -- : date 3.3.4 I, [2024-05-07T13:55:41.714232 #197937] INFO -- : digest 3.1.1 I, [2024-05-07T13:55:41.715352 #197937] INFO -- : etc 1.4.3 I, [2024-05-07T13:55:41.716530 #197937] INFO -- : fcntl 1.1.0 I, [2024-05-07T13:55:41.717686 #197937] INFO -- : fiddle 1.1.3 I, [2024-05-07T13:55:41.718821 #197937] INFO -- : io-console 0.7.2 I, [2024-05-07T13:55:41.719912 #197937] INFO -- : io-nonblock 0.3.0 I, [2024-05-07T13:55:41.721055 #197937] INFO -- : io-wait 0.3.1 I, [2024-05-07T13:55:41.722188 #197937] INFO -- : json 2.7.2 I, [2024-05-07T13:55:41.723403 #197937] INFO -- : openssl 3.2.0 I, [2024-05-07T13:55:41.724749 #197937] INFO -- : pathname 0.3.0 I, [2024-05-07T13:55:41.726374 #197937] INFO -- : psych 5.1.2 I, [2024-05-07T13:55:41.727614 #197937] INFO -- : stringio 3.1.1 I, [2024-05-07T13:55:41.728888 #197937] INFO -- : strscan 3.1.1 I, [2024-05-07T13:55:41.730026 #197937] INFO -- : zlib 3.1.0 I, [2024-05-07T13:55:41.730931 #197937] INFO -- : installing bundled gems: /home/opc/ruby/install/master/lib/ruby/gems/3.4.0+0 I, [2024-05-07T13:55:41.731563 #197937] INFO -- : minitest 5.22.3 I, [2024-05-07T13:55:41.745663 #197937] INFO -- : rake 13.2.1 I, [2024-05-07T13:55:41.758927 #197937] INFO -- : test-unit 3.6.2 I, [2024-05-07T13:55:41.775029 #197937] INFO -- : rexml 3.2.6 I, [2024-05-07T13:55:41.788767 #197937] INFO -- : rss 0.3.0 I, [2024-05-07T13:55:41.798537 #197937] INFO -- : net-ftp 0.3.4 I, [2024-05-07T13:55:41.802016 #197937] INFO -- : net-imap 0.4.10 I, [2024-05-07T13:55:41.819320 #197937] INFO -- : net-pop 0.1.2 I, [2024-05-07T13:55:41.823640 #197937] INFO -- : net-smtp 0.5.0 I, [2024-05-07T13:55:41.826932 #197937] INFO -- : matrix 0.4.2 I, [2024-05-07T13:55:41.832723 #197937] INFO -- : prime 0.1.2 I, [2024-05-07T13:55:41.843167 #197937] INFO -- : rbs 3.4.4 I, [2024-05-07T13:55:41.942794 #197937] INFO -- : typeprof 0.21.11 I, [2024-05-07T13:55:41.950706 #197937] INFO -- : debug 1.9.2 I, [2024-05-07T13:55:41.960378 #197937] INFO -- : racc 1.7.3 I, [2024-05-07T13:55:41.976232 #197937] INFO -- : mutex_m 0.2.0 I, [2024-05-07T13:55:41.979043 #197937] INFO -- : getoptlong 0.2.1 I, [2024-05-07T13:55:41.984503 #197937] INFO -- : base64 0.2.0 I, [2024-05-07T13:55:41.986872 #197937] INFO -- : bigdecimal 3.1.8 I, [2024-05-07T13:55:41.992871 #197937] INFO -- : observer 0.1.2 I, [2024-05-07T13:55:41.995707 #197937] INFO -- : abbrev 0.1.2 I, [2024-05-07T13:55:41.998657 #197937] INFO -- : resolv-replace 0.1.1 I, [2024-05-07T13:55:42.001587 #197937] INFO -- : rinda 0.2.0 I, [2024-05-07T13:55:42.004853 #197937] INFO -- : drb 2.2.1 I, [2024-05-07T13:55:42.009215 #197937] INFO -- : nkf 0.2.0 I, [2024-05-07T13:55:42.016511 #197937] INFO -- : syslog 0.1.2 I, [2024-05-07T13:55:42.020982 #197937] INFO -- : csv 3.3.0 I, [2024-05-07T13:55:42.029993 #197937] INFO -- : installing bundled gem cache: /home/opc/ruby/install/master/lib/ruby/gems/3.4.0+0/cache I, [2024-05-07T13:55:42.031945 #197937] INFO -- : skipped bundled gems: I, [2024-05-07T13:55:42.031963 #197937] INFO -- : power_assert-2.0.4dev.gem not found in bundled_gems I, [2024-05-07T13:55:42.034939 #197937] INFO -- : $$$[end] "make install -j3" exit with 0. I, [2024-05-07T13:55:42.035088 #197937] INFO -- : $$$[beg] make yes-btest TESTOPTS='-q -j3' I, [2024-05-07T13:56:03.418416 #197937] INFO -- : PASS all 1936 tests E, [2024-05-07T13:56:03.420094 #197937] ERROR -- : I, [2024-05-07T13:56:03.420222 #197937] INFO -- : $$$[end] "make yes-btest TESTOPTS='-q -j3'" exit with 0. I, [2024-05-07T13:56:03.420367 #197937] INFO -- : $$$[beg] make yes-test-basic TESTS='-j3' I, [2024-05-07T13:56:03.511789 #197937] INFO -- : BASERUBY = /usr/local/bin/ruby --disable=gems I, [2024-05-07T13:56:03.511861 #197937] INFO -- : CC = gcc I, [2024-05-07T13:56:03.511872 #197937] INFO -- : LD = ld I, [2024-05-07T13:56:03.511881 #197937] INFO -- : LDSHARED = gcc -shared I, [2024-05-07T13:56:03.514093 #197937] INFO -- : CFLAGS = -O3 -fno-fast-math -ggdb3 -Wall -Wextra -Wdeprecated-declarations -Wdiv-by-zero -Wduplicated-cond -Wimplicit-function-declaration -Wimplicit-int -Wpointer-arith -Wwrite-strings -Wold-style-definition -Wimplicit-fallthrough=0 -Wmissing-noreturn -Wno-cast-function-type -Wno-constant-logical-operand -Wno-long-long -Wno-missing-field-initializers -Wno-overlength-strings -Wno-packed-bitfield-compat -Wno-parentheses-equality -Wno-self-assign -Wno-tautological-compare -Wno-unused-parameter -Wno-unused-value -Wsuggest-attribute=format -Wsuggest-attribute=noreturn -Wunused-variable -Wmisleading-indentation -Wundef I, [2024-05-07T13:56:03.514149 #197937] INFO -- : XCFLAGS = -U_FORTIFY_SOURCE -D_FORTIFY_SOURCE=2 -fstack-protector-strong -msign-return-address=all -fno-strict-overflow -fvisibility=hidden -fexcess-precision=standard -DRUBY_EXPORT -fPIE -I. -I.ext/include/aarch64-linux -I/home/opc/ruby/src/master/include -I/home/opc/ruby/src/master -I/home/opc/ruby/src/master/prism -I/home/opc/ruby/src/master/enc/unicode/15.0.0 I, [2024-05-07T13:56:03.514175 #197937] INFO -- : CPPFLAGS = I, [2024-05-07T13:56:03.514184 #197937] INFO -- : DLDFLAGS = -Wl,--compress-debug-sections=zlib -fstack-protector-strong -pie I, [2024-05-07T13:56:03.514193 #197937] INFO -- : SOLIBS = -lz -lrt -lrt -ldl -lcrypt -lm -lpthread I, [2024-05-07T13:56:03.514201 #197937] INFO -- : LANG = en_US.UTF-8 I, [2024-05-07T13:56:03.514224 #197937] INFO -- : LC_ALL = I, [2024-05-07T13:56:03.514235 #197937] INFO -- : LC_CTYPE = I, [2024-05-07T13:56:03.514243 #197937] INFO -- : MFLAGS = I, [2024-05-07T13:56:03.514252 #197937] INFO -- : RUSTC = rustc I, [2024-05-07T13:56:03.514260 #197937] INFO -- : YJIT_RUSTC_ARGS = --crate-name=yjit --crate-type=staticlib --edition=2021 -g -C lto=thin -C opt-level=3 -C overflow-checks=on '--out-dir=/home/opc/ruby/build/master/yjit/target/release/' /home/opc/ruby/src/master/yjit/src/lib.rs I, [2024-05-07T13:56:03.514272 #197937] INFO -- : gcc (GCC) 8.5.0 20210514 (Red Hat 8.5.0-10.1.0.1) I, [2024-05-07T13:56:03.514280 #197937] INFO -- : Copyright (C) 2018 Free Software Foundation, Inc. I, [2024-05-07T13:56:03.514288 #197937] INFO -- : This is free software; see the source for copying conditions. There is NO I, [2024-05-07T13:56:03.514296 #197937] INFO -- : warranty; not even for MERCHANTABILITY or FITNESS FOR A PARTICULAR PURPOSE. I, [2024-05-07T13:56:03.514304 #197937] INFO -- : I, [2024-05-07T13:56:03.667838 #197937] INFO -- : Checking leaked global symbols...none I, [2024-05-07T13:56:03.719710 #197937] INFO -- : /home/opc/ruby/src/master/basictest/test.rb:assignment ....................................................................................................................................................................................................................................................................................................................................................................................OK 372 I, [2024-05-07T13:56:03.719785 #197937] INFO -- : /home/opc/ruby/src/master/basictest/test.rb:condition ..OK 2 I, [2024-05-07T13:56:03.719798 #197937] INFO -- : /home/opc/ruby/src/master/basictest/test.rb:if/unless ...OK 3 I, [2024-05-07T13:56:03.719852 #197937] INFO -- : /home/opc/ruby/src/master/basictest/test.rb:case .....OK 5 I, [2024-05-07T13:56:03.720413 #197937] INFO -- : /home/opc/ruby/src/master/basictest/test.rb:while/until ........OK 8 I, [2024-05-07T13:56:03.720548 #197937] INFO -- : /home/opc/ruby/src/master/basictest/test.rb:exception ..........OK 10 I, [2024-05-07T13:56:03.721193 #197937] INFO -- : /home/opc/ruby/src/master/basictest/test.rb:array .......................................OK 39 I, [2024-05-07T13:56:03.721452 #197937] INFO -- : /home/opc/ruby/src/master/basictest/test.rb:hash ...........................OK 27 I, [2024-05-07T13:56:03.723115 #197937] INFO -- : /home/opc/ruby/src/master/basictest/test.rb:iterator ...........................................................................................................OK 107 I, [2024-05-07T13:56:03.723848 #197937] INFO -- : /home/opc/ruby/src/master/basictest/test.rb:float ................................................................................OK 80 I, [2024-05-07T13:56:03.727440 #197937] INFO -- : /home/opc/ruby/src/master/basictest/test.rb:bignum ...............................OK 31 I, [2024-05-07T13:56:03.729018 #197937] INFO -- : /home/opc/ruby/src/master/basictest/test.rb:string & char ..............................................................OK 62 I, [2024-05-07T13:56:03.729095 #197937] INFO -- : /home/opc/ruby/src/master/basictest/test.rb:assignment ..........OK 10 I, [2024-05-07T13:56:03.729190 #197937] INFO -- : /home/opc/ruby/src/master/basictest/test.rb:call ......OK 6 I, [2024-05-07T13:56:03.729545 #197937] INFO -- : /home/opc/ruby/src/master/basictest/test.rb:proc .........OK 9 I, [2024-05-07T13:56:03.829903 #197937] INFO -- : /home/opc/ruby/src/master/basictest/test.rb:signal ..OK 2 I, [2024-05-07T13:56:03.831663 #197937] INFO -- : /home/opc/ruby/src/master/basictest/test.rb:eval ...........................OK 27 I, [2024-05-07T13:56:03.964572 #197937] INFO -- : /home/opc/ruby/src/master/basictest/test.rb:system ........OK 8 I, [2024-05-07T13:56:03.964666 #197937] INFO -- : /home/opc/ruby/src/master/basictest/test.rb:const .....OK 5 I, [2024-05-07T13:56:03.964850 #197937] INFO -- : /home/opc/ruby/src/master/basictest/test.rb:clone .....OK 5 I, [2024-05-07T13:56:03.965643 #197937] INFO -- : /home/opc/ruby/src/master/basictest/test.rb:marshal ....OK 4 I, [2024-05-07T13:56:03.965775 #197937] INFO -- : /home/opc/ruby/src/master/basictest/test.rb:pack ....OK 4 I, [2024-05-07T13:56:03.965806 #197937] INFO -- : /home/opc/ruby/src/master/basictest/test.rb:math ..OK 2 I, [2024-05-07T13:56:03.965960 #197937] INFO -- : /home/opc/ruby/src/master/basictest/test.rb:struct ......OK 6 I, [2024-05-07T13:56:03.966131 #197937] INFO -- : /home/opc/ruby/src/master/basictest/test.rb:variable ............OK 12 I, [2024-05-07T13:56:03.966173 #197937] INFO -- : /home/opc/ruby/src/master/basictest/test.rb:trace ...OK 3 I, [2024-05-07T13:56:03.966304 #197937] INFO -- : /home/opc/ruby/src/master/basictest/test.rb:defined? ............OK 12 I, [2024-05-07T13:56:03.966391 #197937] INFO -- : /home/opc/ruby/src/master/basictest/test.rb:alias ......OK 6 I, [2024-05-07T13:56:03.966883 #197937] INFO -- : /home/opc/ruby/src/master/basictest/test.rb:path .......................OK 23 I, [2024-05-07T13:56:04.034442 #197937] INFO -- : /home/opc/ruby/src/master/basictest/test.rb:gc ....OK 4 I, [2024-05-07T13:56:04.036524 #197937] INFO -- : I, [2024-05-07T13:56:04.036558 #197937] INFO -- : test succeeded I, [2024-05-07T13:56:04.037242 #197937] INFO -- : $$$[end] "make yes-test-basic TESTS='-j3'" exit with 0. I, [2024-05-07T13:56:04.037597 #197937] INFO -- : $$$[beg] make yes-test-all TESTOPTS='--stderr-on-failure' TESTS='-j3' I, [2024-05-07T13:56:04.160927 #197937] INFO -- : BASERUBY = /usr/local/bin/ruby --disable=gems I, [2024-05-07T13:56:04.161004 #197937] INFO -- : CC = gcc I, [2024-05-07T13:56:04.161015 #197937] INFO -- : LD = ld I, [2024-05-07T13:56:04.161024 #197937] INFO -- : LDSHARED = gcc -shared I, [2024-05-07T13:56:04.161036 #197937] INFO -- : CFLAGS = -O3 -fno-fast-math -ggdb3 -Wall -Wextra -Wdeprecated-declarations -Wdiv-by-zero -Wduplicated-cond -Wimplicit-function-declaration -Wimplicit-int -Wpointer-arith -Wwrite-strings -Wold-style-definition -Wimplicit-fallthrough=0 -Wmissing-noreturn -Wno-cast-function-type -Wno-constant-logical-operand -Wno-long-long -Wno-missing-field-initializers -Wno-overlength-strings -Wno-packed-bitfield-compat -Wno-parentheses-equality -Wno-self-assign -Wno-tautological-compare -Wno-unused-parameter -Wno-unused-value -Wsuggest-attribute=format -Wsuggest-attribute=noreturn -Wunused-variable -Wmisleading-indentation -Wundef I, [2024-05-07T13:56:04.161046 #197937] INFO -- : XCFLAGS = -U_FORTIFY_SOURCE -D_FORTIFY_SOURCE=2 -fstack-protector-strong -msign-return-address=all -fno-strict-overflow -fvisibility=hidden -fexcess-precision=standard -DRUBY_EXPORT -fPIE -I. -I.ext/include/aarch64-linux -I/home/opc/ruby/src/master/include -I/home/opc/ruby/src/master -I/home/opc/ruby/src/master/prism -I/home/opc/ruby/src/master/enc/unicode/15.0.0 I, [2024-05-07T13:56:04.161055 #197937] INFO -- : CPPFLAGS = I, [2024-05-07T13:56:04.161064 #197937] INFO -- : DLDFLAGS = -Wl,--compress-debug-sections=zlib -fstack-protector-strong -pie I, [2024-05-07T13:56:04.161073 #197937] INFO -- : SOLIBS = -lz -lrt -lrt -ldl -lcrypt -lm -lpthread I, [2024-05-07T13:56:04.161081 #197937] INFO -- : LANG = en_US.UTF-8 I, [2024-05-07T13:56:04.161089 #197937] INFO -- : LC_ALL = I, [2024-05-07T13:56:04.161097 #197937] INFO -- : LC_CTYPE = I, [2024-05-07T13:56:04.161105 #197937] INFO -- : MFLAGS = I, [2024-05-07T13:56:04.161140 #197937] INFO -- : RUSTC = rustc I, [2024-05-07T13:56:04.161149 #197937] INFO -- : YJIT_RUSTC_ARGS = --crate-name=yjit --crate-type=staticlib --edition=2021 -g -C lto=thin -C opt-level=3 -C overflow-checks=on '--out-dir=/home/opc/ruby/build/master/yjit/target/release/' /home/opc/ruby/src/master/yjit/src/lib.rs I, [2024-05-07T13:56:04.161841 #197937] INFO -- : gcc (GCC) 8.5.0 20210514 (Red Hat 8.5.0-10.1.0.1) I, [2024-05-07T13:56:04.161863 #197937] INFO -- : Copyright (C) 2018 Free Software Foundation, Inc. I, [2024-05-07T13:56:04.161872 #197937] INFO -- : This is free software; see the source for copying conditions. There is NO I, [2024-05-07T13:56:04.161881 #197937] INFO -- : warranty; not even for MERCHANTABILITY or FITNESS FOR A PARTICULAR PURPOSE. I, [2024-05-07T13:56:04.161890 #197937] INFO -- : I, [2024-05-07T13:56:04.163855 #197937] INFO -- : generating enc.mk I, [2024-05-07T13:56:04.399256 #197937] INFO -- : making enc I, [2024-05-07T13:56:04.426444 #197937] INFO -- : make[1]: Entering directory '/home/opc/ruby/build/master' I, [2024-05-07T13:56:04.426514 #197937] INFO -- : make[1]: Nothing to be done for 'enc'. I, [2024-05-07T13:56:04.426525 #197937] INFO -- : make[1]: Leaving directory '/home/opc/ruby/build/master' I, [2024-05-07T13:56:04.427264 #197937] INFO -- : making srcs under enc I, [2024-05-07T13:56:04.469269 #197937] INFO -- : make[1]: Entering directory '/home/opc/ruby/build/master' I, [2024-05-07T13:56:04.469329 #197937] INFO -- : make[1]: Nothing to be done for 'srcs'. I, [2024-05-07T13:56:04.469340 #197937] INFO -- : make[1]: Leaving directory '/home/opc/ruby/build/master' I, [2024-05-07T13:56:04.470754 #197937] INFO -- : generating transdb.h I, [2024-05-07T13:56:04.613994 #197937] INFO -- : transdb.h unchanged I, [2024-05-07T13:56:04.615293 #197937] INFO -- : making trans I, [2024-05-07T13:56:04.663605 #197937] INFO -- : make[1]: Entering directory '/home/opc/ruby/build/master' I, [2024-05-07T13:56:04.663674 #197937] INFO -- : make[1]: Nothing to be done for 'trans'. I, [2024-05-07T13:56:04.663693 #197937] INFO -- : make[1]: Leaving directory '/home/opc/ruby/build/master' I, [2024-05-07T13:56:04.664435 #197937] INFO -- : making encs I, [2024-05-07T13:56:04.716723 #197937] INFO -- : make[1]: Entering directory '/home/opc/ruby/build/master' I, [2024-05-07T13:56:04.716803 #197937] INFO -- : make[1]: Nothing to be done for 'encs'. I, [2024-05-07T13:56:04.716817 #197937] INFO -- : make[1]: Leaving directory '/home/opc/ruby/build/master' I, [2024-05-07T13:56:04.718736 #197937] INFO -- : generating makefiles ext/configure-ext.mk I, [2024-05-07T13:56:04.758598 #197937] INFO -- : ext/configure-ext.mk updated I, [2024-05-07T13:56:04.761975 #197937] INFO -- : make[1]: Entering directory '/home/opc/ruby/build/master' I, [2024-05-07T13:56:06.857331 #197937] INFO -- : make[1]: Leaving directory '/home/opc/ruby/build/master' I, [2024-05-07T13:56:06.858018 #197937] INFO -- : generating makefile exts.mk I, [2024-05-07T13:56:06.916661 #197937] INFO -- : exts.mk unchanged I, [2024-05-07T13:56:06.921927 #197937] INFO -- : make[1]: Entering directory '/home/opc/ruby/build/master' I, [2024-05-07T13:56:07.221293 #197937] INFO -- : make[2]: Entering directory '/home/opc/ruby/build/master/ext/coverage' I, [2024-05-07T13:56:07.225806 #197937] INFO -- : make[2]: Leaving directory '/home/opc/ruby/build/master/ext/coverage' I, [2024-05-07T13:56:07.231346 #197937] INFO -- : make[2]: Entering directory '/home/opc/ruby/build/master/ext/date' I, [2024-05-07T13:56:07.236466 #197937] INFO -- : make[2]: Leaving directory '/home/opc/ruby/build/master/ext/date' I, [2024-05-07T13:56:07.239902 #197937] INFO -- : make[2]: Entering directory '/home/opc/ruby/build/master/ext/digest' I, [2024-05-07T13:56:07.248845 #197937] INFO -- : make[2]: Leaving directory '/home/opc/ruby/build/master/ext/digest' I, [2024-05-07T13:56:07.271149 #197937] INFO -- : make[2]: Entering directory '/home/opc/ruby/build/master/ext/digest/sha2' I, [2024-05-07T13:56:07.276157 #197937] INFO -- : make[2]: Leaving directory '/home/opc/ruby/build/master/ext/digest/sha2' I, [2024-05-07T13:56:07.294179 #197937] INFO -- : make[2]: Entering directory '/home/opc/ruby/build/master/ext/fiddle' I, [2024-05-07T13:56:07.304206 #197937] INFO -- : make[2]: Leaving directory '/home/opc/ruby/build/master/ext/fiddle' I, [2024-05-07T13:56:07.308452 #197937] INFO -- : make[2]: Entering directory '/home/opc/ruby/build/master/ext/io/console' I, [2024-05-07T13:56:07.312744 #197937] INFO -- : make[2]: Leaving directory '/home/opc/ruby/build/master/ext/io/console' I, [2024-05-07T13:56:07.323533 #197937] INFO -- : make[2]: Entering directory '/home/opc/ruby/build/master/ext/json' I, [2024-05-07T13:56:07.332897 #197937] INFO -- : make[2]: Leaving directory '/home/opc/ruby/build/master/ext/json' I, [2024-05-07T13:56:07.345885 #197937] INFO -- : make[2]: Entering directory '/home/opc/ruby/build/master/ext/monitor' I, [2024-05-07T13:56:07.350134 #197937] INFO -- : make[2]: Leaving directory '/home/opc/ruby/build/master/ext/monitor' I, [2024-05-07T13:56:07.356152 #197937] INFO -- : make[2]: Entering directory '/home/opc/ruby/build/master/ext/objspace' I, [2024-05-07T13:56:07.362473 #197937] INFO -- : make[2]: Leaving directory '/home/opc/ruby/build/master/ext/objspace' I, [2024-05-07T13:56:07.381387 #197937] INFO -- : make[2]: Entering directory '/home/opc/ruby/build/master/ext/openssl' I, [2024-05-07T13:56:07.403830 #197937] INFO -- : make[2]: Leaving directory '/home/opc/ruby/build/master/ext/openssl' I, [2024-05-07T13:56:07.408040 #197937] INFO -- : make[2]: Entering directory '/home/opc/ruby/build/master/ext/pathname' I, [2024-05-07T13:56:07.412287 #197937] INFO -- : make[2]: Leaving directory '/home/opc/ruby/build/master/ext/pathname' I, [2024-05-07T13:56:07.418723 #197937] INFO -- : make[2]: Entering directory '/home/opc/ruby/build/master/ext/psych' I, [2024-05-07T13:56:07.440054 #197937] INFO -- : make[2]: Leaving directory '/home/opc/ruby/build/master/ext/psych' I, [2024-05-07T13:56:07.444628 #197937] INFO -- : make[2]: Entering directory '/home/opc/ruby/build/master/ext/pty' I, [2024-05-07T13:56:07.448846 #197937] INFO -- : make[2]: Leaving directory '/home/opc/ruby/build/master/ext/pty' I, [2024-05-07T13:56:07.462137 #197937] INFO -- : make[2]: Entering directory '/home/opc/ruby/build/master/ext/ripper' I, [2024-05-07T13:56:07.469944 #197937] INFO -- : make[2]: Leaving directory '/home/opc/ruby/build/master/ext/ripper' I, [2024-05-07T13:56:07.471836 #197937] INFO -- : make[2]: Entering directory '/home/opc/ruby/build/master/ext/rubyvm' I, [2024-05-07T13:56:07.475254 #197937] INFO -- : make[2]: Leaving directory '/home/opc/ruby/build/master/ext/rubyvm' I, [2024-05-07T13:56:07.487190 #197937] INFO -- : make[2]: Entering directory '/home/opc/ruby/build/master/ext/socket' I, [2024-05-07T13:56:07.498392 #197937] INFO -- : make[2]: Leaving directory '/home/opc/ruby/build/master/ext/socket' I, [2024-05-07T13:56:07.513894 #197937] INFO -- : make[2]: Entering directory '/home/opc/ruby/build/master/.bundle/gems/bigdecimal-3.1.7/ext/bigdecimal' I, [2024-05-07T13:56:07.544999 #197937] INFO -- : make[2]: Leaving directory '/home/opc/ruby/build/master/.bundle/gems/bigdecimal-3.1.7/ext/bigdecimal' I, [2024-05-07T13:56:07.547740 #197937] INFO -- : make[2]: Entering directory '/home/opc/ruby/build/master/.bundle/gems/bigdecimal-3.1.8/ext/bigdecimal' I, [2024-05-07T13:56:07.578227 #197937] INFO -- : make[2]: Leaving directory '/home/opc/ruby/build/master/.bundle/gems/bigdecimal-3.1.8/ext/bigdecimal' I, [2024-05-07T13:56:07.580721 #197937] INFO -- : make[2]: Entering directory '/home/opc/ruby/build/master/.bundle/gems/debug-1.9.2/ext/debug' I, [2024-05-07T13:56:07.613087 #197937] INFO -- : make[2]: Leaving directory '/home/opc/ruby/build/master/.bundle/gems/debug-1.9.2/ext/debug' I, [2024-05-07T13:56:07.615729 #197937] INFO -- : make[2]: Entering directory '/home/opc/ruby/build/master/.bundle/gems/nkf-0.2.0/ext/nkf' I, [2024-05-07T13:56:07.645852 #197937] INFO -- : make[2]: Leaving directory '/home/opc/ruby/build/master/.bundle/gems/nkf-0.2.0/ext/nkf' I, [2024-05-07T13:56:07.648452 #197937] INFO -- : make[2]: Entering directory '/home/opc/ruby/build/master/.bundle/gems/racc-1.7.3/ext/racc/cparse' I, [2024-05-07T13:56:07.678768 #197937] INFO -- : make[2]: Leaving directory '/home/opc/ruby/build/master/.bundle/gems/racc-1.7.3/ext/racc/cparse' I, [2024-05-07T13:56:07.681667 #197937] INFO -- : make[2]: Entering directory '/home/opc/ruby/build/master/.bundle/gems/rbs-3.4.4/ext/rbs_extension' I, [2024-05-07T13:56:07.711591 #197937] INFO -- : make[2]: Leaving directory '/home/opc/ruby/build/master/.bundle/gems/rbs-3.4.4/ext/rbs_extension' I, [2024-05-07T13:56:07.714024 #197937] INFO -- : make[2]: Entering directory '/home/opc/ruby/build/master/.bundle/gems/syslog-0.1.2/ext/syslog' I, [2024-05-07T13:56:07.743905 #197937] INFO -- : make[2]: Leaving directory '/home/opc/ruby/build/master/.bundle/gems/syslog-0.1.2/ext/syslog' I, [2024-05-07T13:56:07.782161 #197937] INFO -- : make[2]: Entering directory '/home/opc/ruby/build/master' I, [2024-05-07T13:56:07.865666 #197937] INFO -- : make[2]: 'ruby' is up to date. I, [2024-05-07T13:56:07.865744 #197937] INFO -- : make[2]: Leaving directory '/home/opc/ruby/build/master' I, [2024-05-07T13:56:07.865849 #197937] INFO -- : make[1]: Leaving directory '/home/opc/ruby/build/master' I, [2024-05-07T13:56:07.870260 #197937] INFO -- : make[1]: Entering directory '/home/opc/ruby/build/master' I, [2024-05-07T13:56:07.870280 #197937] INFO -- : make[1]: Nothing to be done for 'note'. I, [2024-05-07T13:56:07.870290 #197937] INFO -- : make[1]: Leaving directory '/home/opc/ruby/build/master' I, [2024-05-07T13:56:07.982982 #197937] INFO -- : Run options: I, [2024-05-07T13:56:07.983057 #197937] INFO -- : --seed=53575 I, [2024-05-07T13:56:07.983068 #197937] INFO -- : "--ruby=./miniruby -I/home/opc/ruby/src/master/lib -I. -I.ext/common /home/opc/ruby/src/master/tool/runruby.rb --extout=.ext -- --disable-gems" I, [2024-05-07T13:56:07.983077 #197937] INFO -- : --excludes-dir=/home/opc/ruby/src/master/test/.excludes I, [2024-05-07T13:56:07.983086 #197937] INFO -- : --name=!/memory_leak/ I, [2024-05-07T13:56:07.983094 #197937] INFO -- : --stderr-on-failure I, [2024-05-07T13:56:07.983103 #197937] INFO -- : -j3 I, [2024-05-07T13:56:07.983111 #197937] INFO -- : I, [2024-05-07T13:56:07.983119 #197937] INFO -- : # Running tests: I, [2024-05-07T13:56:07.983127 #197937] INFO -- : I, [2024-05-07T13:56:08.112137 #197937] INFO -- : [ 1/885] 238918=parser_test I, [2024-05-07T13:56:08.118319 #197937] INFO -- : [ 2/885] 238919=test_hash I, [2024-05-07T13:56:08.132101 #197937] INFO -- : [ 3/885] 238920=test_http I, [2024-05-07T13:56:08.144610 #197937] INFO -- : [ 4/885] 238920=test_gem_dependency_installer I, [2024-05-07T13:56:08.184020 #197937] INFO -- : [ 5/885] 238918=test_pty I, [2024-05-07T13:56:08.189819 #197937] INFO -- : .Leaked file descriptor: TestPTY#test_open_with_block: 8 # I, [2024-05-07T13:56:08.216975 #197937] INFO -- : COMMAND PID USER FD TYPE DEVICE SIZE/OFF NODE NAME I, [2024-05-07T13:56:08.217047 #197937] INFO -- : ruby 238918 opc 8r REG 252,0 6940392 13705429 /var/lib/sss/mc/group I, [2024-05-07T13:56:08.714934 #197937] INFO -- : [ 6/885] 238918=test_gem_package_old I, [2024-05-07T13:56:08.921850 #197937] INFO -- : [ 7/885] 238918=test_gem_commands_which_command I, [2024-05-07T13:56:08.998578 #197937] INFO -- : [ 8/885] 238918=test_gem_request I, [2024-05-07T13:56:09.228540 #197937] INFO -- : [ 9/885] 238918=test_scan_args I, [2024-05-07T13:56:09.241887 #197937] INFO -- : [ 10/885] 238918=test_gem_commands_specification_command I, [2024-05-07T13:56:09.472808 #197937] INFO -- : [ 11/885] 238918=encoding_test I, [2024-05-07T13:56:09.559224 #197937] INFO -- : [ 12/885] 238918=test_sprintf_comb I, [2024-05-07T13:56:09.690253 #197937] INFO -- : [ 13/885] 238918=test_method_cache I, [2024-05-07T13:56:09.704775 #197937] INFO -- : [ 14/885] 238918=test_too_many_dummy_encodings I, [2024-05-07T13:56:09.772797 #197937] INFO -- : [ 15/885] 238918=locals_test I, [2024-05-07T13:56:10.191745 #197937] INFO -- : [ 16/885] 238918=test_gem_commands_push_command I, [2024-05-07T13:56:10.765744 #197937] INFO -- : [ 17/885] 238918=test_gem_text I, [2024-05-07T13:56:10.851881 #197937] INFO -- : [ 18/885] 238918=test_settracefunc I, [2024-05-07T13:56:11.031952 #197937] INFO -- : [ 19/885] 238920=test_tracepoint I, [2024-05-07T13:56:11.277210 #197937] INFO -- : [ 20/885] 238920=test_backtrace I, [2024-05-07T13:56:11.349852 #197937] INFO -- : [ 21/885] 238919=test_rdoc_task I, [2024-05-07T13:56:11.361040 #197937] INFO -- : [ 22/885] 238919=test_gem_gemcutter_utilities I, [2024-05-07T13:56:11.636865 #197937] INFO -- : [ 23/885] 238918=test_internal_ivar I, [2024-05-07T13:56:11.637914 #197937] INFO -- : [ 24/885] 238918=test_win32ole I, [2024-05-07T13:56:11.674936 #197937] INFO -- : [ 25/885] 238918=test_gem_source_local I, [2024-05-07T13:56:11.892651 #197937] INFO -- : [ 26/885] 238918=desugar_compiler_test I, [2024-05-07T13:56:11.904339 #197937] INFO -- : [ 27/885] 238918=test_rendering I, [2024-05-07T13:56:11.954230 #197937] INFO -- : [ 28/885] 238919=attribute_write_test I, [2024-05-07T13:56:11.980971 #197937] INFO -- : [ 29/885] 238918=test_http I, [2024-05-07T13:56:12.027049 #197937] INFO -- : [ 30/885] 238919=test_utf16 I, [2024-05-07T13:56:12.043012 #197937] INFO -- : [ 31/885] 238919=test_set I, [2024-05-07T13:56:12.069913 #197937] INFO -- : [ 32/885] 238919=test_str2big I, [2024-05-07T13:56:12.073085 #197937] INFO -- : [ 33/885] 238919=test_gem_package_tar_writer I, [2024-05-07T13:56:12.179165 #197937] INFO -- : [ 34/885] 238919=test_case I, [2024-05-07T13:56:12.189412 #197937] INFO -- : [ 35/885] 238919=test_ractor I, [2024-05-07T13:56:12.198521 #197937] INFO -- : [ 36/885] 238919=test_severity I, [2024-05-07T13:56:12.234511 #197937] INFO -- : [ 37/885] 238919=test_rdoc_markup_to_rdoc I, [2024-05-07T13:56:12.407429 #197937] INFO -- : [ 38/885] 238919=test_method I, [2024-05-07T13:56:12.549849 #197937] INFO -- : [ 39/885] 238920=test_m17n I, [2024-05-07T13:56:12.611742 #197937] INFO -- : [ 40/885] 238920=test_gem_dependency I, [2024-05-07T13:56:12.794303 #197937] INFO -- : [ 41/885] 238920=test_gem_uninstaller I, [2024-05-07T13:56:13.900797 #197937] INFO -- : [ 42/885] 238920=test_cclass I, [2024-05-07T13:56:14.001001 #197937] INFO -- : [ 43/885] 238920=test_yjit I, [2024-05-07T13:56:14.020269 #197937] INFO -- : [ 44/885] 238920=test_yaml I, [2024-05-07T13:56:14.100914 #197937] INFO -- : [ 45/885] 238920=test_x509name I, [2024-05-07T13:56:14.118390 #197937] INFO -- : [ 46/885] 238920=test_argf I, [2024-05-07T13:56:15.906302 #197937] INFO -- : [ 47/885] 238919=test_koi8 I, [2024-05-07T13:56:15.911659 #197937] INFO -- : [ 48/885] 238919=test_json_tree I, [2024-05-07T13:56:15.970985 #197937] INFO -- : [ 49/885] 238919=test_gem_remote_fetcher I, [2024-05-07T13:56:17.589175 #197937] INFO -- : [ 50/885] 238920=test_pkcs12 I, [2024-05-07T13:56:17.748644 #197937] INFO -- : [ 51/885] 238919=test_parser_events I, [2024-05-07T13:56:17.807344 #197937] INFO -- : [ 52/885] 238919=test_filter I, [2024-05-07T13:56:17.858786 #197937] INFO -- : [ 53/885] 238919=test_system I, [2024-05-07T13:56:18.279238 #197937] INFO -- : [ 54/885] 238920=test_numhash I, [2024-05-07T13:56:18.283937 #197937] INFO -- : [ 55/885] 238920=test_flush I, [2024-05-07T13:56:18.294722 #197937] INFO -- : [ 56/885] 238920=test_pkey_rsa I, [2024-05-07T13:56:18.611195 #197937] INFO -- : [ 57/885] 238920=test_gem_specification I, [2024-05-07T13:56:18.669895 #197937] INFO -- : [ 58/885] 238919=test_win32ole_variable I, [2024-05-07T13:56:18.672990 #197937] INFO -- : [ 59/885] 238919=test_method_cache I, [2024-05-07T13:56:18.697517 #197937] INFO -- : [ 60/885] 238919=test_rdoc_class_module I, [2024-05-07T13:56:19.224251 #197937] INFO -- : [ 61/885] 238919=test_parse I, [2024-05-07T13:56:19.669290 #197937] INFO -- : [ 62/885] 238919=test_rdoc_cross_reference I, [2024-05-07T13:56:20.018644 #197937] INFO -- : [ 63/885] 238919=test_emoji I, [2024-05-07T13:56:20.046443 #197937] INFO -- : [ 64/885] 238919=test_sorted_set I, [2024-05-07T13:56:20.233267 #197937] INFO -- : [ 65/885] 238919=test_stack I, [2024-05-07T13:56:20.731588 #197937] INFO -- : [ 66/885] 238918=test_windows_1252 I, [2024-05-07T13:56:20.737942 #197937] INFO -- : [ 67/885] 238918=test_gem_dependency_resolution_error I, [2024-05-07T13:56:20.753350 #197937] INFO -- : [ 68/885] 238918=test_fileutils I, [2024-05-07T13:56:20.883441 #197937] INFO -- : [ 69/885] 238920=test_mixed_unicode_escapes I, [2024-05-07T13:56:20.889917 #197937] INFO -- : [ 70/885] 238920=test_sleep I, [2024-05-07T13:56:21.021610 #197937] INFO -- : [ 71/885] 238919=test_jaro_winkler I, [2024-05-07T13:56:21.030257 #197937] INFO -- : [ 72/885] 238919=test_cp949 I, [2024-05-07T13:56:21.031664 #197937] INFO -- : [ 73/885] 238919=test_gem_resolver_vendor_set I, [2024-05-07T13:56:21.064219 #197937] INFO -- : [ 74/885] 238919=test_condition I, [2024-05-07T13:56:21.086502 #197937] INFO -- : [ 75/885] 238919=test_gem_install_update_options I, [2024-05-07T13:56:21.221669 #197937] INFO -- : [ 76/885] 238919=test_econv I, [2024-05-07T13:56:21.235167 #197937] INFO -- : Leaked file descriptor: TestFileUtils#test_chown_error: 9 # I, [2024-05-07T13:56:21.263466 #197937] INFO -- : COMMAND PID USER FD TYPE DEVICE SIZE/OFF NODE NAME I, [2024-05-07T13:56:21.263539 #197937] INFO -- : ruby 238918 opc 9r REG 252,0 9253600 13705411 /var/lib/sss/mc/passwd I, [2024-05-07T13:56:21.409966 #197937] INFO -- : [ 77/885] 238918=test_stringchar I, [2024-05-07T13:56:21.483389 #197937] INFO -- : [ 78/885] 238918=warnings_test I, [2024-05-07T13:56:21.498829 #197937] INFO -- : [ 79/885] 238918=test_face I, [2024-05-07T13:56:21.526248 #197937] INFO -- : [ 80/885] 238918=test_gem_request_set_lockfile_parser I, [2024-05-07T13:56:22.024522 #197937] INFO -- : [ 81/885] 238918=test_sizeof I, [2024-05-07T13:56:22.073194 #197937] INFO -- : [ 82/885] 238919=test_date_attr I, [2024-05-07T13:56:22.104643 #197937] INFO -- : [ 83/885] 238919=test_pinned I, [2024-05-07T13:56:22.139268 #197937] INFO -- : [ 84/885] 238919=test_cgi_tag_helper I, [2024-05-07T13:56:22.167706 #197937] INFO -- : [ 85/885] 238919=test_pack I, [2024-05-07T13:56:22.194157 #197937] INFO -- : [ 86/885] 238919=test_weakmap I, [2024-05-07T13:56:22.938553 #197937] INFO -- : [ 87/885] 238920=test_coderange I, [2024-05-07T13:56:23.007629 #197937] INFO -- : [ 88/885] 238920=test_ansi_with_terminfo I, [2024-05-07T13:56:23.015716 #197937] INFO -- : [ 89/885] 238920=test_inadvertent_creation I, [2024-05-07T13:56:23.122477 #197937] INFO -- : [ 90/885] 238920=test_framework I, [2024-05-07T13:56:23.131139 #197937] INFO -- : [ 91/885] 238920=test_date_time I, [2024-05-07T13:56:23.143058 #197937] INFO -- : [ 92/885] 238920=test_nil2vtempty I, [2024-05-07T13:56:23.344867 #197937] INFO -- : [ 93/885] 238920=test_rdoc_generator_json_index I, [2024-05-07T13:56:23.373511 #197937] INFO -- : [ 94/885] 238920=test_array I, [2024-05-07T13:56:23.386842 #197937] INFO -- : [ 95/885] 238920=test_gem_command_manager I, [2024-05-07T13:56:23.601418 #197937] INFO -- : [ 96/885] 238920=test_rdoc_context I, [2024-05-07T13:56:24.007891 #197937] INFO -- : [ 97/885] 238918=test_enc_associate I, [2024-05-07T13:56:24.308765 #197937] INFO -- : [ 98/885] 238920=test_enumerator I, [2024-05-07T13:56:24.464966 #197937] INFO -- : [ 99/885] 238918=test_case I, [2024-05-07T13:56:24.510764 #197937] INFO -- : [100/885] 238918=test_open-uri I, [2024-05-07T13:56:24.874794 #197937] INFO -- : [101/885] 238918=test_exit I, [2024-05-07T13:56:25.007028 #197937] INFO -- : [102/885] 238918=test_class I, [2024-05-07T13:56:26.804461 #197937] INFO -- : [103/885] 238919=test_rdoc_parser_rd I, [2024-05-07T13:56:26.808603 #197937] INFO -- : [104/885] 238919=index_write_test I, [2024-05-07T13:56:26.817909 #197937] INFO -- : [105/885] 238919=test_const I, [2024-05-07T13:56:26.831437 #197937] INFO -- : [106/885] 238919=test_gem_commands_sources_command I, [2024-05-07T13:56:27.045890 #197937] INFO -- : [107/885] 238919=json_addition_test I, [2024-05-07T13:56:27.056524 #197937] INFO -- : [108/885] 238919=test_gem_source_list I, [2024-05-07T13:56:27.124122 #197937] INFO -- : [109/885] 238919=test_name_error I, [2024-05-07T13:56:27.207054 #197937] INFO -- : [110/885] 238919=test_recorder I, [2024-05-07T13:56:27.216797 #197937] INFO -- : [111/885] 238919=test_yaml_special_cases I, [2024-05-07T13:56:27.332097 #197937] INFO -- : [112/885] 238919=test_sprintf I, [2024-05-07T13:56:27.410451 #197937] INFO -- : [113/885] 238919=test_safe_load I, [2024-05-07T13:56:27.446103 #197937] INFO -- : [114/885] 238919=ripper_test I, [2024-05-07T13:56:27.907048 #197937] INFO -- : [115/885] 238919=test_iso_8859 I, [2024-05-07T13:56:27.952440 #197937] INFO -- : [116/885] 238919=test_libs I, [2024-05-07T13:56:27.963416 #197937] INFO -- : [117/885] 238919=test_math I, [2024-05-07T13:56:28.003553 #197937] INFO -- : [118/885] 238919=test_qsort I, [2024-05-07T13:56:28.009065 #197937] INFO -- : [119/885] 238919=comments_test I, [2024-05-07T13:56:28.010835 #197937] INFO -- : [120/885] 238919=test_gc I, [2024-05-07T13:56:28.012149 #197937] INFO -- : [121/885] 238919=test_fd_setsize I, [2024-05-07T13:56:28.023976 #197937] INFO -- : [122/885] 238919=test_forwardable I, [2024-05-07T13:56:28.044257 #197937] INFO -- : [123/885] 238919=test_process I, [2024-05-07T13:56:28.064303 #197937] INFO -- : [124/885] 238919=!Nothing_to_test I, [2024-05-07T13:56:28.069894 #197937] INFO -- : [125/885] 238919=test_threadgroup I, [2024-05-07T13:56:29.091739 #197937] INFO -- : [126/885] 238919=test_complex I, [2024-05-07T13:56:29.165486 #197937] INFO -- : [127/885] 238919=test_array_create I, [2024-05-07T13:56:29.201950 #197937] INFO -- : [128/885] 238919=test_memory_view I, [2024-05-07T13:56:29.476093 #197937] INFO -- : [129/885] 238919=test_dir_m17n I, [2024-05-07T13:56:29.556723 #197937] INFO -- : [130/885] 238918=test_merge_keys I, [2024-05-07T13:56:29.566728 #197937] INFO -- : [131/885] 238918=test_storage I, [2024-05-07T13:56:29.575923 #197937] INFO -- : [132/885] 238918=test_err_in_callback I, [2024-05-07T13:56:29.590923 #197937] INFO -- : [133/885] 238918=test_method_name_check I, [2024-05-07T13:56:29.640196 #197937] INFO -- : [134/885] 238918=test_cesu8 I, [2024-05-07T13:56:29.671984 #197937] INFO -- : [135/885] 238918=test_rdoc_extend I, [2024-05-07T13:56:29.840773 #197937] INFO -- : [136/885] 238918=test_did_you_mean I, [2024-05-07T13:56:29.958946 #197937] INFO -- : [137/885] 238918=test_shapes I, [2024-05-07T13:56:29.969002 #197937] INFO -- : [138/885] 238918=pattern_test I, [2024-05-07T13:56:29.990696 #197937] INFO -- : [139/885] 238918=test_dot_dot I, [2024-05-07T13:56:30.009862 #197937] INFO -- : [140/885] 238918=test_gem_rdoc I, [2024-05-07T13:56:30.189339 #197937] INFO -- : [141/885] 238918=test_rendering I, [2024-05-07T13:56:30.285998 #197937] INFO -- : [142/885] 238918=test_kernel I, [2024-05-07T13:56:30.647048 #197937] INFO -- : [143/885] 238919=test_gem_commands_install_command I, [2024-05-07T13:56:30.892383 #197937] INFO -- : [144/885] 238918=test_iterator I, [2024-05-07T13:56:30.960671 #197937] INFO -- : [145/885] 238918=test_string I, [2024-05-07T13:56:30.972702 #197937] INFO -- : [146/885] 238918=test_rdoc_tom_doc I, [2024-05-07T13:56:30.997028 #197937] INFO -- : [147/885] 238918=test_optarg I, [2024-05-07T13:56:31.105388 #197937] INFO -- : [148/885] 238918=test_gem_commands_pristine_command I, [2024-05-07T13:56:32.588659 #197937] INFO -- : [149/885] 238918=test_variable I, [2024-05-07T13:56:32.597482 #197937] INFO -- : [150/885] 238919=test_hash I, [2024-05-07T13:56:32.616124 #197937] INFO -- : [151/885] 238919=test_gem_security I, [2024-05-07T13:56:32.725484 #197937] INFO -- : [152/885] 238918=test_key_actor_emacs I, [2024-05-07T13:56:33.144982 #197937] INFO -- : [153/885] 238918=test_date_ractor I, [2024-05-07T13:56:33.154684 #197937] INFO -- : [154/885] 238918=test_erb I, [2024-05-07T13:56:33.216959 #197937] INFO -- : [155/885] 238918=test_basicinstructions I, [2024-05-07T13:56:33.292755 #197937] INFO -- : [156/885] 238918=test_gem_resolver_git_specification I, [2024-05-07T13:56:33.591825 #197937] INFO -- : [157/885] 238918=test_utf32 I, [2024-05-07T13:56:33.595593 #197937] INFO -- : [158/885] 238918=memsize_test I, [2024-05-07T13:56:33.603919 #197937] INFO -- : [159/885] 238918=test_gem_resolver_requirement_list I, [2024-05-07T13:56:33.612985 #197937] INFO -- : [160/885] 238918=test_noarg I, [2024-05-07T13:56:33.742009 #197937] INFO -- : [161/885] 238918=test_exception I, [2024-05-07T13:56:33.798104 #197937] INFO -- : [162/885] 238918=test_arith_seq_beg_len_step I, [2024-05-07T13:56:33.913259 #197937] INFO -- : [163/885] 238918=test_raise_exception I, [2024-05-07T13:56:34.401309 #197937] INFO -- : [164/885] 238918=test_gem_impossible_dependencies_error I, [2024-05-07T13:56:34.411767 #197937] INFO -- : [165/885] 238918=test_pp I, [2024-05-07T13:56:34.470898 #197937] INFO -- : [166/885] 238918=test_asn1 I, [2024-05-07T13:56:34.488684 #197937] INFO -- : [167/885] 238918=test_gem_command I, [2024-05-07T13:56:34.640803 #197937] INFO -- : [168/885] 238918=test_undef I, [2024-05-07T13:56:34.649205 #197937] INFO -- : [169/885] 238918=test_random I, [2024-05-07T13:56:34.659069 #197937] INFO -- : [170/885] 238918=test_gem_resolver_lock_set I, [2024-05-07T13:56:34.686984 #197937] INFO -- : [171/885] 238918=test_rdoc_generator_darkfish I, [2024-05-07T13:56:35.049180 #197937] INFO -- : [172/885] 238918=test_gem_update_suggestion I, [2024-05-07T13:56:35.154148 #197937] INFO -- : [173/885] 238918=test_assignment I, [2024-05-07T13:56:36.538078 #197937] INFO -- : [174/885] 238920=test_verbose I, [2024-05-07T13:56:36.539795 #197937] INFO -- : [175/885] 238918=test_gem_commands_open_command I, [2024-05-07T13:56:36.568818 #197937] INFO -- : [176/885] 238920=test_emoji_breaks I, [2024-05-07T13:56:36.570951 #197937] INFO -- : [177/885] 238920=test_normalize I, [2024-05-07T13:56:36.574454 #197937] INFO -- : [178/885] 238920=test_shift_jis I, [2024-05-07T13:56:36.589438 #197937] INFO -- : [179/885] 238920=test_rdoc_store I, [2024-05-07T13:56:36.644072 #197937] INFO -- : [180/885] 238918=test_force_exit I, [2024-05-07T13:56:36.654406 #197937] INFO -- : [181/885] 238918=test_optimization I, [2024-05-07T13:56:37.242946 #197937] INFO -- : [182/885] 238920=test_files_sample I, [2024-05-07T13:56:37.253258 #197937] INFO -- : [183/885] 238920=test_rdoc_stats I, [2024-05-07T13:56:37.321627 #197937] INFO -- : [184/885] 238920=test_data_error I, [2024-05-07T13:56:37.407501 #197937] INFO -- : [185/885] 238920=test_rubyoptions I, [2024-05-07T13:56:40.669364 #197937] INFO -- : Leaked file descriptor: TestRubyOptions#test_script_from_stdin: 12 # I, [2024-05-07T13:56:40.692868 #197937] INFO -- : COMMAND PID USER FD TYPE DEVICE SIZE/OFF NODE NAME I, [2024-05-07T13:56:40.692930 #197937] INFO -- : ruby 238920 opc 12r REG 252,0 6940392 13705429 /var/lib/sss/mc/group I, [2024-05-07T13:56:41.378273 #197937] INFO -- : [186/885] 238919=test_yield I, [2024-05-07T13:56:43.124958 #197937] INFO -- : [187/885] 238918=test_show_source I, [2024-05-07T13:56:43.135316 #197937] INFO -- : [188/885] 238918=test_remote_fetch_error I, [2024-05-07T13:56:43.159226 #197937] INFO -- : [189/885] 238918=regexp_test I, [2024-05-07T13:56:43.263598 #197937] INFO -- : [190/885] 238918=test_gc_compact I, [2024-05-07T13:56:43.282084 #197937] INFO -- : [191/885] 238920=test_rdoc_i18n_locale I, [2024-05-07T13:56:43.292684 #197937] INFO -- : [192/885] 238920=test_dryrun I, [2024-05-07T13:56:43.314543 #197937] INFO -- : [193/885] 238920=test_gem_resolver_lock_specification I, [2024-05-07T13:56:43.361021 #197937] INFO -- : [194/885] 238920=test_boolean I, [2024-05-07T13:56:43.371150 #197937] INFO -- : [195/885] 238920=test_queue I, [2024-05-07T13:56:43.378339 #197937] INFO -- : [196/885] 238920=test_enc_raise I, [2024-05-07T13:56:43.447135 #197937] INFO -- : [197/885] 238920=test_clone I, [2024-05-07T13:56:43.544539 #197937] INFO -- : [198/885] 238920=test_ole_methods I, [2024-05-07T13:56:43.562182 #197937] INFO -- : [199/885] 238920=test_cgi_util I, [2024-05-07T13:56:43.757616 #197937] INFO -- : [200/885] 238920=test_gem_uri_formatter I, [2024-05-07T13:56:43.778823 #197937] INFO -- : [201/885] 238920=test_prettyprint I, [2024-05-07T13:56:43.811430 #197937] INFO -- : [202/885] 238920=test_gem_commands_dependency_command I, [2024-05-07T13:56:43.903629 #197937] INFO -- : [203/885] 238920=test_backtrace I, [2024-05-07T13:56:43.907714 #197937] INFO -- : [204/885] 238920=test_gbk I, [2024-05-07T13:56:43.915625 #197937] INFO -- : [205/885] 238920=test_unicode_escape I, [2024-05-07T13:56:44.007761 #197937] INFO -- : [206/885] 238920=test_default_gems I, [2024-05-07T13:56:44.044607 #197937] INFO -- : [207/885] 238920=test_switch_hitter I, [2024-05-07T13:56:44.050960 #197937] INFO -- : [208/885] 238920=test_yamldbm I, [2024-05-07T13:56:44.059770 #197937] INFO -- : [209/885] 238920=test_gem_spec_fetcher I, [2024-05-07T13:56:44.061843 #197937] INFO -- : [210/885] 238919=test_hash_create I, [2024-05-07T13:56:44.064069 #197937] INFO -- : [211/885] 238919=test_grapheme_breaks I, [2024-05-07T13:56:44.114437 #197937] INFO -- : [212/885] 238919=test_tree_spell_checker I, [2024-05-07T13:56:44.155335 #197937] INFO -- : [213/885] 238919=static_literals_test I, [2024-05-07T13:56:44.156058 #197937] INFO -- : [214/885] 238919=test_enumerable I, [2024-05-07T13:56:44.168643 #197937] INFO -- : [215/885] 238919=test_rdoc_method_attr I, [2024-05-07T13:56:44.255906 #197937] INFO -- : [216/885] 238920=test_set I, [2024-05-07T13:56:44.280070 #197937] INFO -- : [217/885] 238920=test_webauthn_listener I, [2024-05-07T13:56:44.311912 #197937] INFO -- : [218/885] 238919=test_ractor I, [2024-05-07T13:56:44.329241 #197937] INFO -- : [219/885] 238919=test_rdoc_rubygems_hook I, [2024-05-07T13:56:44.350256 #197937] INFO -- : Leaked file descriptor: WebauthnListenerTest#test_wait_for_otp_code_get_follows_options: 11 : # I, [2024-05-07T13:56:44.385412 #197937] INFO -- : COMMAND PID USER FD TYPE DEVICE SIZE/OFF NODE NAME I, [2024-05-07T13:56:44.385478 #197937] INFO -- : ruby 238920 opc 11u IPv4 2880597116 0t0 TCP localhost:46449->localhost:45544 (CLOSE_WAIT) I, [2024-05-07T13:56:44.412231 #197937] INFO -- : [220/885] 238919=test_gem_resolver_api_specification I, [2024-05-07T13:56:44.421562 #197937] INFO -- : Closed file descriptor: WebauthnListenerTest#test_wait_for_otp_code_get_request: 11 I, [2024-05-07T13:56:44.441810 #197937] INFO -- : [221/885] 238920=test_rational I, [2024-05-07T13:56:44.461711 #197937] INFO -- : [222/885] 238920=test_case_mapping I, [2024-05-07T13:56:44.465213 #197937] INFO -- : [223/885] 238919=test_gem_ext_cargo_builder_unit I, [2024-05-07T13:56:44.469862 #197937] INFO -- : [224/885] 238920=test_buffering I, [2024-05-07T13:56:44.479716 #197937] INFO -- : [225/885] 238920=test_pkey_ec I, [2024-05-07T13:56:44.492672 #197937] INFO -- : [226/885] 238920=test_svcb_https I, [2024-05-07T13:56:44.507857 #197937] INFO -- : [227/885] 238919=test_arity I, [2024-05-07T13:56:44.514141 #197937] INFO -- : [228/885] 238920=test_thread I, [2024-05-07T13:56:44.516652 #197937] INFO -- : [229/885] 238919=test_open3 I, [2024-05-07T13:56:44.525808 #197937] INFO -- : [230/885] 238920=test_mdns I, [2024-05-07T13:56:44.544943 #197937] INFO -- : [231/885] 238920=test_date_parse I, [2024-05-07T13:56:44.647461 #197937] INFO -- : [232/885] 238920=test_key_event_record I, [2024-05-07T13:56:44.647907 #197937] INFO -- : [233/885] 238920=test_gem_security_signer I, [2024-05-07T13:56:44.840642 #197937] INFO -- : [234/885] 238920=test_config I, [2024-05-07T13:56:44.922194 #197937] INFO -- : [235/885] 238920=test_complex2 I, [2024-05-07T13:56:44.922611 #197937] INFO -- : [236/885] 238920=test_gem_util I, [2024-05-07T13:56:45.124161 #197937] INFO -- : [237/885] 238920=test_thread I, [2024-05-07T13:56:45.313979 #197937] INFO -- : [238/885] 238920=test_gem_unsatisfiable_dependency_error I, [2024-05-07T13:56:45.353962 #197937] INFO -- : [239/885] 238920=test_literal I, [2024-05-07T13:56:45.912043 #197937] INFO -- : [240/885] 238920=test_rdoc_i18n_text I, [2024-05-07T13:56:45.952782 #197937] INFO -- : [241/885] 238920=test_io I, [2024-05-07T13:56:46.342813 #197937] INFO -- : [242/885] 238920=test_input_method I, [2024-05-07T13:56:46.356110 #197937] INFO -- : [243/885] 238918=test_m17n_comb I, [2024-05-07T13:56:46.403912 #197937] INFO -- : [244/885] 238920=test_multi_irb_commands I, [2024-05-07T13:56:46.408449 #197937] INFO -- : [245/885] 238920=test_pkey_dh I, [2024-05-07T13:56:47.084973 #197937] INFO -- : [246/885] 238919=test_data I, [2024-05-07T13:56:47.092931 #197937] INFO -- : [247/885] 238919=test_memory_view I, [2024-05-07T13:56:47.107444 #197937] INFO -- : [248/885] 238919=test_null I, [2024-05-07T13:56:47.146958 #197937] INFO -- : [249/885] 238919=test_ractor I, [2024-05-07T13:56:47.178458 #197937] INFO -- : [250/885] 238919=test_gem_commands_query_command I, [2024-05-07T13:56:47.765430 #197937] INFO -- : [251/885] 238920=test_gem_platform I, [2024-05-07T13:56:47.849769 #197937] INFO -- : [252/885] 238919=test_bigzero I, [2024-05-07T13:56:47.859020 #197937] INFO -- : [253/885] 238919=test_pkey I, [2024-05-07T13:56:47.886569 #197937] INFO -- : [254/885] 238919=test_external_new I, [2024-05-07T13:56:47.889719 #197937] INFO -- : [255/885] 238919=test_win32ole_typelib I, [2024-05-07T13:56:47.898068 #197937] INFO -- : [256/885] 238919=test_gem_commands_cert_command I, [2024-05-07T13:56:47.907393 #197937] INFO -- : [257/885] 238920=test_rdoc_markup_to_tt_only I, [2024-05-07T13:56:47.951263 #197937] INFO -- : [258/885] 238920=test_ws I, [2024-05-07T13:56:47.998778 #197937] INFO -- : [259/885] 238920=test_date_strftime I, [2024-05-07T13:56:48.398607 #197937] INFO -- : [260/885] 238920=json_parser_test I, [2024-05-07T13:56:48.418524 #197937] INFO -- : [261/885] 238920=test_gem_commands_stale_command I, [2024-05-07T13:56:48.469077 #197937] INFO -- : [262/885] 238920=ruby_parser_test I, [2024-05-07T13:56:48.494516 #197937] INFO -- : [263/885] 238920=test_weakref I, [2024-05-07T13:56:48.968074 #197937] INFO -- : [264/885] 238920=test_instrumentation_api I, [2024-05-07T13:56:49.073910 #197937] INFO -- : [265/885] 238919=test_rdoc_alias I, [2024-05-07T13:56:49.080933 #197937] INFO -- : [266/885] 238919=test_timeout I, [2024-05-07T13:56:49.384570 #197937] INFO -- : [267/885] 238918=test_key_name_check I, [2024-05-07T13:56:49.399621 #197937] INFO -- : [268/885] 238918=test_rdoc_markup_to_bs I, [2024-05-07T13:56:49.452821 #197937] INFO -- : [269/885] 238918=test_rdoc_markup_raw I, [2024-05-07T13:56:49.479647 #197937] INFO -- : [270/885] 238918=test_gem_ext_rake_builder I, [2024-05-07T13:56:49.991508 #197937] INFO -- : [271/885] 238919=test_rdoc_require I, [2024-05-07T13:56:49.999245 #197937] INFO -- : [272/885] 238919=test_word I, [2024-05-07T13:56:50.008552 #197937] INFO -- : [273/885] 238919=test_singleton I, [2024-05-07T13:56:50.014965 #197937] INFO -- : [274/885] 238919=test_numeric I, [2024-05-07T13:56:50.072245 #197937] INFO -- : [275/885] 238919=test_fstring I, [2024-05-07T13:56:50.084815 #197937] INFO -- : [276/885] 238918=test_rdoc_markup_to_html_crossref I, [2024-05-07T13:56:50.141802 #197937] INFO -- : [277/885] 238919=test_div I, [2024-05-07T13:56:50.153397 #197937] INFO -- : [278/885] 238919=test_files_test_2 I, [2024-05-07T13:56:50.372136 #197937] INFO -- : [279/885] 238918=test_bash_completion I, [2024-05-07T13:56:50.440453 #197937] INFO -- : [280/885] 238918=test_exception I, [2024-05-07T13:56:51.640407 #197937] INFO -- : [281/885] 238920=test_optparse I, [2024-05-07T13:56:51.649214 #197937] INFO -- : [282/885] 238920=test_rdoc_context_section I, [2024-05-07T13:56:51.662575 #197937] INFO -- : [283/885] 238920=test_io_buffer I, [2024-05-07T13:56:51.770531 #197937] INFO -- : [284/885] 238920=test_deprecated I, [2024-05-07T13:56:51.774141 #197937] INFO -- : [285/885] 238920=test_pack I, [2024-05-07T13:56:51.962242 #197937] INFO -- : [286/885] 238920=test_pkcs7 I, [2024-05-07T13:56:52.115764 #197937] INFO -- : [287/885] 238920=test_gem_commands_environment_command I, [2024-05-07T13:56:52.179042 #197937] INFO -- : [288/885] 238920=test_zsh_completion I, [2024-05-07T13:56:52.185053 #197937] INFO -- : [289/885] 238920=test_basicsocket I, [2024-05-07T13:56:52.207395 #197937] INFO -- : [290/885] 238920=test_class_name_check I, [2024-05-07T13:56:52.254718 #197937] INFO -- : [291/885] 238920=test_syntax I, [2024-05-07T13:56:52.759545 #197937] INFO -- : [292/885] 238919=test_scalar I, [2024-05-07T13:56:52.765369 #197937] INFO -- : [293/885] 238919=library_symbols_test I, [2024-05-07T13:56:52.773887 #197937] INFO -- : [294/885] 238919=test_rdoc_text I, [2024-05-07T13:56:52.828303 #197937] INFO -- : [295/885] 238919=test_objspace I, [2024-05-07T13:56:53.344318 #197937] INFO -- : [296/885] 238918=test_stringify_symbols I, [2024-05-07T13:56:53.349856 #197937] INFO -- : [297/885] 238918=test_require I, [2024-05-07T13:56:53.356305 #197937] INFO -- : [298/885] 238918=test_ns_spki I, [2024-05-07T13:56:53.366141 #197937] INFO -- : [299/885] 238918=test_stream I, [2024-05-07T13:56:53.447949 #197937] INFO -- : [300/885] 238918=test_have_library I, [2024-05-07T13:56:54.234780 #197937] INFO -- : [301/885] 238918=test_rdoc_markup_indented_paragraph I, [2024-05-07T13:56:54.247059 #197937] INFO -- : [302/885] 238918=test_rdoc_markup_parser I, [2024-05-07T13:56:55.427804 #197937] INFO -- : [303/885] 238918=test_iseq_load I, [2024-05-07T13:56:55.440882 #197937] INFO -- : [304/885] 238918=test_gem_request_set_lockfile I, [2024-05-07T13:56:55.900378 #197937] INFO -- : [305/885] 238918=test_rdoc_markdown I, [2024-05-07T13:56:56.183553 #197937] INFO -- : [306/885] 238918=test_key_actor_vi I, [2024-05-07T13:56:56.314749 #197937] INFO -- : [307/885] 238918=test_postponed_job I, [2024-05-07T13:56:56.592877 #197937] INFO -- : [308/885] 238918=test_win32ole_variant_outarg I, [2024-05-07T13:56:56.603005 #197937] INFO -- : [309/885] 238918=test_rdoc_encoding I, [2024-05-07T13:56:56.659501 #197937] INFO -- : [310/885] 238918=test_common I, [2024-05-07T13:56:56.844046 #197937] INFO -- : [311/885] 238918=test_rdoc_markup_to_html_snippet I, [2024-05-07T13:56:56.961532 #197937] INFO -- : [312/885] 238918=test_generic I, [2024-05-07T13:56:57.000336 #197937] INFO -- : [313/885] 238918=test_deprecate I, [2024-05-07T13:56:57.053687 #197937] INFO -- : [314/885] 238918=test_rdoc_constant I, [2024-05-07T13:56:57.148387 #197937] INFO -- : [315/885] 238918=test_httpresponses I, [2024-05-07T13:56:57.157568 #197937] INFO -- : [316/885] 238918=test_rdoc_markup_attributes I, [2024-05-07T13:56:57.187924 #197937] INFO -- : [317/885] 238918=test_rand I, [2024-05-07T13:56:57.542348 #197937] INFO -- : [318/885] 238918=test_random_formatter I, [2024-05-07T13:56:57.565758 #197937] INFO -- : [319/885] 238918=test_string_processing I, [2024-05-07T13:56:57.573845 #197937] INFO -- : [320/885] 238918=redundant_return_test I, [2024-05-07T13:56:57.588082 #197937] INFO -- : [321/885] 238918=test_bmethod I, [2024-05-07T13:56:57.590645 #197937] INFO -- : [322/885] 238918=test_provider I, [2024-05-07T13:56:57.597369 #197937] INFO -- : [323/885] 238918=test_euc_kr I, [2024-05-07T13:56:57.613452 #197937] INFO -- : [324/885] 238918=test_gem_source_specific_file I, [2024-05-07T13:56:58.334455 #197937] INFO -- : [325/885] 238918=test_process I, [2024-05-07T13:56:59.224241 #197937] INFO -- : [326/885] 238920=test_rdoc_code_object I, [2024-05-07T13:56:59.582823 #197937] INFO -- : [327/885] 238920=parse_test I, [2024-05-07T13:57:02.296733 #197937] INFO -- : [328/885] 238920=test_kwargs I, [2024-05-07T13:57:02.307278 #197937] INFO -- : [329/885] 238920=test_rdoc_parser_c I, [2024-05-07T13:57:02.579453 #197937] INFO -- : [330/885] 238920=test_io_wait I, [2024-05-07T13:57:02.952790 #197937] INFO -- : [331/885] 238920=test_pack I, [2024-05-07T13:57:03.184585 #197937] INFO -- : [332/885] 238920=test_len I, [2024-05-07T13:57:03.195837 #197937] INFO -- : [333/885] 238920=test_gem_doctor I, [2024-05-07T13:57:03.266770 #197937] INFO -- : [334/885] 238920=json_fixtures_test I, [2024-05-07T13:57:03.279635 #197937] INFO -- : [335/885] 238920=parameters_signature_test I, [2024-05-07T13:57:03.294412 #197937] INFO -- : [336/885] 238920=test_rdoc_parser_changelog I, [2024-05-07T13:57:03.364307 #197937] INFO -- : [337/885] 238920=test_gem_commands_outdated_command I, [2024-05-07T13:57:03.425873 #197937] INFO -- : [338/885] 238920=test_gem_dependency_list I, [2024-05-07T13:57:03.525036 #197937] INFO -- : [339/885] 238920=test_securerandom I, [2024-05-07T13:57:03.557295 #197937] INFO -- : [340/885] 238920=test_tsort I, [2024-05-07T13:57:03.581328 #197937] INFO -- : [341/885] 238920=test_gem_commands_fetch_command I, [2024-05-07T13:57:03.759427 #197937] INFO -- : [342/885] 238920=test_typeddata I, [2024-05-07T13:57:04.000165 #197937] INFO -- : [343/885] 238920=test_function I, [2024-05-07T13:57:04.234474 #197937] INFO -- : [344/885] 238920=test_gem_resolver_activation_request I, [2024-05-07T13:57:04.257365 #197937] INFO -- : [345/885] 238920=test_gem_commands_server_command I, [2024-05-07T13:57:04.277323 #197937] INFO -- : [346/885] 238920=test_string I, [2024-05-07T13:57:15.924304 #197937] INFO -- : [347/885] 238918=test_macro I, [2024-05-07T13:57:15.931890 #197937] INFO -- : [348/885] 238918=test_pipe I, [2024-05-07T13:57:16.054467 #197937] INFO -- : [349/885] 238918=test_gem_requirement I, [2024-05-07T13:57:16.214802 #197937] INFO -- : [350/885] 238918=test_rdoc_markup_to_table_of_contents I, [2024-05-07T13:57:16.258170 #197937] INFO -- : [351/885] 238918=test_gem_name_tuple I, [2024-05-07T13:57:16.329380 #197937] INFO -- : [352/885] 238918=test_integer I, [2024-05-07T13:57:16.336979 #197937] INFO -- : [353/885] 238918=test_tcp I, [2024-05-07T13:57:16.432968 #197937] INFO -- : [354/885] 238918=test_win32ole_method_event I, [2024-05-07T13:57:16.439305 #197937] INFO -- : [355/885] 238918=parse_comments_test I, [2024-05-07T13:57:16.446739 #197937] INFO -- : [356/885] 238918=test_capacity I, [2024-05-07T13:57:16.460942 #197937] INFO -- : [357/885] 238918=test_nextafter I, [2024-05-07T13:57:16.553949 #197937] INFO -- : [358/885] 238918=test_gem_commands_owner_command I, [2024-05-07T13:57:17.226009 #197937] INFO -- : [359/885] 238918=test_time I, [2024-05-07T13:57:17.332307 #197937] INFO -- : [360/885] 238918=test_file I, [2024-05-07T13:57:17.532728 #197937] INFO -- : [361/885] 238918=test_flags I, [2024-05-07T13:57:17.925736 #197937] INFO -- : [362/885] 238918=test_numeric I, [2024-05-07T13:57:17.992016 #197937] INFO -- : [363/885] 238918=test_yamlstore I, [2024-05-07T13:57:18.013977 #197937] INFO -- : [364/885] 238918=test_bug-3571 I, [2024-05-07T13:57:18.019847 #197937] INFO -- : [365/885] 238918=test_rat I, [2024-05-07T13:57:18.040382 #197937] INFO -- : [366/885] 238918=test_init I, [2024-05-07T13:57:18.326157 #197937] INFO -- : [367/885] 238918=test_gem_request_connection_pools I, [2024-05-07T13:57:19.660713 #197937] INFO -- : [368/885] 238918=test_constant I, [2024-05-07T13:57:21.260120 #197937] INFO -- : [369/885] 238918=test_find I, [2024-05-07T13:57:21.279224 #197937] INFO -- : [370/885] 238918=test_rdoc_generator_markup I, [2024-05-07T13:57:21.285572 #197937] INFO -- : [371/885] 238918=test_hmac I, [2024-05-07T13:57:21.294796 #197937] INFO -- : [372/885] 238918=test_encoding I, [2024-05-07T13:57:21.482210 #197937] INFO -- : [373/885] 238918=test_date_compat I, [2024-05-07T13:57:21.497311 #197937] INFO -- : [374/885] 238918=test_rdoc_include I, [2024-05-07T13:57:21.529944 #197937] INFO -- : [375/885] 238918=test_win32ole_record I, [2024-05-07T13:57:21.540182 #197937] INFO -- : [376/885] 238918=test_gem_version_option I, [2024-05-07T13:57:21.609244 #197937] INFO -- : [377/885] 238918=test_ubf_async_safe I, [2024-05-07T13:57:21.624756 #197937] INFO -- : [378/885] 238918=test_pstore I, [2024-05-07T13:57:21.957389 #197937] INFO -- : [379/885] 238918=test_zlib I, [2024-05-07T13:57:22.494217 #197937] INFO -- : [380/885] 238919=test_rdoc_options I, [2024-05-07T13:57:22.765950 #197937] INFO -- : [381/885] 238919=test_gem_commands_unpack_command I, [2024-05-07T13:57:23.103383 #197937] INFO -- : [382/885] 238919=test_gem_ext_cargo_builder I, [2024-05-07T13:57:23.128632 #197937] INFO -- : [383/885] 238919=test_console_attr I, [2024-05-07T13:57:23.155041 #197937] INFO -- : [384/885] 238919=test_proc I, [2024-05-07T13:57:24.103463 #197937] INFO -- : [385/885] 238919=test_frozen_error I, [2024-05-07T13:57:24.204222 #197937] INFO -- : [386/885] 238919=test_gem_ext_ext_conf_builder I, [2024-05-07T13:57:25.208722 #197937] INFO -- : [387/885] 238919=test_spell_checker I, [2024-05-07T13:57:25.226583 #197937] INFO -- : [388/885] 238919=test_gem_version I, [2024-05-07T13:57:25.386755 #197937] INFO -- : [389/885] 238919=test_reqarg I, [2024-05-07T13:57:25.737090 #197937] INFO -- : [390/885] 238919=test_enumerator I, [2024-05-07T13:57:25.742052 #197937] INFO -- : [391/885] 238919=test_path_to_class I, [2024-05-07T13:57:25.791811 #197937] INFO -- : [392/885] 238919=test_c_struct_builder I, [2024-05-07T13:57:25.987010 #197937] INFO -- : [393/885] 238919=test_bug-5832 I, [2024-05-07T13:57:25.992113 #197937] INFO -- : [394/885] 238919=test_yield_block I, [2024-05-07T13:57:26.003965 #197937] INFO -- : [395/885] 238919=test_gem_uri I, [2024-05-07T13:57:26.049207 #197937] INFO -- : [396/885] 238919=test_gem_package_tar_reader_entry I, [2024-05-07T13:57:26.333356 #197937] INFO -- : [397/885] 238919=test_resource I, [2024-05-07T13:57:26.362676 #197937] INFO -- : [398/885] 238919=test_rdoc_markdown_test I, [2024-05-07T13:57:27.033873 #197937] INFO -- : [399/885] 238920=test_type_completor I, [2024-05-07T13:57:27.046578 #197937] INFO -- : [400/885] 238920=test_rdoc_normal_module I, [2024-05-07T13:57:27.076578 #197937] INFO -- : [401/885] 238920=test_io_timeout I, [2024-05-07T13:57:27.084432 #197937] INFO -- : [402/885] 238920=test_rdoc_rdoc I, [2024-05-07T13:57:27.160115 #197937] INFO -- : [403/885] 238920=test_yjit_exit_locations I, [2024-05-07T13:57:27.167936 #197937] INFO -- : [404/885] 238920=test_comparable I, [2024-05-07T13:57:27.172362 #197937] INFO -- : [405/885] 238920=json_string_matching_test I, [2024-05-07T13:57:27.185877 #197937] INFO -- : [406/885] 238920=test_gem_config_file I, [2024-05-07T13:57:27.409185 #197937] INFO -- : [407/885] 238920=test_thread_queue I, [2024-05-07T13:57:27.557332 #197937] INFO -- : [408/885] 238919=test_nowrite I, [2024-05-07T13:57:27.578628 #197937] INFO -- : [409/885] 238919=test_passing_block I, [2024-05-07T13:57:27.591644 #197937] INFO -- : [410/885] 238919=test_defined I, [2024-05-07T13:57:27.670761 #197937] INFO -- : [411/885] 238919=test_ldap I, [2024-05-07T13:57:27.692623 #197937] INFO -- : [412/885] 238919=test_kdf I, [2024-05-07T13:57:27.744101 #197937] INFO -- : [413/885] 238919=test_io_buffer I, [2024-05-07T13:57:27.801426 #197937] INFO -- : [414/885] 238919=test_psych I, [2024-05-07T13:57:27.824630 #197937] INFO -- : [415/885] 238919=test_nil I, [2024-05-07T13:57:27.831014 #197937] INFO -- : [416/885] 238919=test_wait I, [2024-05-07T13:57:27.886450 #197937] INFO -- : [417/885] 238919=test_human_typo I, [2024-05-07T13:57:27.925930 #197937] INFO -- : [418/885] 238919=test_import I, [2024-05-07T13:57:28.726193 #197937] INFO -- : [419/885] 238918=test_logger I, [2024-05-07T13:57:28.792585 #197937] INFO -- : [420/885] 238918=test_pkey_dsa I, [2024-05-07T13:57:29.842460 #197937] INFO -- : [421/885] 238919=test_big2str I, [2024-05-07T13:57:29.845163 #197937] INFO -- : [422/885] 238919=test_gem_resolver_specification I, [2024-05-07T13:57:29.884799 #197937] INFO -- : [423/885] 238919=test_cstr I, [2024-05-07T13:57:30.825867 #197937] INFO -- : [424/885] 238918=test_gem_resolver_dependency_request I, [2024-05-07T13:57:30.857734 #197937] INFO -- : [425/885] 238918=test_euc_tw I, [2024-05-07T13:57:30.871338 #197937] INFO -- : [426/885] 238918=test_command I, [2024-05-07T13:57:31.112259 #197937] INFO -- : [427/885] 238918=test_gem_commands_yank_command I, [2024-05-07T13:57:31.306020 #197937] INFO -- : [428/885] 238919=test_yaml_tree I, [2024-05-07T13:57:31.327853 #197937] INFO -- : [429/885] 238919=reflection_test I, [2024-05-07T13:57:31.366848 #197937] INFO -- : [430/885] 238919=test_line_editor I, [2024-05-07T13:57:31.375958 #197937] INFO -- : [431/885] 238919=test_marshalable I, [2024-05-07T13:57:31.383905 #197937] INFO -- : [432/885] 238919=test_enumerator_kw I, [2024-05-07T13:57:31.441951 #197937] INFO -- : [433/885] 238919=test_string_memory I, [2024-05-07T13:57:31.555699 #197937] INFO -- : [434/885] 238919=test_help I, [2024-05-07T13:57:31.557440 #197937] INFO -- : [435/885] 238919=test_files_lib I, [2024-05-07T13:57:31.561711 #197937] INFO -- : [436/885] 238919=version_test I, [2024-05-07T13:57:31.568846 #197937] INFO -- : [437/885] 238919=test_complexrational I, [2024-05-07T13:57:31.570800 #197937] INFO -- : [438/885] 238919=test_raise I, [2024-05-07T13:57:31.575467 #197937] INFO -- : [439/885] 238919=test_rdoc_any_method I, [2024-05-07T13:57:31.629693 #197937] INFO -- : [440/885] 238918=test_error_highlight I, [2024-05-07T13:57:31.975202 #197937] INFO -- : [441/885] 238919=test_function_entry I, [2024-05-07T13:57:31.975563 #197937] INFO -- : [442/885] 238919=test_string I, [2024-05-07T13:57:31.998880 #197937] INFO -- : [443/885] 238919=json_common_interface_test I, [2024-05-07T13:57:32.013614 #197937] INFO -- : [444/885] 238919=test_rdoc_markup_pre_process I, [2024-05-07T13:57:32.154508 #197937] INFO -- : [445/885] 238919=test_store I, [2024-05-07T13:57:32.253661 #197937] INFO -- : [446/885] 238918=test_http_request I, [2024-05-07T13:57:32.261695 #197937] INFO -- : [447/885] 238918=test_tempfile I, [2024-05-07T13:57:32.428357 #197937] INFO -- : [448/885] 238919=test_coverage I, [2024-05-07T13:57:32.530154 #197937] INFO -- : [449/885] 238918=test_fnmatch I, [2024-05-07T13:57:32.598026 #197937] INFO -- : [450/885] 238918=test_pathname I, [2024-05-07T13:57:32.858969 #197937] INFO -- : [451/885] 238918=test_protect I, [2024-05-07T13:57:32.869555 #197937] INFO -- : [452/885] 238918=test_gem_commands_update_command I, [2024-05-07T13:57:33.114204 #197937] INFO -- : [453/885] 238920=test_big5 I, [2024-05-07T13:57:33.124178 #197937] INFO -- : [454/885] 238920=test_date I, [2024-05-07T13:57:33.132681 #197937] INFO -- : [455/885] 238920=test_tree_builder I, [2024-05-07T13:57:33.150832 #197937] INFO -- : [456/885] 238920=test_gem_resolver_index_specification I, [2024-05-07T13:57:33.203168 #197937] INFO -- : [457/885] 238919=test_serialize_subclasses I, [2024-05-07T13:57:33.204113 #197937] INFO -- : [458/885] 238920=test_frozen I, [2024-05-07T13:57:33.205728 #197937] INFO -- : [459/885] 238919=test_egrep_cpp I, [2024-05-07T13:57:33.265207 #197937] INFO -- : [460/885] 238920=test_webauthn_poller I, [2024-05-07T13:57:33.322490 #197937] INFO -- : [461/885] 238919=test_rdoc_markup_verbatim I, [2024-05-07T13:57:33.331544 #197937] INFO -- : [462/885] 238919=test_date_conv I, [2024-05-07T13:57:33.336237 #197937] INFO -- : [463/885] 238919=test_timeout I, [2024-05-07T13:57:33.344981 #197937] INFO -- : [464/885] 238919=test_erb_m17n I, [2024-05-07T13:57:33.353810 #197937] INFO -- : [465/885] 238919=test_rdoc_generator_pot_po_entry I, [2024-05-07T13:57:33.370795 #197937] INFO -- : [466/885] 238919=test_rdoc_markup_formatter I, [2024-05-07T13:57:33.381879 #197937] INFO -- : [467/885] 238919=test_gem_commands_uninstall_command I, [2024-05-07T13:57:33.422332 #197937] INFO -- : [468/885] 238920=test_win32ole_event I, [2024-05-07T13:57:33.422520 #197937] INFO -- : [469/885] 238920=test_helper I, [2024-05-07T13:57:33.434336 #197937] INFO -- : [470/885] 238920=test_compile_prism I, [2024-05-07T13:57:33.702746 #197937] INFO -- : [471/885] 238920=test_emitter I, [2024-05-07T13:57:33.714485 #197937] INFO -- : [472/885] 238920=test_fips I, [2024-05-07T13:57:34.017049 #197937] INFO -- : [473/885] 238920=test_alias I, [2024-05-07T13:57:34.166039 #197937] INFO -- : [474/885] 238920=test_getopts I, [2024-05-07T13:57:34.183594 #197937] INFO -- : [475/885] 238920=test_last_thread I, [2024-05-07T13:57:34.343332 #197937] INFO -- : [476/885] 238919=test_thread_fd_close I, [2024-05-07T13:57:34.370976 #197937] INFO -- : [477/885] 238919=test_gem_ext_cmake_builder I, [2024-05-07T13:57:34.384360 #197937] INFO -- : [478/885] 238919=test_digest_extend I, [2024-05-07T13:57:34.400849 #197937] INFO -- : [479/885] 238919=test_class2name I, [2024-05-07T13:57:34.412974 #197937] INFO -- : [480/885] 238919=test_gem_commands_cleanup_command I, [2024-05-07T13:57:34.558258 #197937] INFO -- : [481/885] 238918=test_debug I, [2024-05-07T13:57:34.633713 #197937] INFO -- : [482/885] 238918=test_refinement I, [2024-05-07T13:57:35.028071 #197937] INFO -- : [483/885] 238919=test_transcode I, [2024-05-07T13:57:35.210284 #197937] INFO -- : [484/885] 238919=test_profile_frames I, [2024-05-07T13:57:35.225759 #197937] INFO -- : [485/885] 238920=test_pattern_key_name_check I, [2024-05-07T13:57:35.230513 #197937] INFO -- : [486/885] 238920=test_flip I, [2024-05-07T13:57:35.277555 #197937] INFO -- : [487/885] 238920=test_io_console I, [2024-05-07T13:57:35.380247 #197937] INFO -- : [488/885] 238919=test_rdoc_markup_heading I, [2024-05-07T13:57:35.400385 #197937] INFO -- : [489/885] 238919=test_x509crl I, [2024-05-07T13:57:35.487869 #197937] INFO -- : [490/885] 238919=test_dns I, [2024-05-07T13:57:36.011336 #197937] INFO -- : [491/885] 238919=test_c_union_entity I, [2024-05-07T13:57:36.112541 #197937] INFO -- : [492/885] 238919=test_cgi_session I, [2024-05-07T13:57:36.126822 #197937] INFO -- : [493/885] 238919=test_notimplement I, [2024-05-07T13:57:36.132044 #197937] INFO -- : [494/885] 238919=test_insns_leaf I, [2024-05-07T13:57:36.143153 #197937] INFO -- : [495/885] 238919=test_gem_console_ui I, [2024-05-07T13:57:36.148379 #197937] INFO -- : [496/885] 238919=test_ifunless I, [2024-05-07T13:57:36.448026 #197937] INFO -- : [497/885] 238919=test_allocation I, [2024-05-07T13:57:37.935908 #197937] INFO -- : [498/885] 238920=test_x509req I, [2024-05-07T13:57:37.969649 #197937] INFO -- : [499/885] 238920=test_rdoc_parser_ruby I, [2024-05-07T13:57:38.168564 #197937] INFO -- : [500/885] 238918=test_httpresponse I, [2024-05-07T13:57:38.205847 #197937] INFO -- : [501/885] 238918=test_readpartial I, [2024-05-07T13:57:38.412386 #197937] INFO -- : [502/885] 238919=test_color_printer I, [2024-05-07T13:57:38.425232 #197937] INFO -- : [503/885] 238919=test_super I, [2024-05-07T13:57:38.651542 #197937] INFO -- : [504/885] 238920=test_gem_commands_exec_command I, [2024-05-07T13:57:38.680394 #197937] INFO -- : [505/885] 238918=unescape_test I, [2024-05-07T13:57:40.023356 #197937] INFO -- : [506/885] 238918=test_dln I, [2024-05-07T13:57:40.026116 #197937] INFO -- : [507/885] 238918=test_object I, [2024-05-07T13:57:40.039470 #197937] INFO -- : [508/885] 238919=test_gem_resolver I, [2024-05-07T13:57:40.052539 #197937] INFO -- : [509/885] 238920=test_gem_source_vendor I, [2024-05-07T13:57:40.068686 #197937] INFO -- : [510/885] 238920=json_encoding_test I, [2024-05-07T13:57:40.076289 #197937] INFO -- : [511/885] 238920=test_vm_dump I, [2024-05-07T13:57:40.084148 #197937] INFO -- : [512/885] 238920=test_config I, [2024-05-07T13:57:40.112010 #197937] INFO -- : [513/885] 238920=test_func I, [2024-05-07T13:57:40.397852 #197937] INFO -- : [514/885] 238919=test_convertible I, [2024-05-07T13:57:40.417831 #197937] INFO -- : [515/885] 238918=errors_test I, [2024-05-07T13:57:40.528647 #197937] INFO -- : [516/885] 238918=test_modify_expand I, [2024-05-07T13:57:40.538724 #197937] INFO -- : [517/885] 238918=test_pkg_config I, [2024-05-07T13:57:40.556616 #197937] INFO -- : [518/885] 238918=test_gem_available_set I, [2024-05-07T13:57:40.706609 #197937] INFO -- : [519/885] 238918=test_pointer I, [2024-05-07T13:57:42.136756 #197937] INFO -- : [520/885] 238918=test_within_pipe I, [2024-05-07T13:57:42.163053 #197937] INFO -- : [521/885] 238918=test_rdoc_normal_class I, [2024-05-07T13:57:42.209525 #197937] INFO -- : [522/885] 238918=test_nofree I, [2024-05-07T13:57:42.217271 #197937] INFO -- : [523/885] 238918=test_whileuntil I, [2024-05-07T13:57:42.247529 #197937] INFO -- : [524/885] 238918=test_regexp I, [2024-05-07T13:57:43.689417 #197937] INFO -- : [525/885] 238920=test_eval I, [2024-05-07T13:57:44.001561 #197937] INFO -- : [526/885] 238920=test_beginendblock I, [2024-05-07T13:57:44.082939 #197937] INFO -- : [527/885] 238919=test_monitor I, [2024-05-07T13:57:44.289825 #197937] INFO -- : [528/885] 238920=test_gem_source_subpath_problem I, [2024-05-07T13:57:44.303637 #197937] INFO -- : [529/885] 238919=test_object_references I, [2024-05-07T13:57:44.362977 #197937] INFO -- : [530/885] 238919=test_ruby_lex I, [2024-05-07T13:57:44.472706 #197937] INFO -- : [531/885] 238920=test_arith_seq_extract I, [2024-05-07T13:57:44.478509 #197937] INFO -- : [532/885] 238919=compiler_test I, [2024-05-07T13:57:44.495634 #197937] INFO -- : [533/885] 238919=test_buffered_io I, [2024-05-07T13:57:44.545023 #197937] INFO -- : [534/885] 238919=test_ossl I, [2024-05-07T13:57:44.620823 #197937] INFO -- : [535/885] 238920=test_gem_installer I, [2024-05-07T13:57:49.668769 #197937] INFO -- : [536/885] 238920=test_bug_reporter I, [2024-05-07T13:57:49.676130 #197937] INFO -- : [537/885] 238920=test_duplicate I, [2024-05-07T13:57:49.693167 #197937] INFO -- : [538/885] 238920=test_gem_resolver_api_set I, [2024-05-07T13:57:49.778349 #197937] INFO -- : [539/885] 238920=test_helper I, [2024-05-07T13:57:49.785386 #197937] INFO -- : [540/885] 238920=test_case_options I, [2024-05-07T13:57:49.789906 #197937] INFO -- : [541/885] 238920=format_errors_test I, [2024-05-07T13:57:49.797831 #197937] INFO -- : [542/885] 238920=test_cgi_header I, [2024-05-07T13:57:49.802900 #197937] INFO -- : [543/885] 238920=test_member I, [2024-05-07T13:57:49.808906 #197937] INFO -- : [544/885] 238920=test_object I, [2024-05-07T13:57:49.817549 #197937] INFO -- : [545/885] 238920=test_mailto I, [2024-05-07T13:57:49.827249 #197937] INFO -- : [546/885] 238920=test_addr I, [2024-05-07T13:57:49.838089 #197937] INFO -- : [547/885] 238920=test_kill_ring I, [2024-05-07T13:57:49.846754 #197937] INFO -- : [548/885] 238920=bom_test I, [2024-05-07T13:57:49.860606 #197937] INFO -- : [549/885] 238920=test_file I, [2024-05-07T13:57:52.014639 #197937] INFO -- : [550/885] 238919=test_config I, [2024-05-07T13:57:52.334303 #197937] INFO -- : [551/885] 238919=test_summary I, [2024-05-07T13:57:52.446209 #197937] INFO -- : [552/885] 238919=test_helper_method I, [2024-05-07T13:57:52.458082 #197937] INFO -- : [553/885] 238919=test_x509ext I, [2024-05-07T13:57:52.464925 #197937] INFO -- : [554/885] 238919=test_emitter I, [2024-05-07T13:57:52.471323 #197937] INFO -- : [555/885] 238919=test_append I, [2024-05-07T13:57:52.492097 #197937] INFO -- : [556/885] 238919=test_gem_resolver_installer_set I, [2024-05-07T13:57:52.762794 #197937] INFO -- : [557/885] 238919=test_rdoc_markup_to_html I, [2024-05-07T13:57:52.838889 #197937] INFO -- : [558/885] 238919=test_foreach I, [2024-05-07T13:57:52.882145 #197937] INFO -- : [559/885] 238919=test_keyword I, [2024-05-07T13:57:53.381781 #197937] INFO -- : [560/885] 238919=test_win32ole_type_event I, [2024-05-07T13:57:53.390216 #197937] INFO -- : [561/885] 238919=test_arity I, [2024-05-07T13:57:53.402381 #197937] INFO -- : [562/885] 238919=test_gem_path_support I, [2024-05-07T13:57:53.448694 #197937] INFO -- : [563/885] 238919=test_trace I, [2024-05-07T13:57:53.456876 #197937] INFO -- : [564/885] 238919=test_lambda I, [2024-05-07T13:57:53.517407 #197937] INFO -- : [565/885] 238919=test_rb_str_dup I, [2024-05-07T13:57:53.527869 #197937] INFO -- : [566/885] 238919=test_scalar_scanner I, [2024-05-07T13:57:56.007727 #197937] INFO -- : [567/885] 238919=test_sleep I, [2024-05-07T13:57:56.045035 #197937] INFO -- : [568/885] 238920=test_webauthn_listener_response I, [2024-05-07T13:57:56.075945 #197937] INFO -- : [569/885] 238920=test_gem_resolver_index_set I, [2024-05-07T13:57:56.120762 #197937] INFO -- : [570/885] 238920=ruby_api_test I, [2024-05-07T13:57:56.293707 #197937] INFO -- : [571/885] 238920=test_gem_bundler_version_finder I, [2024-05-07T13:57:56.337991 #197937] INFO -- : [572/885] 238920=test_gem_request_set I, [2024-05-07T13:57:56.945222 #197937] INFO -- : [573/885] 238920=test_gc I, [2024-05-07T13:57:58.560626 #197937] INFO -- : [574/885] 238919=test_pattern_matching I, [2024-05-07T13:57:58.580372 #197937] INFO -- : [575/885] 238919=test_interned_str I, [2024-05-07T13:57:58.588260 #197937] INFO -- : [576/885] 238919=test_set_len I, [2024-05-07T13:57:58.596592 #197937] INFO -- : [577/885] 238919=constant_path_node_test I, [2024-05-07T13:57:58.602005 #197937] INFO -- : [578/885] 238919=test_folderitem2_invokeverb I, [2024-05-07T13:57:58.608330 #197937] INFO -- : [579/885] 238919=test_chilled I, [2024-05-07T13:57:58.619849 #197937] INFO -- : [580/885] 238919=test_delegate I, [2024-05-07T13:57:58.643247 #197937] INFO -- : [581/885] 238919=location_test I, [2024-05-07T13:57:58.763604 #197937] INFO -- : [582/885] 238919=test_project_sanity I, [2024-05-07T13:57:58.771743 #197937] INFO -- : [583/885] 238919=test_symbol I, [2024-05-07T13:57:58.837287 #197937] INFO -- : [584/885] 238919=test_time I, [2024-05-07T13:57:58.986492 #197937] INFO -- : [585/885] 238919=test_popen_deadlock I, [2024-05-07T13:57:59.510613 #197937] INFO -- : [586/885] 238919=test_alias_and_anchor I, [2024-05-07T13:57:59.516963 #197937] INFO -- : [587/885] 238919=test_euc_jp I, [2024-05-07T13:57:59.526348 #197937] INFO -- : [588/885] 238919=test_rdoc_markup I, [2024-05-07T13:57:59.541495 #197937] INFO -- : [589/885] 238919=test_key_stroke I, [2024-05-07T13:57:59.603616 #197937] INFO -- : [590/885] 238919=test_ensured I, [2024-05-07T13:58:00.330181 #197937] INFO -- : [591/885] 238919=test_to_ary_concat I, [2024-05-07T13:58:03.319127 #197937] INFO -- : [592/885] 238919=test_history I, [2024-05-07T13:58:03.339546 #197937] INFO -- : [593/885] 238919=test_gem_ext_builder I, [2024-05-07T13:58:04.485833 #197937] INFO -- : [594/885] 238919=test_windows_1251 I, [2024-05-07T13:58:04.493683 #197937] INFO -- : [595/885] 238919=test_ellipsize I, [2024-05-07T13:58:04.520345 #197937] INFO -- : [596/885] 238919=test_call I, [2024-05-07T13:58:04.784111 #197937] INFO -- : [597/885] 238919=test_gem_commands_build_command I, [2024-05-07T13:58:05.150456 #197937] INFO -- : [598/885] 238919=test_reline I, [2024-05-07T13:58:05.302961 #197937] INFO -- : [599/885] 238919=test_thread I, [2024-05-07T13:58:05.936639 #197937] INFO -- : [600/885] 238920=test_inlinecache I, [2024-05-07T13:58:05.986848 #197937] INFO -- : [601/885] 238920=test_terminfo I, [2024-05-07T13:58:05.997751 #197937] INFO -- : [602/885] 238920=test_socket I, [2024-05-07T13:58:06.993373 #197937] INFO -- : [603/885] 238920=test_bug-14834 I, [2024-05-07T13:58:07.000034 #197937] INFO -- : [604/885] 238920=test_data I, [2024-05-07T13:58:07.007718 #197937] INFO -- : [605/885] 238920=test_to_ruby I, [2024-05-07T13:58:07.026494 #197937] INFO -- : [606/885] 238920=test_addrinfo I, [2024-05-07T13:58:07.060284 #197937] INFO -- : .Leaked file descriptor: TestSocketAddrinfo#test_addrinfo_timeout: 9 # I, [2024-05-07T13:58:07.093103 #197937] INFO -- : COMMAND PID USER FD TYPE DEVICE SIZE/OFF NODE NAME I, [2024-05-07T13:58:07.093199 #197937] INFO -- : ruby 238920 opc 9u unix 0x0000000000000000 0t0 2880606647 type=STREAM I, [2024-05-07T13:58:07.171199 #197937] INFO -- : [607/885] 238920=test_time_tz I, [2024-05-07T13:58:07.217901 #197937] INFO -- : [608/885] 238920=test_ancdata I, [2024-05-07T13:58:07.287543 #197937] INFO -- : [609/885] 238920=ractor_test I, [2024-05-07T13:58:07.300281 #197937] INFO -- : [610/885] 238920=test_marshal I, [2024-05-07T13:58:08.598298 #197937] INFO -- : [611/885] 238920=test_nesting_parser I, [2024-05-07T13:58:08.614931 #197937] INFO -- : [612/885] 238920=test_rdoc_markup_hard_break I, [2024-05-07T13:58:08.625990 #197937] INFO -- : [613/885] 238920=test_bignum I, [2024-05-07T13:58:09.877467 #197937] INFO -- : [614/885] 238918=newline_test I, [2024-05-07T13:58:09.953494 #197937] INFO -- : [615/885] 238918=test_enc_str_buf_cat I, [2024-05-07T13:58:09.965671 #197937] INFO -- : [616/885] 238918=test_gem_commands_help_command I, [2024-05-07T13:58:10.040403 #197937] INFO -- : [617/885] 238918=test_scheduler I, [2024-05-07T13:58:10.235561 #197937] INFO -- : [618/885] 238918=test_ssl I, [2024-05-07T13:58:10.470675 #197937] INFO -- : [619/885] 238918=test_ractor I, [2024-05-07T13:58:10.718014 #197937] INFO -- : [620/885] 238918=test_gem_resolver_conflict I, [2024-05-07T13:58:10.740533 #197937] INFO -- : [621/885] 238918=test_ractor I, [2024-05-07T13:58:10.751731 #197937] INFO -- : [622/885] 238918=json_generator_test I, [2024-05-07T13:58:10.865977 #197937] INFO -- : [623/885] 238918=test_ansi_without_terminfo I, [2024-05-07T13:58:10.872332 #197937] INFO -- : [624/885] 238918=test_registry I, [2024-05-07T13:58:10.890305 #197937] INFO -- : [625/885] 238918=test_gem I, [2024-05-07T13:58:12.214488 #197937] INFO -- : [626/885] 238920=test_cgi_core I, [2024-05-07T13:58:12.231275 #197937] INFO -- : [627/885] 238920=test_gem_resolver_best_set I, [2024-05-07T13:58:12.367512 #197937] INFO -- : [628/885] 238920=test_rdoc_markup_to_label I, [2024-05-07T13:58:12.401609 #197937] INFO -- : [629/885] 238920=test_parser I, [2024-05-07T13:58:12.421009 #197937] INFO -- : [630/885] 238920=test_require I, [2024-05-07T13:58:13.211109 #197937] INFO -- : [631/885] 238918=test_recursion I, [2024-05-07T13:58:13.216527 #197937] INFO -- : [632/885] 238918=test_rdoc_markup_include I, [2024-05-07T13:58:13.230062 #197937] INFO -- : [633/885] 238918=test_enum I, [2024-05-07T13:58:13.709758 #197937] INFO -- : [634/885] 238920=test_extlibs I, [2024-05-07T13:58:14.192660 #197937] INFO -- : [635/885] 238919=test_iter_break I, [2024-05-07T13:58:14.195770 #197937] INFO -- : [636/885] 238919=test_range I, [2024-05-07T13:58:14.209365 #197937] INFO -- : [637/885] 238918=test_gem_commands_signin_command I, [2024-05-07T13:58:14.385212 #197937] INFO -- : [638/885] 238918=test_num2int I, [2024-05-07T13:58:14.399987 #197937] INFO -- : [639/885] 238918=test_rbconfig I, [2024-05-07T13:58:14.418249 #197937] INFO -- : [640/885] 238918=test_ts I, [2024-05-07T13:58:14.705299 #197937] INFO -- : [641/885] 238918=test_locale I, [2024-05-07T13:58:14.733350 #197937] INFO -- : [642/885] 238918=test_rdoc_attr I, [2024-05-07T13:58:14.745792 #197937] INFO -- : [643/885] 238918=test_address_resolve I, [2024-05-07T13:58:14.756279 #197937] INFO -- : [644/885] 238918=test_stream I, [2024-05-07T13:58:14.805588 #197937] INFO -- : [645/885] 238918=test_ractor I, [2024-05-07T13:58:14.838649 #197937] INFO -- : [646/885] 238918=test_trick I, [2024-05-07T13:58:15.011131 #197937] INFO -- : [647/885] 238919=test_gem_resolver_local_specification I, [2024-05-07T13:58:15.038364 #197937] INFO -- : [648/885] 238919=test_configuration I, [2024-05-07T13:58:15.131543 #197937] INFO -- : [649/885] 238919=test_date_new I, [2024-05-07T13:58:15.142212 #197937] INFO -- : [650/885] 238919=test_gem_commands_list_command I, [2024-05-07T13:58:15.169043 #197937] INFO -- : [651/885] 238919=test_date_marshal I, [2024-05-07T13:58:15.192764 #197937] INFO -- : [652/885] 238919=test_have_func I, [2024-05-07T13:58:15.339727 #197937] INFO -- : [653/885] 238920=test_integer I, [2024-05-07T13:58:16.379073 #197937] INFO -- : [654/885] 238919=test_unix I, [2024-05-07T13:58:16.417138 #197937] INFO -- : [655/885] 238919=test_formatter I, [2024-05-07T13:58:16.432227 #197937] INFO -- : [656/885] 238919=test_gem_commands_contents_command I, [2024-05-07T13:58:16.580047 #197937] INFO -- : [657/885] 238919=test_context I, [2024-05-07T13:58:16.670168 #197937] INFO -- : [658/885] 238919=test_udp I, [2024-05-07T13:58:16.693559 #197937] INFO -- : [659/885] 238919=test_symbol I, [2024-05-07T13:58:17.408769 #197937] INFO -- : [660/885] 238918=test_gem_commands_search_command I, [2024-05-07T13:58:17.421199 #197937] INFO -- : [661/885] 238918=test_rdoc_servlet I, [2024-05-07T13:58:17.529673 #197937] INFO -- : [662/885] 238918=test_coder I, [2024-05-07T13:58:17.645979 #197937] INFO -- : [663/885] 238918=test_ssl I, [2024-05-07T13:58:17.762499 #197937] INFO -- : [664/885] 238920=test_abi I, [2024-05-07T13:58:17.897863 #197937] INFO -- : [665/885] 238920=test_load I, [2024-05-07T13:58:17.904694 #197937] INFO -- : Leaked file descriptor: TestOptionParserLoad#test_load_nothing: 10 # I, [2024-05-07T13:58:17.937462 #197937] INFO -- : COMMAND PID USER FD TYPE DEVICE SIZE/OFF NODE NAME I, [2024-05-07T13:58:17.937535 #197937] INFO -- : ruby 238920 opc 10r REG 252,0 9253600 13705411 /var/lib/sss/mc/passwd I, [2024-05-07T13:58:18.018602 #197937] INFO -- : [666/885] 238920=test_integer_comb I, [2024-05-07T13:58:20.332254 #197937] INFO -- : [667/885] 238920=test_bundled_ca I, [2024-05-07T13:58:21.905476 #197937] INFO -- : [668/885] 238919=test_usrmarshal I, [2024-05-07T13:58:22.044521 #197937] INFO -- : [669/885] 238919=test_gem_source_installed I, [2024-05-07T13:58:22.056693 #197937] INFO -- : [670/885] 238919=test_gem_validator I, [2024-05-07T13:58:22.071093 #197937] INFO -- : [671/885] 238919=test_gem_security_trust_dir I, [2024-05-07T13:58:22.082201 #197937] INFO -- : [672/885] 238920=test_erb_command I, [2024-05-07T13:58:22.109074 #197937] INFO -- : [673/885] 238920=test_module I, [2024-05-07T13:58:22.184427 #197937] INFO -- : [674/885] 238919=test_engine I, [2024-05-07T13:58:22.666948 #197937] INFO -- : [675/885] 238919=test_gem_commands_mirror I, [2024-05-07T13:58:22.677316 #197937] INFO -- : [676/885] 238919=test_fiber I, [2024-05-07T13:58:26.101636 #197937] INFO -- : [677/885] 238920=test_key_error I, [2024-05-07T13:58:26.106886 #197937] INFO -- : [678/885] 238920=test_win32ole_param I, [2024-05-07T13:58:26.125927 #197937] INFO -- : [679/885] 238920=test_resize I, [2024-05-07T13:58:26.130090 #197937] INFO -- : [680/885] 238920=test_gem_package_task I, [2024-05-07T13:58:26.187945 #197937] INFO -- : [681/885] 238920=test_lock_native_thread I, [2024-05-07T13:58:26.420847 #197937] INFO -- : [682/885] 238920=test_struct I, [2024-05-07T13:58:26.428644 #197937] INFO -- : [683/885] 238920=static_inspect_test I, [2024-05-07T13:58:26.445999 #197937] INFO -- : [684/885] 238920=test_c_struct_entry I, [2024-05-07T13:58:27.304751 #197937] INFO -- : [685/885] 238920=test_rubyvm I, [2024-05-07T13:58:27.316756 #197937] INFO -- : [686/885] 238920=fuzzer_test I, [2024-05-07T13:58:27.365151 #197937] INFO -- : [687/885] 238920=test_cparser I, [2024-05-07T13:58:27.897692 #197937] INFO -- : [688/885] 238918=test_rdoc_parser_markdown I, [2024-05-07T13:58:27.915366 #197937] INFO -- : [689/885] 238918=test_custom_command I, [2024-05-07T13:58:27.915460 #197937] INFO -- : [690/885] 238918=test_change_word I, [2024-05-07T13:58:27.930160 #197937] INFO -- : [691/885] 238918=test_depth_first I, [2024-05-07T13:58:27.941266 #197937] INFO -- : [692/885] 238918=test_ostruct I, [2024-05-07T13:58:28.081794 #197937] INFO -- : [693/885] 238918=test_config I, [2024-05-07T13:58:28.142091 #197937] INFO -- : [694/885] 238918=test_new I, [2024-05-07T13:58:28.167084 #197937] INFO -- : [695/885] 238918=test_cipher I, [2024-05-07T13:58:28.194106 #197937] INFO -- : [696/885] 238918=test_update I, [2024-05-07T13:58:28.208038 #197937] INFO -- : [697/885] 238918=test_gem_source_lock I, [2024-05-07T13:58:28.272537 #197937] INFO -- : [698/885] 238918=test_load I, [2024-05-07T13:58:28.282605 #197937] INFO -- : [699/885] 238918=test_win32ole_type I, [2024-05-07T13:58:28.289707 #197937] INFO -- : [700/885] 238918=test_rdoc_rd_inline_parser I, [2024-05-07T13:58:28.343867 #197937] INFO -- : [701/885] 238918=test_metaclass I, [2024-05-07T13:58:28.346152 #197937] INFO -- : [702/885] 238918=test_require_lib I, [2024-05-07T13:58:28.904298 #197937] INFO -- : [703/885] 238919=test_gem_gem_runner I, [2024-05-07T13:58:28.971853 #197937] INFO -- : [704/885] 238919=test_rdoc_rd I, [2024-05-07T13:58:28.979172 #197937] INFO -- : [705/885] 238919=test_rdoc_generator_pot I, [2024-05-07T13:58:28.985841 #197937] INFO -- : [706/885] 238919=test_rdoc_markup_to_joined_paragraph I, [2024-05-07T13:58:28.996642 #197937] INFO -- : [707/885] 238919=test_rdoc_markup_to_markdown I, [2024-05-07T13:58:29.053702 #197937] INFO -- : [708/885] 238919=test_rdoc_rd_block_parser I, [2024-05-07T13:58:29.128592 #197937] INFO -- : [709/885] 238919=test_x509store I, [2024-05-07T13:58:29.598033 #197937] INFO -- : [710/885] 238920=test_option I, [2024-05-07T13:58:29.605295 #197937] INFO -- : [711/885] 238919=test_wss I, [2024-05-07T13:58:29.618137 #197937] INFO -- : [712/885] 238919=test_rdoc_markup_attribute_manager I, [2024-05-07T13:58:29.654464 #197937] INFO -- : [713/885] 238919=test_tracer I, [2024-05-07T13:58:29.666195 #197937] INFO -- : [714/885] 238919=test_cgi_cookie I, [2024-05-07T13:58:29.679357 #197937] INFO -- : [715/885] 238919=test_not I, [2024-05-07T13:58:29.682301 #197937] INFO -- : [716/885] 238920=test_debugger_integration I, [2024-05-07T13:58:29.695661 #197937] INFO -- : [717/885] 238919=test_gem_resolver_composed_set I, [2024-05-07T13:58:29.700596 #197937] INFO -- : [718/885] 238920=test_my_integer I, [2024-05-07T13:58:29.707471 #197937] INFO -- : [719/885] 238920=test_require I, [2024-05-07T13:58:29.714814 #197937] INFO -- : [720/885] 238919=test_objectspace I, [2024-05-07T13:58:30.653291 #197937] INFO -- : [721/885] 238919=test_placearg I, [2024-05-07T13:58:30.738997 #197937] INFO -- : [722/885] 238919=test_rational2 I, [2024-05-07T13:58:30.741669 #197937] INFO -- : [723/885] 238919=test_case_comprehensive I, [2024-05-07T13:58:31.275966 #197937] INFO -- : [724/885] 238918=test_logperiod I, [2024-05-07T13:58:31.288763 #197937] INFO -- : [725/885] 238918=test_ssl_session I, [2024-05-07T13:58:32.164374 #197937] INFO -- : [726/885] 238918=test_gem_package_tar_header I, [2024-05-07T13:58:32.226478 #197937] INFO -- : [727/885] 238918=test_gem_ci_detector I, [2024-05-07T13:58:32.236821 #197937] INFO -- : [728/885] 238918=test_fixnum I, [2024-05-07T13:58:32.256046 #197937] INFO -- : [729/885] 238918=test_signal I, [2024-05-07T13:58:32.409404 #197937] INFO -- : [730/885] 238920=test_gem_silent_ui I, [2024-05-07T13:58:32.468451 #197937] INFO -- : [731/885] 238920=test_continuation I, [2024-05-07T13:58:32.476393 #197937] INFO -- : [732/885] 238920=test_io_wait_uncommon I, [2024-05-07T13:58:32.543210 #197937] INFO -- : [733/885] 238920=test_handle I, [2024-05-07T13:58:33.525806 #197937] INFO -- : [734/885] 238920=parse_stream_test I, [2024-05-07T13:58:33.539421 #197937] INFO -- : [735/885] 238920=test_gem_security_policy I, [2024-05-07T13:58:33.976466 #197937] INFO -- : [736/885] 238920=test_delete I, [2024-05-07T13:58:34.002658 #197937] INFO -- : [737/885] 238920=test_rdoc_markup_document I, [2024-05-07T13:58:34.031741 #197937] INFO -- : [738/885] 238920=test_file_exhaustive I, [2024-05-07T13:58:34.284779 #197937] INFO -- : [739/885] 238918=test_completion I, [2024-05-07T13:58:35.065664 #197937] INFO -- : [740/885] 238918=test_name_error_extension I, [2024-05-07T13:58:35.080298 #197937] INFO -- : [741/885] 238918=test_gem_request_set_gem_dependency_api I, [2024-05-07T13:58:35.419549 #197937] INFO -- : [742/885] 238918=test_gem_commands_info_command I, [2024-05-07T13:58:35.454189 #197937] INFO -- : [743/885] 238918=test_https I, [2024-05-07T13:58:35.579388 #197937] INFO -- : [744/885] 238918=test_object_create_start I, [2024-05-07T13:58:35.590976 #197937] INFO -- : [745/885] 238918=test_rdoc_markup_to_ansi I, [2024-05-07T13:58:35.647723 #197937] INFO -- : [746/885] 238918=test_files_test I, [2024-05-07T13:58:35.761994 #197937] INFO -- : [747/885] 238918=test_weakkeymap I, [2024-05-07T13:58:36.170977 #197937] INFO -- : [748/885] 238918=test_protocol I, [2024-05-07T13:58:36.482692 #197937] INFO -- : [749/885] 238918=test_evaluation I, [2024-05-07T13:58:36.559852 #197937] INFO -- : [750/885] 238918=test_ast I, [2024-05-07T13:58:45.157223 #197937] INFO -- : [751/885] 238920=test_logdevice I, [2024-05-07T13:58:46.196470 #197937] INFO -- : [752/885] 238920=test_require_path_check I, [2024-05-07T13:58:46.256162 #197937] INFO -- : [753/885] 238920=test_variable_name_check I, [2024-05-07T13:58:46.300792 #197937] INFO -- : [754/885] 238920=test_bn I, [2024-05-07T13:58:46.314224 #197937] INFO -- : [755/885] 238920=test_irb I, [2024-05-07T13:58:46.678722 #197937] INFO -- : [756/885] 238920=test_x509cert I, [2024-05-07T13:58:46.761032 #197937] INFO -- : [757/885] 238920=test_rdoc_markup_paragraph I, [2024-05-07T13:58:46.772769 #197937] INFO -- : [758/885] 238920=test_date_arith I, [2024-05-07T13:58:46.792768 #197937] INFO -- : [759/885] 238920=test_gem_resolver_vendor_specification I, [2024-05-07T13:58:46.835993 #197937] INFO -- : [760/885] 238920=test_fiddle I, [2024-05-07T13:58:47.094036 #197937] INFO -- : [761/885] 238920=json_generic_object_test I, [2024-05-07T13:58:47.099431 #197937] INFO -- : [762/885] 238920=test_stringscanner I, [2024-05-07T13:58:47.164426 #197937] INFO -- : [763/885] 238920=test_ractor I, [2024-05-07T13:58:47.262304 #197937] INFO -- : [764/885] 238920=test_exception_at_throwing I, [2024-05-07T13:58:47.333745 #197937] INFO -- : [765/885] 238920=test_gem_resolver_installed_specification I, [2024-05-07T13:58:47.364826 #197937] INFO -- : [766/885] 238920=test_digest I, [2024-05-07T13:58:48.193534 #197937] INFO -- : [767/885] 238920=test_gem_commands_check_command I, [2024-05-07T13:58:48.221940 #197937] INFO -- : [768/885] 238920=test_gem_resolver_git_set I, [2024-05-07T13:58:48.859712 #197937] INFO -- : [769/885] 238920=test_signedness I, [2024-05-07T13:58:50.825232 #197937] INFO -- : [770/885] 238920=test_rdoc_ri_driver I, [2024-05-07T13:58:51.227084 #197937] INFO -- : [771/885] 238920=test_httpheader I, [2024-05-07T13:58:51.239473 #197937] INFO -- : [772/885] 238920=test_sexp I, [2024-05-07T13:58:51.298294 #197937] INFO -- : [773/885] 238920=test_ractor I, [2024-05-07T13:58:51.348701 #197937] INFO -- : [774/885] 238920=test_gem_safe_marshal I, [2024-05-07T13:58:51.563407 #197937] INFO -- : [775/885] 238919=test_gem_local_remote_options I, [2024-05-07T13:58:51.631715 #197937] INFO -- : [776/885] 238919=test_gem_ext_cargo_builder_link_flag_converter I, [2024-05-07T13:58:51.732569 #197937] INFO -- : [777/885] 238919=test_acceptable I, [2024-05-07T13:58:51.811126 #197937] INFO -- : [778/885] 238919=test_rdoc_single_class I, [2024-05-07T13:58:51.828239 #197937] INFO -- : [779/885] 238919=test_dup I, [2024-05-07T13:58:51.992625 #197937] INFO -- : [780/885] 238919=test_struct I, [2024-05-07T13:58:52.412897 #197937] INFO -- : [781/885] 238920=test_tmpdir I, [2024-05-07T13:58:52.489834 #197937] INFO -- : [782/885] 238920=heredoc_dedent_test I, [2024-05-07T13:58:52.501704 #197937] INFO -- : [783/885] 238920=test_type I, [2024-05-07T13:58:52.567789 #197937] INFO -- : [784/885] 238920=test_mutex I, [2024-05-07T13:58:52.579935 #197937] INFO -- : [785/885] 238919=test_rdoc_token_stream I, [2024-05-07T13:58:52.591008 #197937] INFO -- : [786/885] 238919=test_random I, [2024-05-07T13:58:52.601364 #197937] INFO -- : [787/885] 238919=test_files_ext I, [2024-05-07T13:58:52.613897 #197937] INFO -- : [788/885] 238919=test_thread_cv I, [2024-05-07T13:58:53.246861 #197937] INFO -- : [789/885] 238919=test_assembler I, [2024-05-07T13:58:53.261364 #197937] INFO -- : [790/885] 238919=test_stringio I, [2024-05-07T13:58:53.399182 #197937] INFO -- : [791/885] 238919=test_ripper I, [2024-05-07T13:58:53.666564 #197937] INFO -- : [792/885] 238920=test_gem_source_git I, [2024-05-07T13:58:53.702083 #197937] INFO -- : [793/885] 238919=test_regex_casefold I, [2024-05-07T13:58:54.147154 #197937] INFO -- : [794/885] 238919=test_lexer I, [2024-05-07T13:58:54.154910 #197937] INFO -- : [795/885] 238919=test_win32ole_method I, [2024-05-07T13:58:54.159411 #197937] INFO -- : [796/885] 238919=test_unicode I, [2024-05-07T13:58:54.184796 #197937] INFO -- : [797/885] 238919=dispatcher_test I, [2024-05-07T13:58:54.187326 #197937] INFO -- : [798/885] 238919=test_eval_history I, [2024-05-07T13:58:54.213394 #197937] INFO -- : [799/885] 238919=test_array I, [2024-05-07T13:58:54.802793 #197937] INFO -- : [800/885] 238920=test_gem_package I, [2024-05-07T13:58:55.782510 #197937] INFO -- : [801/885] 238920=test_autoload I, [2024-05-07T13:59:00.074220 #197937] INFO -- : [802/885] 238920=test_class I, [2024-05-07T13:59:00.077728 #197937] INFO -- : [803/885] 238920=test_mkmf I, [2024-05-07T13:59:00.117153 #197937] INFO -- : [804/885] 238920=test_gem_source I, [2024-05-07T13:59:00.480953 #197937] INFO -- : [805/885] 238920=test_have_macro I, [2024-05-07T13:59:00.795252 #197937] INFO -- : [806/885] 238920=test_at_exit I, [2024-05-07T13:59:00.805645 #197937] INFO -- : [807/885] 238920=test_benchmark I, [2024-05-07T13:59:02.570582 #197937] INFO -- : [808/885] 238920=test_find_executable I, [2024-05-07T13:59:02.583041 #197937] INFO -- : [809/885] 238920=test_arithmetic_sequence I, [2024-05-07T13:59:02.661745 #197937] INFO -- : [810/885] 238920=test_ractor_compatibility I, [2024-05-07T13:59:02.970624 #197937] INFO -- : [811/885] 238920=test_autoconf I, [2024-05-07T13:59:02.980454 #197937] INFO -- : [812/885] 238920=integer_parse_test I, [2024-05-07T13:59:02.997347 #197937] INFO -- : [813/885] 238920=test_gem_request_set_lockfile_tokenizer I, [2024-05-07T13:59:03.111494 #197937] INFO -- : [814/885] 238920=test_cgi_multipart I, [2024-05-07T13:59:03.231979 #197937] INFO -- : [815/885] 238920=test_lazy_enumerator I, [2024-05-07T13:59:03.736003 #197937] INFO -- : [816/885] 238920=test_encoding I, [2024-05-07T13:59:03.751980 #197937] INFO -- : [817/885] 238920=test_install I, [2024-05-07T13:59:03.950338 #197937] INFO -- : [818/885] 238920=test_rdoc_comment I, [2024-05-07T13:59:03.999824 #197937] INFO -- : [819/885] 238920=test_gem_source_fetch_problem I, [2024-05-07T13:59:04.026421 #197937] INFO -- : [820/885] 238920=test_sockopt I, [2024-05-07T13:59:04.037809 #197937] INFO -- : [821/885] 238920=test_ftp I, [2024-05-07T13:59:04.042838 #197937] INFO -- : [822/885] 238920=test_singleton_function I, [2024-05-07T13:59:04.050368 #197937] INFO -- : [823/885] 238920=test_gem_safe_yaml I, [2024-05-07T13:59:04.066469 #197937] INFO -- : [824/885] 238920=test_eval I, [2024-05-07T13:59:04.083060 #197937] INFO -- : [825/885] 238920=test_document I, [2024-05-07T13:59:04.100916 #197937] INFO -- : [826/885] 238920=test_history I, [2024-05-07T13:59:04.169577 #197937] INFO -- : [827/885] 238920=test_gem_commands_setup_command I, [2024-05-07T13:59:05.057612 #197937] INFO -- : [828/885] 238920=test_pair I, [2024-05-07T13:59:07.880219 #197937] INFO -- : [829/885] 238919=test_win32ole_variant_m I, [2024-05-07T13:59:07.886812 #197937] INFO -- : [830/885] 238919=test_env I, [2024-05-07T13:59:10.408724 #197937] INFO -- : [831/885] 238919=test_gem_package_tar_reader I, [2024-05-07T13:59:10.427680 #197937] INFO -- : [832/885] 238920=test_gem_commands_signout_command I, [2024-05-07T13:59:10.446222 #197937] INFO -- : [833/885] 238920=command_line_test I, [2024-05-07T13:59:10.460320 #197937] INFO -- : [834/885] 238920=test_parser I, [2024-05-07T13:59:10.479097 #197937] INFO -- : [835/885] 238920=test_rdoc_ri_paths I, [2024-05-07T13:59:10.514160 #197937] INFO -- : [836/885] 238919=test_primitive I, [2024-05-07T13:59:10.526031 #197937] INFO -- : [837/885] 238920=test_iseq I, [2024-05-07T13:59:10.528422 #197937] INFO -- : [838/885] 238919=test_rdoc_rd_inline I, [2024-05-07T13:59:10.547711 #197937] INFO -- : [839/885] 238919=test_path I, [2024-05-07T13:59:10.559598 #197937] INFO -- : [840/885] 238919=test_digest I, [2024-05-07T13:59:10.596889 #197937] INFO -- : [841/885] 238919=test_closure I, [2024-05-07T13:59:11.242152 #197937] INFO -- : [842/885] 238920=test_resolve_symbol I, [2024-05-07T13:59:11.289961 #197937] INFO -- : [843/885] 238920=test_rubygems I, [2024-05-07T13:59:11.438549 #197937] INFO -- : [844/885] 238920=test_dir I, [2024-05-07T13:59:11.798310 #197937] INFO -- : [845/885] 238920=test_files_test_1 I, [2024-05-07T13:59:11.805844 #197937] INFO -- : [846/885] 238920=test_uncorrectable_name_check I, [2024-05-07T13:59:11.854791 #197937] INFO -- : [847/885] 238920=test_io I, [2024-05-07T13:59:13.554255 #197937] INFO -- : [848/885] 238919=test_win32ole_variant I, [2024-05-07T13:59:13.562880 #197937] INFO -- : [849/885] 238919=magic_comment_test I, [2024-05-07T13:59:13.572689 #197937] INFO -- : [850/885] 238919=test_cgi_modruby I, [2024-05-07T13:59:13.574303 #197937] INFO -- : [851/885] 238919=test_workspace I, [2024-05-07T13:59:13.700948 #197937] INFO -- : [852/885] 238919=test_printf I, [2024-05-07T13:59:13.714917 #197937] INFO -- : [853/885] 238919=test_x509attr I, [2024-05-07T13:59:13.721528 #197937] INFO -- : [854/885] 238919=test_stat I, [2024-05-07T13:59:13.728755 #197937] INFO -- : [855/885] 238919=test_nomethod_error I, [2024-05-07T13:59:13.820077 #197937] INFO -- : [856/885] 238919=test_gem_commands_rebuild_command I, [2024-05-07T13:59:13.833394 #197937] INFO -- : [857/885] 238919=test_etc I, [2024-05-07T13:59:13.838281 #197937] INFO -- : Leaked file descriptor: TestEtc#test_passwd_with_low_level_api: 10 # I, [2024-05-07T13:59:13.864427 #197937] INFO -- : COMMAND PID USER FD TYPE DEVICE SIZE/OFF NODE NAME I, [2024-05-07T13:59:13.864555 #197937] INFO -- : ruby 238919 opc 10u unix 0x0000000000000000 0t0 2880614445 type=STREAM I, [2024-05-07T13:59:13.937703 #197937] INFO -- : Leaked file descriptor: TestEtc#test_getlogin: 11 # I, [2024-05-07T13:59:13.965615 #197937] INFO -- : COMMAND PID USER FD TYPE DEVICE SIZE/OFF NODE NAME I, [2024-05-07T13:59:13.965687 #197937] INFO -- : ruby 238919 opc 11r REG 252,0 9253600 13705411 /var/lib/sss/mc/passwd I, [2024-05-07T13:59:14.125559 #197937] INFO -- : [858/885] 238919=test_https_proxy I, [2024-05-07T13:59:14.140783 #197937] INFO -- : [859/885] 238919=test_rdoc_parser I, [2024-05-07T13:59:14.163735 #197937] INFO -- : [860/885] 238919=test_win32ole_param_event I, [2024-05-07T13:59:14.164378 #197937] INFO -- : [861/885] 238919=test_rdoc_generator_pot_po I, [2024-05-07T13:59:14.179281 #197937] INFO -- : [862/885] 238919=test_mul I, [2024-05-07T13:59:14.183600 #197937] INFO -- : [863/885] 238919=test_shellwords I, [2024-05-07T13:59:14.217766 #197937] INFO -- : [864/885] 238919=test_date_strptime I, [2024-05-07T13:59:14.319723 #197937] INFO -- : [865/885] 238919=test_omap I, [2024-05-07T13:59:14.337147 #197937] INFO -- : [866/885] 238919=test_ocsp I, [2024-05-07T13:59:14.428926 #197937] INFO -- : [867/885] 238919=test_scanner_events I, [2024-05-07T13:59:14.461281 #197937] INFO -- : [868/885] 238919=test_ipaddr I, [2024-05-07T13:59:14.501517 #197937] INFO -- : [869/885] 238919=test_rdoc_parser_simple I, [2024-05-07T13:59:14.525955 #197937] INFO -- : [870/885] 238919=test_nonblock I, [2024-05-07T13:59:14.561481 #197937] INFO -- : [871/885] 238919=test_gem_ext_configure_builder I, [2024-05-07T13:59:14.602977 #197937] INFO -- : [872/885] 238919=json_ext_parser_test I, [2024-05-07T13:59:14.614457 #197937] INFO -- : [873/885] 238919=test_color I, [2024-05-07T13:59:14.682906 #197937] INFO -- : [874/885] 238919=test_cmethod I, [2024-05-07T13:59:14.699148 #197937] INFO -- : [875/885] 238919=test_gem_stub_specification I, [2024-05-07T13:59:14.953399 #197937] INFO -- : [876/885] 238919=test_float I, [2024-05-07T13:59:17.032008 #197937] INFO -- : [877/885] 238919=test_rdoc_top_level I, [2024-05-07T13:59:17.277228 #197937] INFO -- : [878/885] 238919=test_io_m17n I, [2024-05-07T13:59:18.626907 #197937] INFO -- : [879/885] 238919=test_gem_stream_ui I, [2024-05-07T13:59:18.796768 #197937] INFO -- : [880/885] 238919=test_rdoc_generator_ri I, [2024-05-07T13:59:18.913294 #197937] INFO -- : [881/885] 238919=test_unicode_normalize I, [2024-05-07T13:59:21.490160 #197937] INFO -- : [882/885] 238918=test_gem_commands_lock_command I, [2024-05-07T13:59:21.535734 #197937] INFO -- : [883/885] 238918=test_reline_key I, [2024-05-07T13:59:21.540843 #197937] INFO -- : [884/885] 238918=test_propertyputref I, [2024-05-07T13:59:21.549276 #197937] INFO -- : [885/885] 238918=test_gb18030 I, [2024-05-07T13:59:24.638439 #197937] INFO -- : Finished tests in 196.669194s, 133.7169 tests/s, 47542.3162 assertions/s. E, [2024-05-07T13:59:24.639686 #197937] ERROR -- : Children under /tmp/rubytest.yz5w8o: E, [2024-05-07T13:59:24.639841 #197937] ERROR -- : * drwx------ 4 28 2024-05-07 13:59:13 +0000 gem_rebuild20240507-238919-ml2kvj/ E, [2024-05-07T13:59:24.639860 #197937] ERROR -- : * drwxrwxr-x 2 40 2024-05-07 13:59:13 +0000 old/ E, [2024-05-07T13:59:24.639910 #197937] ERROR -- : * -rw-rw-r-- 1 4096 2024-05-07 13:59:13 +0000 rebuild_test_gem-1.0.0.gem E, [2024-05-07T13:59:24.640045 #197937] ERROR -- : * drwxrwxr-x 2 40 2024-05-07 13:59:13 +0000 new/ E, [2024-05-07T13:59:24.640061 #197937] ERROR -- : * -rw-rw-r-- 1 4096 2024-05-07 13:59:13 +0000 rebuild_test_gem-1.0.0.gem I, [2024-05-07T13:59:24.646008 #197937] INFO -- : 26298 tests, 9350109 assertions, 0 failures, 0 errors, 320 skips I, [2024-05-07T13:59:24.646043 #197937] INFO -- : I, [2024-05-07T13:59:24.646054 #197937] INFO -- : ruby -v: ruby 3.4.0dev (2024-05-07T06:59:36Z master e1e6b4972f) [aarch64-linux] I, [2024-05-07T13:59:24.646942 #197937] INFO -- : $$$[end] "make yes-test-all TESTOPTS='--stderr-on-failure' TESTS='-j3'" exit with 0. I, [2024-05-07T13:59:24.647147 #197937] INFO -- : $$$[beg] make yes-test-rubyspec MSPECOPT='--error-output stderr --debug -j' TESTS='-j3' I, [2024-05-07T13:59:24.772945 #197937] INFO -- : BASERUBY = /usr/local/bin/ruby --disable=gems I, [2024-05-07T13:59:24.773020 #197937] INFO -- : CC = gcc I, [2024-05-07T13:59:24.773032 #197937] INFO -- : LD = ld I, [2024-05-07T13:59:24.773040 #197937] INFO -- : LDSHARED = gcc -shared I, [2024-05-07T13:59:24.773052 #197937] INFO -- : CFLAGS = -O3 -fno-fast-math -ggdb3 -Wall -Wextra -Wdeprecated-declarations -Wdiv-by-zero -Wduplicated-cond -Wimplicit-function-declaration -Wimplicit-int -Wpointer-arith -Wwrite-strings -Wold-style-definition -Wimplicit-fallthrough=0 -Wmissing-noreturn -Wno-cast-function-type -Wno-constant-logical-operand -Wno-long-long -Wno-missing-field-initializers -Wno-overlength-strings -Wno-packed-bitfield-compat -Wno-parentheses-equality -Wno-self-assign -Wno-tautological-compare -Wno-unused-parameter -Wno-unused-value -Wsuggest-attribute=format -Wsuggest-attribute=noreturn -Wunused-variable -Wmisleading-indentation -Wundef I, [2024-05-07T13:59:24.773062 #197937] INFO -- : XCFLAGS = -U_FORTIFY_SOURCE -D_FORTIFY_SOURCE=2 -fstack-protector-strong -msign-return-address=all -fno-strict-overflow -fvisibility=hidden -fexcess-precision=standard -DRUBY_EXPORT -fPIE -I. -I.ext/include/aarch64-linux -I/home/opc/ruby/src/master/include -I/home/opc/ruby/src/master -I/home/opc/ruby/src/master/prism -I/home/opc/ruby/src/master/enc/unicode/15.0.0 I, [2024-05-07T13:59:24.773071 #197937] INFO -- : CPPFLAGS = I, [2024-05-07T13:59:24.773079 #197937] INFO -- : DLDFLAGS = -Wl,--compress-debug-sections=zlib -fstack-protector-strong -pie I, [2024-05-07T13:59:24.773089 #197937] INFO -- : SOLIBS = -lz -lrt -lrt -ldl -lcrypt -lm -lpthread I, [2024-05-07T13:59:24.773097 #197937] INFO -- : LANG = en_US.UTF-8 I, [2024-05-07T13:59:24.773141 #197937] INFO -- : LC_ALL = I, [2024-05-07T13:59:24.773151 #197937] INFO -- : LC_CTYPE = I, [2024-05-07T13:59:24.773160 #197937] INFO -- : MFLAGS = I, [2024-05-07T13:59:24.773168 #197937] INFO -- : RUSTC = rustc I, [2024-05-07T13:59:24.773176 #197937] INFO -- : YJIT_RUSTC_ARGS = --crate-name=yjit --crate-type=staticlib --edition=2021 -g -C lto=thin -C opt-level=3 -C overflow-checks=on '--out-dir=/home/opc/ruby/build/master/yjit/target/release/' /home/opc/ruby/src/master/yjit/src/lib.rs I, [2024-05-07T13:59:24.774274 #197937] INFO -- : gcc (GCC) 8.5.0 20210514 (Red Hat 8.5.0-10.1.0.1) I, [2024-05-07T13:59:24.774293 #197937] INFO -- : Copyright (C) 2018 Free Software Foundation, Inc. I, [2024-05-07T13:59:24.774303 #197937] INFO -- : This is free software; see the source for copying conditions. There is NO I, [2024-05-07T13:59:24.774311 #197937] INFO -- : warranty; not even for MERCHANTABILITY or FITNESS FOR A PARTICULAR PURPOSE. I, [2024-05-07T13:59:24.774319 #197937] INFO -- : I, [2024-05-07T13:59:24.776315 #197937] INFO -- : generating enc.mk I, [2024-05-07T13:59:25.006013 #197937] INFO -- : making enc I, [2024-05-07T13:59:25.033156 #197937] INFO -- : make[1]: Entering directory '/home/opc/ruby/build/master' I, [2024-05-07T13:59:25.033228 #197937] INFO -- : make[1]: Nothing to be done for 'enc'. I, [2024-05-07T13:59:25.033239 #197937] INFO -- : make[1]: Leaving directory '/home/opc/ruby/build/master' I, [2024-05-07T13:59:25.034386 #197937] INFO -- : making srcs under enc I, [2024-05-07T13:59:25.076169 #197937] INFO -- : make[1]: Entering directory '/home/opc/ruby/build/master' I, [2024-05-07T13:59:25.076258 #197937] INFO -- : make[1]: Nothing to be done for 'srcs'. I, [2024-05-07T13:59:25.076278 #197937] INFO -- : make[1]: Leaving directory '/home/opc/ruby/build/master' I, [2024-05-07T13:59:25.077462 #197937] INFO -- : generating transdb.h I, [2024-05-07T13:59:25.220317 #197937] INFO -- : transdb.h unchanged I, [2024-05-07T13:59:25.221670 #197937] INFO -- : making trans I, [2024-05-07T13:59:25.269894 #197937] INFO -- : make[1]: Entering directory '/home/opc/ruby/build/master' I, [2024-05-07T13:59:25.269969 #197937] INFO -- : make[1]: Nothing to be done for 'trans'. I, [2024-05-07T13:59:25.269981 #197937] INFO -- : make[1]: Leaving directory '/home/opc/ruby/build/master' I, [2024-05-07T13:59:25.270811 #197937] INFO -- : making encs I, [2024-05-07T13:59:25.323147 #197937] INFO -- : make[1]: Entering directory '/home/opc/ruby/build/master' I, [2024-05-07T13:59:25.323224 #197937] INFO -- : make[1]: Nothing to be done for 'encs'. I, [2024-05-07T13:59:25.323244 #197937] INFO -- : make[1]: Leaving directory '/home/opc/ruby/build/master' I, [2024-05-07T13:59:25.325335 #197937] INFO -- : generating makefiles ext/configure-ext.mk I, [2024-05-07T13:59:25.365583 #197937] INFO -- : ext/configure-ext.mk updated I, [2024-05-07T13:59:25.369010 #197937] INFO -- : make[1]: Entering directory '/home/opc/ruby/build/master' I, [2024-05-07T13:59:27.434051 #197937] INFO -- : make[1]: Leaving directory '/home/opc/ruby/build/master' I, [2024-05-07T13:59:27.434707 #197937] INFO -- : generating makefile exts.mk I, [2024-05-07T13:59:27.492918 #197937] INFO -- : exts.mk unchanged I, [2024-05-07T13:59:27.497763 #197937] INFO -- : make[1]: Entering directory '/home/opc/ruby/build/master' I, [2024-05-07T13:59:27.792277 #197937] INFO -- : make[2]: Entering directory '/home/opc/ruby/build/master/ext/coverage' I, [2024-05-07T13:59:27.796861 #197937] INFO -- : make[2]: Leaving directory '/home/opc/ruby/build/master/ext/coverage' I, [2024-05-07T13:59:27.802972 #197937] INFO -- : make[2]: Entering directory '/home/opc/ruby/build/master/ext/date' I, [2024-05-07T13:59:27.808270 #197937] INFO -- : make[2]: Leaving directory '/home/opc/ruby/build/master/ext/date' I, [2024-05-07T13:59:27.811581 #197937] INFO -- : make[2]: Entering directory '/home/opc/ruby/build/master/ext/digest' I, [2024-05-07T13:59:27.820325 #197937] INFO -- : make[2]: Leaving directory '/home/opc/ruby/build/master/ext/digest' I, [2024-05-07T13:59:27.843206 #197937] INFO -- : make[2]: Entering directory '/home/opc/ruby/build/master/ext/digest/sha2' I, [2024-05-07T13:59:27.848267 #197937] INFO -- : make[2]: Leaving directory '/home/opc/ruby/build/master/ext/digest/sha2' I, [2024-05-07T13:59:27.866666 #197937] INFO -- : make[2]: Entering directory '/home/opc/ruby/build/master/ext/fiddle' I, [2024-05-07T13:59:27.876922 #197937] INFO -- : make[2]: Leaving directory '/home/opc/ruby/build/master/ext/fiddle' I, [2024-05-07T13:59:27.881571 #197937] INFO -- : make[2]: Entering directory '/home/opc/ruby/build/master/ext/io/console' I, [2024-05-07T13:59:27.885840 #197937] INFO -- : make[2]: Leaving directory '/home/opc/ruby/build/master/ext/io/console' I, [2024-05-07T13:59:27.896371 #197937] INFO -- : make[2]: Entering directory '/home/opc/ruby/build/master/ext/json' I, [2024-05-07T13:59:27.905824 #197937] INFO -- : make[2]: Leaving directory '/home/opc/ruby/build/master/ext/json' I, [2024-05-07T13:59:27.918708 #197937] INFO -- : make[2]: Entering directory '/home/opc/ruby/build/master/ext/monitor' I, [2024-05-07T13:59:27.922779 #197937] INFO -- : make[2]: Leaving directory '/home/opc/ruby/build/master/ext/monitor' I, [2024-05-07T13:59:27.928761 #197937] INFO -- : make[2]: Entering directory '/home/opc/ruby/build/master/ext/objspace' I, [2024-05-07T13:59:27.934875 #197937] INFO -- : make[2]: Leaving directory '/home/opc/ruby/build/master/ext/objspace' I, [2024-05-07T13:59:27.953890 #197937] INFO -- : make[2]: Entering directory '/home/opc/ruby/build/master/ext/openssl' I, [2024-05-07T13:59:27.975623 #197937] INFO -- : make[2]: Leaving directory '/home/opc/ruby/build/master/ext/openssl' I, [2024-05-07T13:59:27.979882 #197937] INFO -- : make[2]: Entering directory '/home/opc/ruby/build/master/ext/pathname' I, [2024-05-07T13:59:27.984004 #197937] INFO -- : make[2]: Leaving directory '/home/opc/ruby/build/master/ext/pathname' I, [2024-05-07T13:59:27.990279 #197937] INFO -- : make[2]: Entering directory '/home/opc/ruby/build/master/ext/psych' I, [2024-05-07T13:59:28.011526 #197937] INFO -- : make[2]: Leaving directory '/home/opc/ruby/build/master/ext/psych' I, [2024-05-07T13:59:28.015996 #197937] INFO -- : make[2]: Entering directory '/home/opc/ruby/build/master/ext/pty' I, [2024-05-07T13:59:28.020190 #197937] INFO -- : make[2]: Leaving directory '/home/opc/ruby/build/master/ext/pty' I, [2024-05-07T13:59:28.033410 #197937] INFO -- : make[2]: Entering directory '/home/opc/ruby/build/master/ext/ripper' I, [2024-05-07T13:59:28.041267 #197937] INFO -- : make[2]: Leaving directory '/home/opc/ruby/build/master/ext/ripper' I, [2024-05-07T13:59:28.043144 #197937] INFO -- : make[2]: Entering directory '/home/opc/ruby/build/master/ext/rubyvm' I, [2024-05-07T13:59:28.046659 #197937] INFO -- : make[2]: Leaving directory '/home/opc/ruby/build/master/ext/rubyvm' I, [2024-05-07T13:59:28.058624 #197937] INFO -- : make[2]: Entering directory '/home/opc/ruby/build/master/ext/socket' I, [2024-05-07T13:59:28.069547 #197937] INFO -- : make[2]: Leaving directory '/home/opc/ruby/build/master/ext/socket' I, [2024-05-07T13:59:28.084975 #197937] INFO -- : make[2]: Entering directory '/home/opc/ruby/build/master/.bundle/gems/bigdecimal-3.1.7/ext/bigdecimal' I, [2024-05-07T13:59:28.115616 #197937] INFO -- : make[2]: Leaving directory '/home/opc/ruby/build/master/.bundle/gems/bigdecimal-3.1.7/ext/bigdecimal' I, [2024-05-07T13:59:28.118363 #197937] INFO -- : make[2]: Entering directory '/home/opc/ruby/build/master/.bundle/gems/bigdecimal-3.1.8/ext/bigdecimal' I, [2024-05-07T13:59:28.149016 #197937] INFO -- : make[2]: Leaving directory '/home/opc/ruby/build/master/.bundle/gems/bigdecimal-3.1.8/ext/bigdecimal' I, [2024-05-07T13:59:28.151878 #197937] INFO -- : make[2]: Entering directory '/home/opc/ruby/build/master/.bundle/gems/debug-1.9.2/ext/debug' I, [2024-05-07T13:59:28.182421 #197937] INFO -- : make[2]: Leaving directory '/home/opc/ruby/build/master/.bundle/gems/debug-1.9.2/ext/debug' I, [2024-05-07T13:59:28.184973 #197937] INFO -- : make[2]: Entering directory '/home/opc/ruby/build/master/.bundle/gems/nkf-0.2.0/ext/nkf' I, [2024-05-07T13:59:28.215387 #197937] INFO -- : make[2]: Leaving directory '/home/opc/ruby/build/master/.bundle/gems/nkf-0.2.0/ext/nkf' I, [2024-05-07T13:59:28.218118 #197937] INFO -- : make[2]: Entering directory '/home/opc/ruby/build/master/.bundle/gems/racc-1.7.3/ext/racc/cparse' I, [2024-05-07T13:59:28.250041 #197937] INFO -- : make[2]: Leaving directory '/home/opc/ruby/build/master/.bundle/gems/racc-1.7.3/ext/racc/cparse' I, [2024-05-07T13:59:28.253168 #197937] INFO -- : make[2]: Entering directory '/home/opc/ruby/build/master/.bundle/gems/rbs-3.4.4/ext/rbs_extension' I, [2024-05-07T13:59:28.284619 #197937] INFO -- : make[2]: Leaving directory '/home/opc/ruby/build/master/.bundle/gems/rbs-3.4.4/ext/rbs_extension' I, [2024-05-07T13:59:28.287203 #197937] INFO -- : make[2]: Entering directory '/home/opc/ruby/build/master/.bundle/gems/syslog-0.1.2/ext/syslog' I, [2024-05-07T13:59:28.317618 #197937] INFO -- : make[2]: Leaving directory '/home/opc/ruby/build/master/.bundle/gems/syslog-0.1.2/ext/syslog' I, [2024-05-07T13:59:28.356390 #197937] INFO -- : make[2]: Entering directory '/home/opc/ruby/build/master' I, [2024-05-07T13:59:28.439215 #197937] INFO -- : make[2]: 'ruby' is up to date. I, [2024-05-07T13:59:28.439296 #197937] INFO -- : make[2]: Leaving directory '/home/opc/ruby/build/master' I, [2024-05-07T13:59:28.439425 #197937] INFO -- : make[1]: Leaving directory '/home/opc/ruby/build/master' I, [2024-05-07T13:59:28.443807 #197937] INFO -- : make[1]: Entering directory '/home/opc/ruby/build/master' I, [2024-05-07T13:59:28.443852 #197937] INFO -- : make[1]: Nothing to be done for 'note'. I, [2024-05-07T13:59:28.443871 #197937] INFO -- : make[1]: Leaving directory '/home/opc/ruby/build/master' E, [2024-05-07T13:59:28.518539 #197937] ERROR -- : $ /home/opc/ruby/build/master/miniruby -I/home/opc/ruby/src/master/lib /home/opc/ruby/src/master/tool/runruby.rb --archdir=/home/opc/ruby/build/master --extout=.ext -- /home/opc/ruby/src/master/spec/mspec/bin/mspec-run -B /home/opc/ruby/src/master/spec/default.mspec --error-output stderr --debug -fy -o /tmp/rubytest.k7b1m4/1-mspec-multi-0 E, [2024-05-07T13:59:28.518892 #197937] ERROR -- : $ /home/opc/ruby/build/master/miniruby -I/home/opc/ruby/src/master/lib /home/opc/ruby/src/master/tool/runruby.rb --archdir=/home/opc/ruby/build/master --extout=.ext -- /home/opc/ruby/src/master/spec/mspec/bin/mspec-run -B /home/opc/ruby/src/master/spec/default.mspec --error-output stderr --debug -fy -o /tmp/rubytest.k7b1m4/2-mspec-multi-1 E, [2024-05-07T13:59:28.519113 #197937] ERROR -- : $ /home/opc/ruby/build/master/miniruby -I/home/opc/ruby/src/master/lib /home/opc/ruby/src/master/tool/runruby.rb --archdir=/home/opc/ruby/build/master --extout=.ext -- /home/opc/ruby/src/master/spec/mspec/bin/mspec-run -B /home/opc/ruby/src/master/spec/default.mspec --error-output stderr --debug -fy -o /tmp/rubytest.k7b1m4/3-mspec-multi-2 I, [2024-05-07T13:59:28.657714 #197937] INFO -- : ruby 3.4.0dev (2024-05-07T06:59:36Z master e1e6b4972f) [aarch64-linux] I, [2024-05-07T13:59:34.181510 #197937] INFO -- : 0 ......................................................................... I, [2024-05-07T13:59:36.626508 #197937] INFO -- : 73 ......................................................................... I, [2024-05-07T13:59:36.776217 #197937] INFO -- : 146 ......................................................................... I, [2024-05-07T13:59:37.079626 #197937] INFO -- : 219 ......................................................................... I, [2024-05-07T13:59:37.238262 #197937] INFO -- : 292 ......................................................................... I, [2024-05-07T13:59:37.477095 #197937] INFO -- : 365 ......................................................................... I, [2024-05-07T13:59:37.600169 #197937] INFO -- : 438 ......................................................................... I, [2024-05-07T13:59:37.662179 #197937] INFO -- : 511 ......................................................................... I, [2024-05-07T13:59:37.723147 #197937] INFO -- : 584 ......................................................................... I, [2024-05-07T13:59:38.335257 #197937] INFO -- : 657 ......................................................................... I, [2024-05-07T13:59:38.437849 #197937] INFO -- : 730 ......................................................................... I, [2024-05-07T13:59:38.487226 #197937] INFO -- : 803 ......................................................................... I, [2024-05-07T13:59:38.682874 #197937] INFO -- : 876 ......................................................................... I, [2024-05-07T13:59:38.791484 #197937] INFO -- : 949 ......................................................................... I, [2024-05-07T13:59:39.398258 #197937] INFO -- : 1022 ......................................................................... I, [2024-05-07T13:59:41.701845 #197937] INFO -- : 1095 ......................................................................... I, [2024-05-07T13:59:42.543667 #197937] INFO -- : 1168 ......................................................................... I, [2024-05-07T13:59:42.688587 #197937] INFO -- : 1241 ......................................................................... I, [2024-05-07T13:59:42.870639 #197937] INFO -- : 1314 ......................................................................... I, [2024-05-07T13:59:42.963219 #197937] INFO -- : 1387 ......................................................................... I, [2024-05-07T13:59:45.047265 #197937] INFO -- : 1460 ......................................................................... I, [2024-05-07T13:59:48.468306 #197937] INFO -- : 1533 ......................................................................... I, [2024-05-07T13:59:48.621583 #197937] INFO -- : 1606 ......................................................................... I, [2024-05-07T13:59:49.438812 #197937] INFO -- : 1679 ......................................................................... I, [2024-05-07T13:59:49.709589 #197937] INFO -- : 1752 ......................................................................... I, [2024-05-07T13:59:49.969556 #197937] INFO -- : 1825 ......................................................................... I, [2024-05-07T13:59:50.294785 #197937] INFO -- : 1898 ......................................................................... I, [2024-05-07T13:59:50.687162 #197937] INFO -- : 1971 ......................................................................... I, [2024-05-07T13:59:51.194086 #197937] INFO -- : 2044 ......................................................................... I, [2024-05-07T13:59:51.271060 #197937] INFO -- : 2117 ......................................................................... I, [2024-05-07T13:59:51.337781 #197937] INFO -- : 2190 ......................................................................... I, [2024-05-07T13:59:51.384437 #197937] INFO -- : 2263 ......................................................................... I, [2024-05-07T13:59:51.431375 #197937] INFO -- : 2336 ......................................................................... I, [2024-05-07T13:59:51.534954 #197937] INFO -- : 2409 ......................................................................... I, [2024-05-07T13:59:51.794227 #197937] INFO -- : 2482 ......................................................................... I, [2024-05-07T13:59:51.919999 #197937] INFO -- : 2555 ......................................................................... I, [2024-05-07T13:59:53.193379 #197937] INFO -- : 2628 ......................................................................... I, [2024-05-07T13:59:53.365529 #197937] INFO -- : 2701 ......................................................................... I, [2024-05-07T13:59:53.504043 #197937] INFO -- : 2774 ......................................................................... I, [2024-05-07T13:59:53.832575 #197937] INFO -- : 2847 ......................................................................... I, [2024-05-07T13:59:54.088536 #197937] INFO -- : 2920 ......................................................................... I, [2024-05-07T13:59:54.207487 #197937] INFO -- : 2993 ......................................................................... I, [2024-05-07T13:59:54.277996 #197937] INFO -- : 3066 ......................................................................... I, [2024-05-07T13:59:54.327054 #197937] INFO -- : 3139 ......................................................................... I, [2024-05-07T13:59:54.391839 #197937] INFO -- : 3212 ......................................................................... I, [2024-05-07T13:59:54.465721 #197937] INFO -- : 3285 ......................................................................... I, [2024-05-07T13:59:58.305027 #197937] INFO -- : 3358 ........................................................................ I, [2024-05-07T13:59:58.305102 #197937] INFO -- : I, [2024-05-07T13:59:58.305141 #197937] INFO -- : Finished in 29.786397 seconds I, [2024-05-07T13:59:58.305151 #197937] INFO -- : I, [2024-05-07T13:59:58.305159 #197937] INFO -- : 3429 files, 32606 examples, 190132 expectations, 0 failures, 0 errors, 0 tagged I, [2024-05-07T13:59:58.306388 #197937] INFO -- : $$$[end] "make yes-test-rubyspec MSPECOPT='--error-output stderr --debug -j' TESTS='-j3'" exit with 0.