# Logfile created on 2024-05-07 10:12:44 +0000 by logger.rb/v1.5.3 I, [2024-05-07T10:12:44.505989 #3065062] INFO -- : #, @formatter=nil, @logdev=#, @binmode=false, @mon_data=#, @mon_data_owner_object_id=860>>> I, [2024-05-07T10:12:44.506321 #3065062] INFO -- : $$$[beg] make update-unicode -j3 I, [2024-05-07T10:12:44.596304 #3065062] INFO -- : Downloading Unicode emoji 15.0 files... I, [2024-05-07T10:12:44.596564 #3065062] INFO -- : Downloading Unicode emoji 15.0 files... I, [2024-05-07T10:12:44.596894 #3065062] INFO -- : Downloading Unicode emoji 15.0 files... I, [2024-05-07T10:12:44.673168 #3065062] INFO -- : made symlink emoji/15.0/emoji-sequences.txt to /home/opc/ruby/src/master/.downloaded-cache/emoji/15.0/emoji-sequences.txt I, [2024-05-07T10:12:44.673292 #3065062] INFO -- : /home/opc/ruby/src/master/enc/unicode/data/emoji/15.0/emoji-sequences.txt already exists I, [2024-05-07T10:12:44.676175 #3065062] INFO -- : downloading emoji/15.0/emoji-test.txt ... downloading emoji/15.0/emoji-test.txt ... /home/opc/ruby/src/master/enc/unicode/data/emoji/15.0/emoji-sequences.txt already exists E, [2024-05-07T10:12:45.127325 #3065062] ERROR -- : /home/opc/ruby/src/master/tool/downloader.rb:302:in `rescue in download': failed to download emoji/15.0/emoji-test.txt (RuntimeError) E, [2024-05-07T10:12:45.127394 #3065062] ERROR -- : OpenURI::HTTPError: 403 Forbidden: https://www.unicode.org/Public/emoji/15.0/emoji-test.txt E, [2024-05-07T10:12:45.127405 #3065062] ERROR -- : from /home/opc/ruby/src/master/tool/downloader.rb:201:in `download' E, [2024-05-07T10:12:45.127415 #3065062] ERROR -- : from /home/opc/ruby/src/master/tool/downloader.rb:136:in `download' E, [2024-05-07T10:12:45.127424 #3065062] ERROR -- : from /home/opc/ruby/src/master/tool/downloader.rb:482:in `block in
' E, [2024-05-07T10:12:45.127432 #3065062] ERROR -- : from /home/opc/ruby/src/master/tool/downloader.rb:465:in `each' E, [2024-05-07T10:12:45.127440 #3065062] ERROR -- : from /home/opc/ruby/src/master/tool/downloader.rb:465:in `
' E, [2024-05-07T10:12:45.127449 #3065062] ERROR -- : /usr/local/lib/ruby/3.2.0/open-uri.rb:369:in `open_http': 403 Forbidden (OpenURI::HTTPError) E, [2024-05-07T10:12:45.127457 #3065062] ERROR -- : from /usr/local/lib/ruby/3.2.0/open-uri.rb:760:in `buffer_open' E, [2024-05-07T10:12:45.127465 #3065062] ERROR -- : from /usr/local/lib/ruby/3.2.0/open-uri.rb:214:in `block in open_loop' E, [2024-05-07T10:12:45.127473 #3065062] ERROR -- : from /usr/local/lib/ruby/3.2.0/open-uri.rb:212:in `catch' E, [2024-05-07T10:12:45.127481 #3065062] ERROR -- : from /usr/local/lib/ruby/3.2.0/open-uri.rb:212:in `open_loop' E, [2024-05-07T10:12:45.127490 #3065062] ERROR -- : from /usr/local/lib/ruby/3.2.0/open-uri.rb:153:in `open_uri' E, [2024-05-07T10:12:45.127498 #3065062] ERROR -- : from /usr/local/lib/ruby/3.2.0/open-uri.rb:740:in `open' E, [2024-05-07T10:12:45.127509 #3065062] ERROR -- : from /usr/local/lib/ruby/3.2.0/open-uri.rb:748:in `read' E, [2024-05-07T10:12:45.127518 #3065062] ERROR -- : from /home/opc/ruby/src/master/tool/downloader.rb:247:in `block in download' E, [2024-05-07T10:12:45.127526 #3065062] ERROR -- : from /home/opc/ruby/src/master/tool/downloader.rb:378:in `with_retry' E, [2024-05-07T10:12:45.127534 #3065062] ERROR -- : from /home/opc/ruby/src/master/tool/downloader.rb:246:in `download' E, [2024-05-07T10:12:45.127543 #3065062] ERROR -- : from /home/opc/ruby/src/master/tool/downloader.rb:136:in `download' E, [2024-05-07T10:12:45.127551 #3065062] ERROR -- : from /home/opc/ruby/src/master/tool/downloader.rb:482:in `block in
' E, [2024-05-07T10:12:45.127559 #3065062] ERROR -- : from /home/opc/ruby/src/master/tool/downloader.rb:465:in `each' E, [2024-05-07T10:12:45.127567 #3065062] ERROR -- : from /home/opc/ruby/src/master/tool/downloader.rb:465:in `
' E, [2024-05-07T10:12:45.130339 #3065062] ERROR -- : make: *** [uncommon.mk:1787: /home/opc/ruby/src/master/enc/unicode/data/emoji/15.0/emoji-sequences.txt] Error 1 E, [2024-05-07T10:12:45.130367 #3065062] ERROR -- : make: *** Deleting file '/home/opc/ruby/src/master/enc/unicode/data/emoji/15.0/emoji-sequences.txt' E, [2024-05-07T10:12:45.130430 #3065062] ERROR -- : make: *** Waiting for unfinished jobs.... E, [2024-05-07T10:12:45.135396 #3065062] ERROR -- : /home/opc/ruby/src/master/tool/downloader.rb:302:in `rescue in download': failed to download emoji/15.0/emoji-test.txt (RuntimeError) E, [2024-05-07T10:12:45.135422 #3065062] ERROR -- : OpenURI::HTTPError: 403 Forbidden: https://www.unicode.org/Public/emoji/15.0/emoji-test.txt E, [2024-05-07T10:12:45.135432 #3065062] ERROR -- : from /home/opc/ruby/src/master/tool/downloader.rb:201:in `download' E, [2024-05-07T10:12:45.135441 #3065062] ERROR -- : from /home/opc/ruby/src/master/tool/downloader.rb:136:in `download' E, [2024-05-07T10:12:45.135449 #3065062] ERROR -- : from /home/opc/ruby/src/master/tool/downloader.rb:482:in `block in
' E, [2024-05-07T10:12:45.135457 #3065062] ERROR -- : from /home/opc/ruby/src/master/tool/downloader.rb:465:in `each' E, [2024-05-07T10:12:45.135466 #3065062] ERROR -- : from /home/opc/ruby/src/master/tool/downloader.rb:465:in `
' E, [2024-05-07T10:12:45.135474 #3065062] ERROR -- : /usr/local/lib/ruby/3.2.0/open-uri.rb:369:in `open_http': 403 Forbidden (OpenURI::HTTPError) E, [2024-05-07T10:12:45.135482 #3065062] ERROR -- : from /usr/local/lib/ruby/3.2.0/open-uri.rb:760:in `buffer_open' E, [2024-05-07T10:12:45.135490 #3065062] ERROR -- : from /usr/local/lib/ruby/3.2.0/open-uri.rb:214:in `block in open_loop' E, [2024-05-07T10:12:45.135498 #3065062] ERROR -- : from /usr/local/lib/ruby/3.2.0/open-uri.rb:212:in `catch' E, [2024-05-07T10:12:45.135506 #3065062] ERROR -- : from /usr/local/lib/ruby/3.2.0/open-uri.rb:212:in `open_loop' E, [2024-05-07T10:12:45.135514 #3065062] ERROR -- : from /usr/local/lib/ruby/3.2.0/open-uri.rb:153:in `open_uri' E, [2024-05-07T10:12:45.135522 #3065062] ERROR -- : from /usr/local/lib/ruby/3.2.0/open-uri.rb:740:in `open' E, [2024-05-07T10:12:45.135530 #3065062] ERROR -- : from /usr/local/lib/ruby/3.2.0/open-uri.rb:748:in `read' E, [2024-05-07T10:12:45.135538 #3065062] ERROR -- : from /home/opc/ruby/src/master/tool/downloader.rb:247:in `block in download' E, [2024-05-07T10:12:45.135547 #3065062] ERROR -- : from /home/opc/ruby/src/master/tool/downloader.rb:378:in `with_retry' E, [2024-05-07T10:12:45.135555 #3065062] ERROR -- : from /home/opc/ruby/src/master/tool/downloader.rb:246:in `download' E, [2024-05-07T10:12:45.135564 #3065062] ERROR -- : from /home/opc/ruby/src/master/tool/downloader.rb:136:in `download' E, [2024-05-07T10:12:45.135572 #3065062] ERROR -- : from /home/opc/ruby/src/master/tool/downloader.rb:482:in `block in
' E, [2024-05-07T10:12:45.135580 #3065062] ERROR -- : from /home/opc/ruby/src/master/tool/downloader.rb:465:in `each' E, [2024-05-07T10:12:45.135591 #3065062] ERROR -- : from /home/opc/ruby/src/master/tool/downloader.rb:465:in `
' E, [2024-05-07T10:12:45.138539 #3065062] ERROR -- : make: *** [uncommon.mk:1787: /home/opc/ruby/src/master/enc/unicode/data/emoji/15.0/emoji-zwj-sequences.txt] Error 1 E, [2024-05-07T10:12:45.152940 #3065062] ERROR -- : /home/opc/ruby/src/master/tool/downloader.rb:302:in `rescue in download': failed to download emoji/15.0/emoji-test.txt (RuntimeError) E, [2024-05-07T10:12:45.152991 #3065062] ERROR -- : OpenURI::HTTPError: 403 Forbidden: https://www.unicode.org/Public/emoji/15.0/emoji-test.txt E, [2024-05-07T10:12:45.153001 #3065062] ERROR -- : from /home/opc/ruby/src/master/tool/downloader.rb:201:in `download' E, [2024-05-07T10:12:45.153011 #3065062] ERROR -- : from /home/opc/ruby/src/master/tool/downloader.rb:136:in `download' E, [2024-05-07T10:12:45.153019 #3065062] ERROR -- : from /home/opc/ruby/src/master/tool/downloader.rb:482:in `block in
' E, [2024-05-07T10:12:45.153028 #3065062] ERROR -- : from /home/opc/ruby/src/master/tool/downloader.rb:465:in `each' E, [2024-05-07T10:12:45.153036 #3065062] ERROR -- : from /home/opc/ruby/src/master/tool/downloader.rb:465:in `
' E, [2024-05-07T10:12:45.153044 #3065062] ERROR -- : /usr/local/lib/ruby/3.2.0/open-uri.rb:369:in `open_http': 403 Forbidden (OpenURI::HTTPError) E, [2024-05-07T10:12:45.153052 #3065062] ERROR -- : from /usr/local/lib/ruby/3.2.0/open-uri.rb:760:in `buffer_open' E, [2024-05-07T10:12:45.153060 #3065062] ERROR -- : from /usr/local/lib/ruby/3.2.0/open-uri.rb:214:in `block in open_loop' E, [2024-05-07T10:12:45.153069 #3065062] ERROR -- : from /usr/local/lib/ruby/3.2.0/open-uri.rb:212:in `catch' E, [2024-05-07T10:12:45.153077 #3065062] ERROR -- : from /usr/local/lib/ruby/3.2.0/open-uri.rb:212:in `open_loop' E, [2024-05-07T10:12:45.153084 #3065062] ERROR -- : from /usr/local/lib/ruby/3.2.0/open-uri.rb:153:in `open_uri' E, [2024-05-07T10:12:45.153092 #3065062] ERROR -- : from /usr/local/lib/ruby/3.2.0/open-uri.rb:740:in `open' E, [2024-05-07T10:12:45.153101 #3065062] ERROR -- : from /usr/local/lib/ruby/3.2.0/open-uri.rb:748:in `read' E, [2024-05-07T10:12:45.153110 #3065062] ERROR -- : from /home/opc/ruby/src/master/tool/downloader.rb:247:in `block in download' E, [2024-05-07T10:12:45.153118 #3065062] ERROR -- : from /home/opc/ruby/src/master/tool/downloader.rb:378:in `with_retry' E, [2024-05-07T10:12:45.153126 #3065062] ERROR -- : from /home/opc/ruby/src/master/tool/downloader.rb:246:in `download' E, [2024-05-07T10:12:45.153134 #3065062] ERROR -- : from /home/opc/ruby/src/master/tool/downloader.rb:136:in `download' E, [2024-05-07T10:12:45.153142 #3065062] ERROR -- : from /home/opc/ruby/src/master/tool/downloader.rb:482:in `block in
' E, [2024-05-07T10:12:45.153150 #3065062] ERROR -- : from /home/opc/ruby/src/master/tool/downloader.rb:465:in `each' E, [2024-05-07T10:12:45.153158 #3065062] ERROR -- : from /home/opc/ruby/src/master/tool/downloader.rb:465:in `
' E, [2024-05-07T10:12:45.156006 #3065062] ERROR -- : make: *** [uncommon.mk:1787: /home/opc/ruby/src/master/enc/unicode/data/emoji/15.0/emoji-test.txt] Error 1 I, [2024-05-07T10:12:45.156121 #3065062] INFO -- : downloading emoji/15.0/emoji-test.txt ... I, [2024-05-07T10:12:45.156259 #3065062] INFO -- : $$$[end] "make update-unicode -j3" exit with 512. I, [2024-05-07T10:12:45.156295 #3065062] INFO -- : $$$[beg] make update-download -j3 I, [2024-05-07T10:12:45.318371 #3065062] INFO -- : tool/config.guess already exists I, [2024-05-07T10:12:45.318440 #3065062] INFO -- : tool/config.sub already exists I, [2024-05-07T10:12:45.321157 #3065062] INFO -- : Update minitest to ea9caafc0754b1d6236a490d59e624b53209734a I, [2024-05-07T10:12:45.321278 #3065062] INFO -- : Update power_assert to 84e85124c5014a139af39161d484156cfe87a9ed I, [2024-05-07T10:12:45.321593 #3065062] INFO -- : Update rbs to ba7872795d5de04adb8ff500c0e6afdc81a041dd I, [2024-05-07T10:12:45.324545 #3065062] INFO -- : echo ea9caafc0754b1d6236a490d59e624b53209734a | /bin/sh /home/opc/ruby/src/master/tool/ifchange /home/opc/ruby/src/master/.bundle/.timestamp/minitest.revision - I, [2024-05-07T10:12:45.324703 #3065062] INFO -- : echo 84e85124c5014a139af39161d484156cfe87a9ed | /bin/sh /home/opc/ruby/src/master/tool/ifchange /home/opc/ruby/src/master/.bundle/.timestamp/power_assert.revision - I, [2024-05-07T10:12:45.324847 #3065062] INFO -- : echo ba7872795d5de04adb8ff500c0e6afdc81a041dd | /bin/sh /home/opc/ruby/src/master/tool/ifchange /home/opc/ruby/src/master/.bundle/.timestamp/rbs.revision - I, [2024-05-07T10:12:45.330589 #3065062] INFO -- : /home/opc/ruby/src/master/.bundle/.timestamp/power_assert.revision unchanged I, [2024-05-07T10:12:45.330644 #3065062] INFO -- : /home/opc/ruby/src/master/.bundle/.timestamp/rbs.revision unchanged I, [2024-05-07T10:12:45.330655 #3065062] INFO -- : /home/opc/ruby/src/master/.bundle/.timestamp/minitest.revision unchanged I, [2024-05-07T10:12:45.333088 #3065062] INFO -- : Update typeprof to b19a6416da3a05d57fadd6ffdadb382b6d236ca5 I, [2024-05-07T10:12:45.341037 #3065062] INFO -- : echo b19a6416da3a05d57fadd6ffdadb382b6d236ca5 | /bin/sh /home/opc/ruby/src/master/tool/ifchange /home/opc/ruby/src/master/.bundle/.timestamp/typeprof.revision - I, [2024-05-07T10:12:45.346731 #3065062] INFO -- : /home/opc/ruby/src/master/.bundle/.timestamp/typeprof.revision unchanged I, [2024-05-07T10:12:45.422003 #3065062] INFO -- : Building power_assert@84e85124c5014a139af39161d484156cfe87a9ed to /home/opc/ruby/src/master/gems/power_assert-2.0.3.gem I, [2024-05-07T10:12:45.535182 #3065062] INFO -- : Successfully built RubyGem I, [2024-05-07T10:12:45.535243 #3065062] INFO -- : Name: power_assert I, [2024-05-07T10:12:45.535254 #3065062] INFO -- : Version: 2.0.4dev I, [2024-05-07T10:12:45.535263 #3065062] INFO -- : File: power_assert-2.0.4dev.gem I, [2024-05-07T10:12:45.614941 #3065062] INFO -- : $$$[end] "make update-download -j3" exit with 0. I, [2024-05-07T10:12:45.615010 #3065062] INFO -- : $$$[beg] make update-rubyspec -j3 I, [2024-05-07T10:12:45.702689 #3065062] INFO -- : make: Nothing to be done for 'update-rubyspec'. I, [2024-05-07T10:12:45.702982 #3065062] INFO -- : $$$[end] "make update-rubyspec -j3" exit with 0. I, [2024-05-07T10:12:45.703028 #3065062] INFO -- : $$$[beg] make update-src -j3 I, [2024-05-07T10:12:46.778427 #3065062] INFO -- : Already up to date. I, [2024-05-07T10:12:46.793415 #3065062] INFO -- : Latest commit hash = e1e6b4972f I, [2024-05-07T10:12:46.794196 #3065062] INFO -- : $$$[end] "make update-src -j3" exit with 0. I, [2024-05-07T10:12:46.794235 #3065062] INFO -- : $$$[beg] make after-update -j3 I, [2024-05-07T10:12:46.897281 #3065062] INFO -- : generating /home/opc/ruby/src/master/ext/ripper/eventids2table.c I, [2024-05-07T10:12:46.904121 #3065062] INFO -- : make[1]: Entering directory '/home/opc/ruby/src/master/ext/ripper' I, [2024-05-07T10:12:46.904184 #3065062] INFO -- : make[1]: Nothing to be done for 'src'. I, [2024-05-07T10:12:46.904194 #3065062] INFO -- : make[1]: Leaving directory '/home/opc/ruby/src/master/ext/ripper' I, [2024-05-07T10:12:46.930897 #3065062] INFO -- : /home/opc/ruby/src/master/revision.h updated I, [2024-05-07T10:12:46.932054 #3065062] INFO -- : generating aarch64-linux-fake.rb I, [2024-05-07T10:12:46.988767 #3065062] INFO -- : aarch64-linux-fake.rb updated I, [2024-05-07T10:12:46.990505 #3065062] INFO -- : generating enc.mk I, [2024-05-07T10:12:47.219841 #3065062] INFO -- : making srcs under enc I, [2024-05-07T10:12:47.261760 #3065062] INFO -- : make[1]: Entering directory '/home/opc/ruby/build/master' I, [2024-05-07T10:12:47.261849 #3065062] INFO -- : make[1]: Nothing to be done for 'srcs'. I, [2024-05-07T10:12:47.261860 #3065062] INFO -- : make[1]: Leaving directory '/home/opc/ruby/build/master' I, [2024-05-07T10:12:47.346492 #3065062] INFO -- : Update minitest to ea9caafc0754b1d6236a490d59e624b53209734a I, [2024-05-07T10:12:47.346558 #3065062] INFO -- : Update power_assert to 84e85124c5014a139af39161d484156cfe87a9ed I, [2024-05-07T10:12:47.347140 #3065062] INFO -- : Update rbs to ba7872795d5de04adb8ff500c0e6afdc81a041dd I, [2024-05-07T10:12:47.350151 #3065062] INFO -- : echo 84e85124c5014a139af39161d484156cfe87a9ed | /bin/sh /home/opc/ruby/src/master/tool/ifchange /home/opc/ruby/src/master/.bundle/.timestamp/power_assert.revision - I, [2024-05-07T10:12:47.350455 #3065062] INFO -- : echo ba7872795d5de04adb8ff500c0e6afdc81a041dd | /bin/sh /home/opc/ruby/src/master/tool/ifchange /home/opc/ruby/src/master/.bundle/.timestamp/rbs.revision - I, [2024-05-07T10:12:47.350643 #3065062] INFO -- : echo ea9caafc0754b1d6236a490d59e624b53209734a | /bin/sh /home/opc/ruby/src/master/tool/ifchange /home/opc/ruby/src/master/.bundle/.timestamp/minitest.revision - I, [2024-05-07T10:12:47.355580 #3065062] INFO -- : /home/opc/ruby/src/master/.bundle/.timestamp/power_assert.revision unchanged I, [2024-05-07T10:12:47.356078 #3065062] INFO -- : /home/opc/ruby/src/master/.bundle/.timestamp/rbs.revision unchanged I, [2024-05-07T10:12:47.356114 #3065062] INFO -- : /home/opc/ruby/src/master/.bundle/.timestamp/minitest.revision unchanged I, [2024-05-07T10:12:47.358406 #3065062] INFO -- : Update typeprof to b19a6416da3a05d57fadd6ffdadb382b6d236ca5 I, [2024-05-07T10:12:47.363173 #3065062] INFO -- : echo b19a6416da3a05d57fadd6ffdadb382b6d236ca5 | /bin/sh /home/opc/ruby/src/master/tool/ifchange /home/opc/ruby/src/master/.bundle/.timestamp/typeprof.revision - I, [2024-05-07T10:12:47.368423 #3065062] INFO -- : /home/opc/ruby/src/master/.bundle/.timestamp/typeprof.revision unchanged I, [2024-05-07T10:12:47.450322 #3065062] INFO -- : Building power_assert@84e85124c5014a139af39161d484156cfe87a9ed to /home/opc/ruby/src/master/gems/power_assert-2.0.3.gem I, [2024-05-07T10:12:47.560502 #3065062] INFO -- : Successfully built RubyGem I, [2024-05-07T10:12:47.560566 #3065062] INFO -- : Name: power_assert I, [2024-05-07T10:12:47.560576 #3065062] INFO -- : Version: 2.0.4dev I, [2024-05-07T10:12:47.560585 #3065062] INFO -- : File: power_assert-2.0.4dev.gem I, [2024-05-07T10:12:47.562972 #3065062] INFO -- : Extracting bundle gem power_assert-2.0.3... I, [2024-05-07T10:12:47.660098 #3065062] INFO -- : Try with hash version of bundled gems instead of gems/power_assert-2.0.3.gem. We don't use this gem with release version of Ruby. I, [2024-05-07T10:12:47.670366 #3065062] INFO -- : Unpacked gems/power_assert-2.0.4dev.gem I, [2024-05-07T10:12:47.672104 #3065062] INFO -- : $$$[end] "make after-update -j3" exit with 0. I, [2024-05-07T10:12:47.672245 #3065062] INFO -- : $$$[beg] make miniruby -j3 I, [2024-05-07T10:12:47.760470 #3065062] INFO -- : BASERUBY = /usr/local/bin/ruby --disable=gems I, [2024-05-07T10:12:47.760564 #3065062] INFO -- : CC = gcc I, [2024-05-07T10:12:47.760575 #3065062] INFO -- : LD = ld I, [2024-05-07T10:12:47.760587 #3065062] INFO -- : LDSHARED = gcc -shared I, [2024-05-07T10:12:47.760596 #3065062] INFO -- : CFLAGS = -O3 -fno-fast-math -ggdb3 -Wall -Wextra -Wdeprecated-declarations -Wdiv-by-zero -Wduplicated-cond -Wimplicit-function-declaration -Wimplicit-int -Wpointer-arith -Wwrite-strings -Wold-style-definition -Wimplicit-fallthrough=0 -Wmissing-noreturn -Wno-cast-function-type -Wno-constant-logical-operand -Wno-long-long -Wno-missing-field-initializers -Wno-overlength-strings -Wno-packed-bitfield-compat -Wno-parentheses-equality -Wno-self-assign -Wno-tautological-compare -Wno-unused-parameter -Wno-unused-value -Wsuggest-attribute=format -Wsuggest-attribute=noreturn -Wunused-variable -Wmisleading-indentation -Wundef I, [2024-05-07T10:12:47.760606 #3065062] INFO -- : XCFLAGS = -U_FORTIFY_SOURCE -D_FORTIFY_SOURCE=2 -fstack-protector-strong -msign-return-address=all -fno-strict-overflow -fvisibility=hidden -fexcess-precision=standard -DRUBY_EXPORT -fPIE -I. -I.ext/include/aarch64-linux -I/home/opc/ruby/src/master/include -I/home/opc/ruby/src/master -I/home/opc/ruby/src/master/prism -I/home/opc/ruby/src/master/enc/unicode/15.0.0 I, [2024-05-07T10:12:47.760614 #3065062] INFO -- : CPPFLAGS = I, [2024-05-07T10:12:47.760623 #3065062] INFO -- : DLDFLAGS = -Wl,--compress-debug-sections=zlib -fstack-protector-strong -pie I, [2024-05-07T10:12:47.760656 #3065062] INFO -- : SOLIBS = -lz -lrt -lrt -ldl -lcrypt -lm -lpthread I, [2024-05-07T10:12:47.760664 #3065062] INFO -- : LANG = en_US.UTF-8 I, [2024-05-07T10:12:47.760672 #3065062] INFO -- : LC_ALL = I, [2024-05-07T10:12:47.760679 #3065062] INFO -- : LC_CTYPE = I, [2024-05-07T10:12:47.760687 #3065062] INFO -- : MFLAGS = -j3 --jobserver-auth=4,5 I, [2024-05-07T10:12:47.760695 #3065062] INFO -- : RUSTC = rustc I, [2024-05-07T10:12:47.760703 #3065062] INFO -- : YJIT_RUSTC_ARGS = --crate-name=yjit --crate-type=staticlib --edition=2021 -g -C lto=thin -C opt-level=3 -C overflow-checks=on '--out-dir=/home/opc/ruby/build/master/yjit/target/release/' /home/opc/ruby/src/master/yjit/src/lib.rs I, [2024-05-07T10:12:47.761478 #3065062] INFO -- : gcc (GCC) 8.5.0 20210514 (Red Hat 8.5.0-10.1.0.1) I, [2024-05-07T10:12:47.761512 #3065062] INFO -- : Copyright (C) 2018 Free Software Foundation, Inc. I, [2024-05-07T10:12:47.761522 #3065062] INFO -- : This is free software; see the source for copying conditions. There is NO I, [2024-05-07T10:12:47.761531 #3065062] INFO -- : warranty; not even for MERCHANTABILITY or FITNESS FOR A PARTICULAR PURPOSE. I, [2024-05-07T10:12:47.761539 #3065062] INFO -- : I, [2024-05-07T10:12:47.787495 #3065062] INFO -- : compiling /home/opc/ruby/src/master/version.c I, [2024-05-07T10:12:47.929394 #3065062] INFO -- : linking miniruby I, [2024-05-07T10:12:48.814280 #3065062] INFO -- : $$$[end] "make miniruby -j3" exit with 0. I, [2024-05-07T10:12:48.814446 #3065062] INFO -- : $$$[beg] make ruby -j3 I, [2024-05-07T10:12:48.902528 #3065062] INFO -- : BASERUBY = /usr/local/bin/ruby --disable=gems I, [2024-05-07T10:12:48.902595 #3065062] INFO -- : CC = gcc I, [2024-05-07T10:12:48.902606 #3065062] INFO -- : LD = ld I, [2024-05-07T10:12:48.902615 #3065062] INFO -- : LDSHARED = gcc -shared I, [2024-05-07T10:12:48.902627 #3065062] INFO -- : CFLAGS = -O3 -fno-fast-math -ggdb3 -Wall -Wextra -Wdeprecated-declarations -Wdiv-by-zero -Wduplicated-cond -Wimplicit-function-declaration -Wimplicit-int -Wpointer-arith -Wwrite-strings -Wold-style-definition -Wimplicit-fallthrough=0 -Wmissing-noreturn -Wno-cast-function-type -Wno-constant-logical-operand -Wno-long-long -Wno-missing-field-initializers -Wno-overlength-strings -Wno-packed-bitfield-compat -Wno-parentheses-equality -Wno-self-assign -Wno-tautological-compare -Wno-unused-parameter -Wno-unused-value -Wsuggest-attribute=format -Wsuggest-attribute=noreturn -Wunused-variable -Wmisleading-indentation -Wundef I, [2024-05-07T10:12:48.902637 #3065062] INFO -- : XCFLAGS = -U_FORTIFY_SOURCE -D_FORTIFY_SOURCE=2 -fstack-protector-strong -msign-return-address=all -fno-strict-overflow -fvisibility=hidden -fexcess-precision=standard -DRUBY_EXPORT -fPIE -I. -I.ext/include/aarch64-linux -I/home/opc/ruby/src/master/include -I/home/opc/ruby/src/master -I/home/opc/ruby/src/master/prism -I/home/opc/ruby/src/master/enc/unicode/15.0.0 I, [2024-05-07T10:12:48.902646 #3065062] INFO -- : CPPFLAGS = I, [2024-05-07T10:12:48.902654 #3065062] INFO -- : DLDFLAGS = -Wl,--compress-debug-sections=zlib -fstack-protector-strong -pie I, [2024-05-07T10:12:48.902662 #3065062] INFO -- : SOLIBS = -lz -lrt -lrt -ldl -lcrypt -lm -lpthread I, [2024-05-07T10:12:48.902670 #3065062] INFO -- : LANG = en_US.UTF-8 I, [2024-05-07T10:12:48.902678 #3065062] INFO -- : LC_ALL = I, [2024-05-07T10:12:48.902686 #3065062] INFO -- : LC_CTYPE = I, [2024-05-07T10:12:48.902694 #3065062] INFO -- : MFLAGS = -j3 --jobserver-auth=4,5 I, [2024-05-07T10:12:48.902702 #3065062] INFO -- : RUSTC = rustc I, [2024-05-07T10:12:48.902710 #3065062] INFO -- : YJIT_RUSTC_ARGS = --crate-name=yjit --crate-type=staticlib --edition=2021 -g -C lto=thin -C opt-level=3 -C overflow-checks=on '--out-dir=/home/opc/ruby/build/master/yjit/target/release/' /home/opc/ruby/src/master/yjit/src/lib.rs I, [2024-05-07T10:12:48.903441 #3065062] INFO -- : gcc (GCC) 8.5.0 20210514 (Red Hat 8.5.0-10.1.0.1) I, [2024-05-07T10:12:48.903474 #3065062] INFO -- : Copyright (C) 2018 Free Software Foundation, Inc. I, [2024-05-07T10:12:48.903488 #3065062] INFO -- : This is free software; see the source for copying conditions. There is NO I, [2024-05-07T10:12:48.903497 #3065062] INFO -- : warranty; not even for MERCHANTABILITY or FITNESS FOR A PARTICULAR PURPOSE. I, [2024-05-07T10:12:48.903506 #3065062] INFO -- : I, [2024-05-07T10:12:49.085851 #3065062] INFO -- : builtin_binary.inc updated I, [2024-05-07T10:12:49.089163 #3065062] INFO -- : c5234a9416e4f20f175185e840b25b0f08674d14078ed7083f37e655458e3ca9 builtin_binary.inc I, [2024-05-07T10:12:49.090238 #3065062] INFO -- : compiling /home/opc/ruby/src/master/builtin.c I, [2024-05-07T10:12:49.424656 #3065062] INFO -- : linking static-library libruby-static.a I, [2024-05-07T10:12:52.261171 #3065062] INFO -- : linking ruby I, [2024-05-07T10:12:53.166821 #3065062] INFO -- : $$$[end] "make ruby -j3" exit with 0. I, [2024-05-07T10:12:53.166988 #3065062] INFO -- : $$$[beg] make all -j3 I, [2024-05-07T10:12:53.256075 #3065062] INFO -- : BASERUBY = /usr/local/bin/ruby --disable=gems I, [2024-05-07T10:12:53.256139 #3065062] INFO -- : CC = gcc I, [2024-05-07T10:12:53.256150 #3065062] INFO -- : LD = ld I, [2024-05-07T10:12:53.256158 #3065062] INFO -- : LDSHARED = gcc -shared I, [2024-05-07T10:12:53.256169 #3065062] INFO -- : CFLAGS = -O3 -fno-fast-math -ggdb3 -Wall -Wextra -Wdeprecated-declarations -Wdiv-by-zero -Wduplicated-cond -Wimplicit-function-declaration -Wimplicit-int -Wpointer-arith -Wwrite-strings -Wold-style-definition -Wimplicit-fallthrough=0 -Wmissing-noreturn -Wno-cast-function-type -Wno-constant-logical-operand -Wno-long-long -Wno-missing-field-initializers -Wno-overlength-strings -Wno-packed-bitfield-compat -Wno-parentheses-equality -Wno-self-assign -Wno-tautological-compare -Wno-unused-parameter -Wno-unused-value -Wsuggest-attribute=format -Wsuggest-attribute=noreturn -Wunused-variable -Wmisleading-indentation -Wundef I, [2024-05-07T10:12:53.256179 #3065062] INFO -- : XCFLAGS = -U_FORTIFY_SOURCE -D_FORTIFY_SOURCE=2 -fstack-protector-strong -msign-return-address=all -fno-strict-overflow -fvisibility=hidden -fexcess-precision=standard -DRUBY_EXPORT -fPIE -I. -I.ext/include/aarch64-linux -I/home/opc/ruby/src/master/include -I/home/opc/ruby/src/master -I/home/opc/ruby/src/master/prism -I/home/opc/ruby/src/master/enc/unicode/15.0.0 I, [2024-05-07T10:12:53.256187 #3065062] INFO -- : CPPFLAGS = I, [2024-05-07T10:12:53.256196 #3065062] INFO -- : DLDFLAGS = -Wl,--compress-debug-sections=zlib -fstack-protector-strong -pie I, [2024-05-07T10:12:53.256204 #3065062] INFO -- : SOLIBS = -lz -lrt -lrt -ldl -lcrypt -lm -lpthread I, [2024-05-07T10:12:53.256212 #3065062] INFO -- : LANG = en_US.UTF-8 I, [2024-05-07T10:12:53.256220 #3065062] INFO -- : LC_ALL = I, [2024-05-07T10:12:53.256227 #3065062] INFO -- : LC_CTYPE = I, [2024-05-07T10:12:53.256235 #3065062] INFO -- : MFLAGS = -j3 --jobserver-auth=4,5 I, [2024-05-07T10:12:53.256243 #3065062] INFO -- : RUSTC = rustc I, [2024-05-07T10:12:53.256251 #3065062] INFO -- : YJIT_RUSTC_ARGS = --crate-name=yjit --crate-type=staticlib --edition=2021 -g -C lto=thin -C opt-level=3 -C overflow-checks=on '--out-dir=/home/opc/ruby/build/master/yjit/target/release/' /home/opc/ruby/src/master/yjit/src/lib.rs I, [2024-05-07T10:12:53.257002 #3065062] INFO -- : gcc (GCC) 8.5.0 20210514 (Red Hat 8.5.0-10.1.0.1) I, [2024-05-07T10:12:53.257039 #3065062] INFO -- : Copyright (C) 2018 Free Software Foundation, Inc. I, [2024-05-07T10:12:53.257050 #3065062] INFO -- : This is free software; see the source for copying conditions. There is NO I, [2024-05-07T10:12:53.257059 #3065062] INFO -- : warranty; not even for MERCHANTABILITY or FITNESS FOR A PARTICULAR PURPOSE. I, [2024-05-07T10:12:53.257067 #3065062] INFO -- : I, [2024-05-07T10:12:53.290907 #3065062] INFO -- : generating enc.mk I, [2024-05-07T10:12:53.530470 #3065062] INFO -- : making srcs under enc I, [2024-05-07T10:12:53.530643 #3065062] INFO -- : making enc I, [2024-05-07T10:12:53.558161 #3065062] INFO -- : make[1]: Entering directory '/home/opc/ruby/build/master' I, [2024-05-07T10:12:53.558233 #3065062] INFO -- : make[1]: Nothing to be done for 'enc'. I, [2024-05-07T10:12:53.558244 #3065062] INFO -- : make[1]: Leaving directory '/home/opc/ruby/build/master' I, [2024-05-07T10:12:53.573130 #3065062] INFO -- : make[1]: Entering directory '/home/opc/ruby/build/master' I, [2024-05-07T10:12:53.573175 #3065062] INFO -- : make[1]: Nothing to be done for 'srcs'. I, [2024-05-07T10:12:53.573185 #3065062] INFO -- : make[1]: Leaving directory '/home/opc/ruby/build/master' I, [2024-05-07T10:12:53.573969 #3065062] INFO -- : generating transdb.h I, [2024-05-07T10:12:53.718687 #3065062] INFO -- : transdb.h unchanged I, [2024-05-07T10:12:53.719961 #3065062] INFO -- : generating makefiles ext/configure-ext.mk I, [2024-05-07T10:12:53.720183 #3065062] INFO -- : making trans I, [2024-05-07T10:12:53.760699 #3065062] INFO -- : ext/configure-ext.mk updated I, [2024-05-07T10:12:53.764105 #3065062] INFO -- : make[1]: Entering directory '/home/opc/ruby/build/master' I, [2024-05-07T10:12:53.768199 #3065062] INFO -- : make[1]: Entering directory '/home/opc/ruby/build/master' I, [2024-05-07T10:12:53.768245 #3065062] INFO -- : make[1]: Nothing to be done for 'trans'. I, [2024-05-07T10:12:53.768257 #3065062] INFO -- : make[1]: Leaving directory '/home/opc/ruby/build/master' I, [2024-05-07T10:12:53.769082 #3065062] INFO -- : making encs I, [2024-05-07T10:12:53.821252 #3065062] INFO -- : make[1]: Entering directory '/home/opc/ruby/build/master' I, [2024-05-07T10:12:53.821324 #3065062] INFO -- : make[1]: Nothing to be done for 'encs'. I, [2024-05-07T10:12:53.821335 #3065062] INFO -- : make[1]: Leaving directory '/home/opc/ruby/build/master' I, [2024-05-07T10:12:54.499160 #3065062] INFO -- : make[1]: Leaving directory '/home/opc/ruby/build/master' I, [2024-05-07T10:12:54.499938 #3065062] INFO -- : generating makefile exts.mk I, [2024-05-07T10:12:54.559274 #3065062] INFO -- : exts.mk unchanged I, [2024-05-07T10:12:54.564192 #3065062] INFO -- : make[1]: Entering directory '/home/opc/ruby/build/master' I, [2024-05-07T10:12:54.667639 #3065062] INFO -- : make[2]: Entering directory '/home/opc/ruby/build/master/ext/coverage' I, [2024-05-07T10:12:54.669802 #3065062] INFO -- : make[2]: Entering directory '/home/opc/ruby/build/master/ext/digest' I, [2024-05-07T10:12:54.671993 #3065062] INFO -- : make[2]: Entering directory '/home/opc/ruby/build/master/ext/date' I, [2024-05-07T10:12:54.672388 #3065062] INFO -- : make[2]: Leaving directory '/home/opc/ruby/build/master/ext/coverage' I, [2024-05-07T10:12:54.678638 #3065062] INFO -- : make[2]: Leaving directory '/home/opc/ruby/build/master/ext/date' I, [2024-05-07T10:12:54.681063 #3065062] INFO -- : make[2]: Leaving directory '/home/opc/ruby/build/master/ext/digest' I, [2024-05-07T10:12:54.685446 #3065062] INFO -- : make[2]: Entering directory '/home/opc/ruby/build/master/ext/io/console' I, [2024-05-07T10:12:54.687599 #3065062] INFO -- : make[2]: Entering directory '/home/opc/ruby/build/master/ext/fiddle' I, [2024-05-07T10:12:54.692915 #3065062] INFO -- : make[2]: Leaving directory '/home/opc/ruby/build/master/ext/io/console' I, [2024-05-07T10:12:54.694580 #3065062] INFO -- : make[2]: Entering directory '/home/opc/ruby/build/master/ext/json' I, [2024-05-07T10:12:54.696809 #3065062] INFO -- : make[2]: Entering directory '/home/opc/ruby/build/master/ext/monitor' I, [2024-05-07T10:12:54.696848 #3065062] INFO -- : make[2]: Leaving directory '/home/opc/ruby/build/master/ext/fiddle' I, [2024-05-07T10:12:54.700407 #3065062] INFO -- : make[2]: Leaving directory '/home/opc/ruby/build/master/ext/monitor' I, [2024-05-07T10:12:54.703584 #3065062] INFO -- : make[2]: Entering directory '/home/opc/ruby/build/master/ext/objspace' I, [2024-05-07T10:12:54.704105 #3065062] INFO -- : make[2]: Leaving directory '/home/opc/ruby/build/master/ext/json' I, [2024-05-07T10:12:54.708227 #3065062] INFO -- : make[2]: Entering directory '/home/opc/ruby/build/master/ext/pathname' I, [2024-05-07T10:12:54.711913 #3065062] INFO -- : make[2]: Leaving directory '/home/opc/ruby/build/master/ext/objspace' I, [2024-05-07T10:12:54.713180 #3065062] INFO -- : make[2]: Leaving directory '/home/opc/ruby/build/master/ext/pathname' I, [2024-05-07T10:12:54.717423 #3065062] INFO -- : make[2]: Entering directory '/home/opc/ruby/build/master/ext/pty' I, [2024-05-07T10:12:54.718181 #3065062] INFO -- : make[2]: Entering directory '/home/opc/ruby/build/master/ext/psych' I, [2024-05-07T10:12:54.719573 #3065062] INFO -- : make[2]: Entering directory '/home/opc/ruby/build/master/ext/openssl' I, [2024-05-07T10:12:54.721827 #3065062] INFO -- : make[2]: Leaving directory '/home/opc/ruby/build/master/ext/pty' I, [2024-05-07T10:12:54.735244 #3065062] INFO -- : make[2]: Entering directory '/home/opc/ruby/build/master/ext/ripper' I, [2024-05-07T10:12:54.739750 #3065062] INFO -- : make[2]: Leaving directory '/home/opc/ruby/build/master/ext/psych' I, [2024-05-07T10:12:54.741774 #3065062] INFO -- : make[2]: Entering directory '/home/opc/ruby/build/master/ext/rubyvm' I, [2024-05-07T10:12:54.743371 #3065062] INFO -- : make[2]: Leaving directory '/home/opc/ruby/build/master/ext/ripper' I, [2024-05-07T10:12:54.745076 #3065062] INFO -- : make[2]: Leaving directory '/home/opc/ruby/build/master/ext/openssl' I, [2024-05-07T10:12:54.745115 #3065062] INFO -- : make[2]: Leaving directory '/home/opc/ruby/build/master/ext/rubyvm' I, [2024-05-07T10:12:54.752075 #3065062] INFO -- : make[2]: Entering directory '/home/opc/ruby/build/master/.bundle/gems/bigdecimal-3.1.7/ext/bigdecimal' I, [2024-05-07T10:12:54.755495 #3065062] INFO -- : make[2]: Entering directory '/home/opc/ruby/build/master/ext/socket' I, [2024-05-07T10:12:54.756018 #3065062] INFO -- : make[2]: Entering directory '/home/opc/ruby/build/master/.bundle/gems/bigdecimal-3.1.8/ext/bigdecimal' I, [2024-05-07T10:12:54.769528 #3065062] INFO -- : make[2]: Leaving directory '/home/opc/ruby/build/master/ext/socket' I, [2024-05-07T10:12:54.771893 #3065062] INFO -- : make[2]: Entering directory '/home/opc/ruby/build/master/.bundle/gems/debug-1.9.2/ext/debug' I, [2024-05-07T10:12:54.786008 #3065062] INFO -- : make[2]: Leaving directory '/home/opc/ruby/build/master/.bundle/gems/bigdecimal-3.1.7/ext/bigdecimal' I, [2024-05-07T10:12:54.788428 #3065062] INFO -- : make[2]: Leaving directory '/home/opc/ruby/build/master/.bundle/gems/bigdecimal-3.1.8/ext/bigdecimal' I, [2024-05-07T10:12:54.788467 #3065062] INFO -- : make[2]: Entering directory '/home/opc/ruby/build/master/.bundle/gems/nkf-0.2.0/ext/nkf' I, [2024-05-07T10:12:54.790798 #3065062] INFO -- : make[2]: Entering directory '/home/opc/ruby/build/master/.bundle/gems/racc-1.7.3/ext/racc/cparse' I, [2024-05-07T10:12:54.802844 #3065062] INFO -- : make[2]: Leaving directory '/home/opc/ruby/build/master/.bundle/gems/debug-1.9.2/ext/debug' I, [2024-05-07T10:12:54.809542 #3065062] INFO -- : make[2]: Entering directory '/home/opc/ruby/build/master/.bundle/gems/rbs-3.4.4/ext/rbs_extension' I, [2024-05-07T10:12:54.819962 #3065062] INFO -- : make[2]: Leaving directory '/home/opc/ruby/build/master/.bundle/gems/nkf-0.2.0/ext/nkf' I, [2024-05-07T10:12:54.821381 #3065062] INFO -- : make[2]: Leaving directory '/home/opc/ruby/build/master/.bundle/gems/racc-1.7.3/ext/racc/cparse' I, [2024-05-07T10:12:54.823315 #3065062] INFO -- : make[2]: Entering directory '/home/opc/ruby/build/master/.bundle/gems/syslog-0.1.2/ext/syslog' I, [2024-05-07T10:12:54.840900 #3065062] INFO -- : make[2]: Leaving directory '/home/opc/ruby/build/master/.bundle/gems/rbs-3.4.4/ext/rbs_extension' I, [2024-05-07T10:12:54.845474 #3065062] INFO -- : make[2]: Entering directory '/home/opc/ruby/build/master/ext/digest/sha2' I, [2024-05-07T10:12:54.850514 #3065062] INFO -- : make[2]: Leaving directory '/home/opc/ruby/build/master/ext/digest/sha2' I, [2024-05-07T10:12:54.853247 #3065062] INFO -- : make[2]: Leaving directory '/home/opc/ruby/build/master/.bundle/gems/syslog-0.1.2/ext/syslog' I, [2024-05-07T10:12:54.891093 #3065062] INFO -- : make[2]: Entering directory '/home/opc/ruby/build/master' I, [2024-05-07T10:12:54.975993 #3065062] INFO -- : make[2]: 'ruby' is up to date. I, [2024-05-07T10:12:54.976065 #3065062] INFO -- : make[2]: Leaving directory '/home/opc/ruby/build/master' I, [2024-05-07T10:12:54.976194 #3065062] INFO -- : make[1]: Leaving directory '/home/opc/ruby/build/master' I, [2024-05-07T10:12:54.980586 #3065062] INFO -- : make[1]: Entering directory '/home/opc/ruby/build/master' I, [2024-05-07T10:12:54.980635 #3065062] INFO -- : make[1]: Nothing to be done for 'note'. I, [2024-05-07T10:12:54.980646 #3065062] INFO -- : make[1]: Leaving directory '/home/opc/ruby/build/master' I, [2024-05-07T10:12:54.980945 #3065062] INFO -- : $$$[end] "make all -j3" exit with 0. I, [2024-05-07T10:12:54.981076 #3065062] INFO -- : $$$[beg] make install -j3 I, [2024-05-07T10:12:55.075715 #3065062] INFO -- : Update minitest to ea9caafc0754b1d6236a490d59e624b53209734a I, [2024-05-07T10:12:55.075964 #3065062] INFO -- : Update rbs to ba7872795d5de04adb8ff500c0e6afdc81a041dd I, [2024-05-07T10:12:55.076003 #3065062] INFO -- : Update power_assert to 84e85124c5014a139af39161d484156cfe87a9ed I, [2024-05-07T10:12:55.079251 #3065062] INFO -- : echo ea9caafc0754b1d6236a490d59e624b53209734a | /bin/sh /home/opc/ruby/src/master/tool/ifchange /home/opc/ruby/src/master/.bundle/.timestamp/minitest.revision - I, [2024-05-07T10:12:55.079343 #3065062] INFO -- : echo 84e85124c5014a139af39161d484156cfe87a9ed | /bin/sh /home/opc/ruby/src/master/tool/ifchange /home/opc/ruby/src/master/.bundle/.timestamp/power_assert.revision - I, [2024-05-07T10:12:55.080352 #3065062] INFO -- : echo ba7872795d5de04adb8ff500c0e6afdc81a041dd | /bin/sh /home/opc/ruby/src/master/tool/ifchange /home/opc/ruby/src/master/.bundle/.timestamp/rbs.revision - I, [2024-05-07T10:12:55.085191 #3065062] INFO -- : /home/opc/ruby/src/master/.bundle/.timestamp/power_assert.revision unchanged I, [2024-05-07T10:12:55.085244 #3065062] INFO -- : /home/opc/ruby/src/master/.bundle/.timestamp/minitest.revision unchanged I, [2024-05-07T10:12:55.087320 #3065062] INFO -- : /home/opc/ruby/src/master/.bundle/.timestamp/rbs.revision unchanged I, [2024-05-07T10:12:55.087943 #3065062] INFO -- : Update typeprof to b19a6416da3a05d57fadd6ffdadb382b6d236ca5 I, [2024-05-07T10:12:55.091147 #3065062] INFO -- : BASERUBY = /usr/local/bin/ruby --disable=gems I, [2024-05-07T10:12:55.091192 #3065062] INFO -- : CC = gcc I, [2024-05-07T10:12:55.091221 #3065062] INFO -- : LD = ld I, [2024-05-07T10:12:55.091231 #3065062] INFO -- : LDSHARED = gcc -shared I, [2024-05-07T10:12:55.091242 #3065062] INFO -- : CFLAGS = -O3 -fno-fast-math -ggdb3 -Wall -Wextra -Wdeprecated-declarations -Wdiv-by-zero -Wduplicated-cond -Wimplicit-function-declaration -Wimplicit-int -Wpointer-arith -Wwrite-strings -Wold-style-definition -Wimplicit-fallthrough=0 -Wmissing-noreturn -Wno-cast-function-type -Wno-constant-logical-operand -Wno-long-long -Wno-missing-field-initializers -Wno-overlength-strings -Wno-packed-bitfield-compat -Wno-parentheses-equality -Wno-self-assign -Wno-tautological-compare -Wno-unused-parameter -Wno-unused-value -Wsuggest-attribute=format -Wsuggest-attribute=noreturn -Wunused-variable -Wmisleading-indentation -Wundef I, [2024-05-07T10:12:55.091251 #3065062] INFO -- : XCFLAGS = -U_FORTIFY_SOURCE -D_FORTIFY_SOURCE=2 -fstack-protector-strong -msign-return-address=all -fno-strict-overflow -fvisibility=hidden -fexcess-precision=standard -DRUBY_EXPORT -fPIE -I. -I.ext/include/aarch64-linux -I/home/opc/ruby/src/master/include -I/home/opc/ruby/src/master -I/home/opc/ruby/src/master/prism -I/home/opc/ruby/src/master/enc/unicode/15.0.0 I, [2024-05-07T10:12:55.091260 #3065062] INFO -- : CPPFLAGS = I, [2024-05-07T10:12:55.091268 #3065062] INFO -- : DLDFLAGS = -Wl,--compress-debug-sections=zlib -fstack-protector-strong -pie I, [2024-05-07T10:12:55.091277 #3065062] INFO -- : SOLIBS = -lz -lrt -lrt -ldl -lcrypt -lm -lpthread I, [2024-05-07T10:12:55.091285 #3065062] INFO -- : LANG = en_US.UTF-8 I, [2024-05-07T10:12:55.091292 #3065062] INFO -- : LC_ALL = I, [2024-05-07T10:12:55.091300 #3065062] INFO -- : LC_CTYPE = I, [2024-05-07T10:12:55.091310 #3065062] INFO -- : MFLAGS = -j3 --jobserver-auth=4,5 I, [2024-05-07T10:12:55.091318 #3065062] INFO -- : RUSTC = rustc I, [2024-05-07T10:12:55.091326 #3065062] INFO -- : YJIT_RUSTC_ARGS = --crate-name=yjit --crate-type=staticlib --edition=2021 -g -C lto=thin -C opt-level=3 -C overflow-checks=on '--out-dir=/home/opc/ruby/build/master/yjit/target/release/' /home/opc/ruby/src/master/yjit/src/lib.rs I, [2024-05-07T10:12:55.123367 #3065062] INFO -- : echo b19a6416da3a05d57fadd6ffdadb382b6d236ca5 | /bin/sh /home/opc/ruby/src/master/tool/ifchange /home/opc/ruby/src/master/.bundle/.timestamp/typeprof.revision - I, [2024-05-07T10:12:55.124386 #3065062] INFO -- : gcc (GCC) 8.5.0 20210514 (Red Hat 8.5.0-10.1.0.1) I, [2024-05-07T10:12:55.124418 #3065062] INFO -- : Copyright (C) 2018 Free Software Foundation, Inc. I, [2024-05-07T10:12:55.124428 #3065062] INFO -- : This is free software; see the source for copying conditions. There is NO I, [2024-05-07T10:12:55.124437 #3065062] INFO -- : warranty; not even for MERCHANTABILITY or FITNESS FOR A PARTICULAR PURPOSE. I, [2024-05-07T10:12:55.124446 #3065062] INFO -- : I, [2024-05-07T10:12:55.124953 #3065062] INFO -- : generating enc.mk I, [2024-05-07T10:12:55.129026 #3065062] INFO -- : /home/opc/ruby/src/master/.bundle/.timestamp/typeprof.revision unchanged I, [2024-05-07T10:12:55.224381 #3065062] INFO -- : Building power_assert@84e85124c5014a139af39161d484156cfe87a9ed to /home/opc/ruby/src/master/gems/power_assert-2.0.3.gem I, [2024-05-07T10:12:55.339808 #3065062] INFO -- : Successfully built RubyGem I, [2024-05-07T10:12:55.339869 #3065062] INFO -- : Name: power_assert I, [2024-05-07T10:12:55.339880 #3065062] INFO -- : Version: 2.0.4dev I, [2024-05-07T10:12:55.339888 #3065062] INFO -- : File: power_assert-2.0.4dev.gem I, [2024-05-07T10:12:55.342274 #3065062] INFO -- : Extracting bundle gem power_assert-2.0.3... I, [2024-05-07T10:12:55.363733 #3065062] INFO -- : making srcs under enc I, [2024-05-07T10:12:55.364256 #3065062] INFO -- : making enc I, [2024-05-07T10:12:55.391479 #3065062] INFO -- : make[1]: Entering directory '/home/opc/ruby/build/master' I, [2024-05-07T10:12:55.391532 #3065062] INFO -- : make[1]: Nothing to be done for 'enc'. I, [2024-05-07T10:12:55.391543 #3065062] INFO -- : make[1]: Leaving directory '/home/opc/ruby/build/master' I, [2024-05-07T10:12:55.406683 #3065062] INFO -- : make[1]: Entering directory '/home/opc/ruby/build/master' I, [2024-05-07T10:12:55.406742 #3065062] INFO -- : make[1]: Nothing to be done for 'srcs'. I, [2024-05-07T10:12:55.406752 #3065062] INFO -- : make[1]: Leaving directory '/home/opc/ruby/build/master' I, [2024-05-07T10:12:55.407549 #3065062] INFO -- : generating transdb.h I, [2024-05-07T10:12:55.440944 #3065062] INFO -- : Try with hash version of bundled gems instead of gems/power_assert-2.0.3.gem. We don't use this gem with release version of Ruby. I, [2024-05-07T10:12:55.451238 #3065062] INFO -- : Unpacked gems/power_assert-2.0.4dev.gem I, [2024-05-07T10:12:55.550854 #3065062] INFO -- : transdb.h unchanged I, [2024-05-07T10:12:55.552260 #3065062] INFO -- : generating makefiles ext/configure-ext.mk I, [2024-05-07T10:12:55.552552 #3065062] INFO -- : making trans I, [2024-05-07T10:12:55.591751 #3065062] INFO -- : ext/configure-ext.mk unchanged I, [2024-05-07T10:12:55.594797 #3065062] INFO -- : make[1]: Entering directory '/home/opc/ruby/build/master' I, [2024-05-07T10:12:55.600797 #3065062] INFO -- : make[1]: Entering directory '/home/opc/ruby/build/master' I, [2024-05-07T10:12:55.600845 #3065062] INFO -- : make[1]: Nothing to be done for 'trans'. I, [2024-05-07T10:12:55.600858 #3065062] INFO -- : make[1]: Leaving directory '/home/opc/ruby/build/master' I, [2024-05-07T10:12:56.279122 #3065062] INFO -- : making encs I, [2024-05-07T10:12:56.331880 #3065062] INFO -- : make[1]: Leaving directory '/home/opc/ruby/build/master' I, [2024-05-07T10:12:56.332572 #3065062] INFO -- : generating makefile exts.mk I, [2024-05-07T10:12:56.336747 #3065062] INFO -- : make[1]: Entering directory '/home/opc/ruby/build/master' I, [2024-05-07T10:12:56.336796 #3065062] INFO -- : make[1]: Nothing to be done for 'encs'. I, [2024-05-07T10:12:56.336808 #3065062] INFO -- : make[1]: Leaving directory '/home/opc/ruby/build/master' I, [2024-05-07T10:12:56.390578 #3065062] INFO -- : exts.mk unchanged I, [2024-05-07T10:12:56.395607 #3065062] INFO -- : make[1]: Entering directory '/home/opc/ruby/build/master' I, [2024-05-07T10:12:56.500800 #3065062] INFO -- : make[2]: Entering directory '/home/opc/ruby/build/master/ext/coverage' I, [2024-05-07T10:12:56.501686 #3065062] INFO -- : make[2]: Entering directory '/home/opc/ruby/build/master/ext/date' I, [2024-05-07T10:12:56.502405 #3065062] INFO -- : make[2]: Entering directory '/home/opc/ruby/build/master/ext/digest' I, [2024-05-07T10:12:56.506982 #3065062] INFO -- : make[2]: Leaving directory '/home/opc/ruby/build/master/ext/coverage' I, [2024-05-07T10:12:56.508072 #3065062] INFO -- : make[2]: Leaving directory '/home/opc/ruby/build/master/ext/date' I, [2024-05-07T10:12:56.513233 #3065062] INFO -- : make[2]: Leaving directory '/home/opc/ruby/build/master/ext/digest' I, [2024-05-07T10:12:56.517664 #3065062] INFO -- : make[2]: Entering directory '/home/opc/ruby/build/master/ext/io/console' I, [2024-05-07T10:12:56.519839 #3065062] INFO -- : make[2]: Entering directory '/home/opc/ruby/build/master/ext/fiddle' I, [2024-05-07T10:12:56.523324 #3065062] INFO -- : make[2]: Leaving directory '/home/opc/ruby/build/master/ext/io/console' I, [2024-05-07T10:12:56.525310 #3065062] INFO -- : make[2]: Entering directory '/home/opc/ruby/build/master/ext/json' I, [2024-05-07T10:12:56.529067 #3065062] INFO -- : make[2]: Entering directory '/home/opc/ruby/build/master/ext/monitor' I, [2024-05-07T10:12:56.530248 #3065062] INFO -- : make[2]: Leaving directory '/home/opc/ruby/build/master/ext/fiddle' I, [2024-05-07T10:12:56.533747 #3065062] INFO -- : make[2]: Leaving directory '/home/opc/ruby/build/master/ext/monitor' I, [2024-05-07T10:12:56.536062 #3065062] INFO -- : make[2]: Leaving directory '/home/opc/ruby/build/master/ext/json' I, [2024-05-07T10:12:56.537427 #3065062] INFO -- : make[2]: Entering directory '/home/opc/ruby/build/master/ext/objspace' I, [2024-05-07T10:12:56.540357 #3065062] INFO -- : make[2]: Entering directory '/home/opc/ruby/build/master/ext/pathname' I, [2024-05-07T10:12:56.543304 #3065062] INFO -- : make[2]: Leaving directory '/home/opc/ruby/build/master/ext/objspace' I, [2024-05-07T10:12:56.545384 #3065062] INFO -- : make[2]: Leaving directory '/home/opc/ruby/build/master/ext/pathname' I, [2024-05-07T10:12:56.549498 #3065062] INFO -- : make[2]: Entering directory '/home/opc/ruby/build/master/ext/psych' I, [2024-05-07T10:12:56.556588 #3065062] INFO -- : make[2]: Entering directory '/home/opc/ruby/build/master/ext/pty' I, [2024-05-07T10:12:56.556626 #3065062] INFO -- : make[2]: Entering directory '/home/opc/ruby/build/master/ext/openssl' I, [2024-05-07T10:12:56.560705 #3065062] INFO -- : make[2]: Leaving directory '/home/opc/ruby/build/master/ext/pty' I, [2024-05-07T10:12:56.563705 #3065062] INFO -- : make[2]: Leaving directory '/home/opc/ruby/build/master/ext/psych' I, [2024-05-07T10:12:56.571708 #3065062] INFO -- : make[2]: Entering directory '/home/opc/ruby/build/master/ext/ripper' I, [2024-05-07T10:12:56.572217 #3065062] INFO -- : make[2]: Entering directory '/home/opc/ruby/build/master/ext/rubyvm' I, [2024-05-07T10:12:56.576435 #3065062] INFO -- : make[2]: Leaving directory '/home/opc/ruby/build/master/ext/rubyvm' I, [2024-05-07T10:12:56.577642 #3065062] INFO -- : make[2]: Leaving directory '/home/opc/ruby/build/master/ext/openssl' I, [2024-05-07T10:12:56.579411 #3065062] INFO -- : make[2]: Leaving directory '/home/opc/ruby/build/master/ext/ripper' I, [2024-05-07T10:12:56.588541 #3065062] INFO -- : make[2]: Entering directory '/home/opc/ruby/build/master/.bundle/gems/bigdecimal-3.1.8/ext/bigdecimal' I, [2024-05-07T10:12:56.588619 #3065062] INFO -- : make[2]: Entering directory '/home/opc/ruby/build/master/.bundle/gems/bigdecimal-3.1.7/ext/bigdecimal' I, [2024-05-07T10:12:56.589094 #3065062] INFO -- : make[2]: Entering directory '/home/opc/ruby/build/master/ext/socket' I, [2024-05-07T10:12:56.603390 #3065062] INFO -- : make[2]: Leaving directory '/home/opc/ruby/build/master/ext/socket' I, [2024-05-07T10:12:56.609725 #3065062] INFO -- : make[2]: Entering directory '/home/opc/ruby/build/master/.bundle/gems/debug-1.9.2/ext/debug' I, [2024-05-07T10:12:56.619484 #3065062] INFO -- : make[2]: Leaving directory '/home/opc/ruby/build/master/.bundle/gems/bigdecimal-3.1.8/ext/bigdecimal' I, [2024-05-07T10:12:56.619555 #3065062] INFO -- : make[2]: Leaving directory '/home/opc/ruby/build/master/.bundle/gems/bigdecimal-3.1.7/ext/bigdecimal' I, [2024-05-07T10:12:56.621910 #3065062] INFO -- : make[2]: Entering directory '/home/opc/ruby/build/master/.bundle/gems/nkf-0.2.0/ext/nkf' I, [2024-05-07T10:12:56.623840 #3065062] INFO -- : make[2]: Entering directory '/home/opc/ruby/build/master/.bundle/gems/racc-1.7.3/ext/racc/cparse' I, [2024-05-07T10:12:56.641652 #3065062] INFO -- : make[2]: Leaving directory '/home/opc/ruby/build/master/.bundle/gems/debug-1.9.2/ext/debug' I, [2024-05-07T10:12:56.644598 #3065062] INFO -- : make[2]: Entering directory '/home/opc/ruby/build/master/.bundle/gems/rbs-3.4.4/ext/rbs_extension' I, [2024-05-07T10:12:56.652146 #3065062] INFO -- : make[2]: Leaving directory '/home/opc/ruby/build/master/.bundle/gems/nkf-0.2.0/ext/nkf' I, [2024-05-07T10:12:56.654906 #3065062] INFO -- : make[2]: Entering directory '/home/opc/ruby/build/master/.bundle/gems/syslog-0.1.2/ext/syslog' I, [2024-05-07T10:12:56.656213 #3065062] INFO -- : make[2]: Leaving directory '/home/opc/ruby/build/master/.bundle/gems/racc-1.7.3/ext/racc/cparse' I, [2024-05-07T10:12:56.678428 #3065062] INFO -- : make[2]: Leaving directory '/home/opc/ruby/build/master/.bundle/gems/rbs-3.4.4/ext/rbs_extension' I, [2024-05-07T10:12:56.681223 #3065062] INFO -- : make[2]: Entering directory '/home/opc/ruby/build/master/ext/digest/sha2' I, [2024-05-07T10:12:56.685959 #3065062] INFO -- : make[2]: Leaving directory '/home/opc/ruby/build/master/.bundle/gems/syslog-0.1.2/ext/syslog' I, [2024-05-07T10:12:56.686474 #3065062] INFO -- : make[2]: Leaving directory '/home/opc/ruby/build/master/ext/digest/sha2' I, [2024-05-07T10:12:56.725963 #3065062] INFO -- : make[2]: Entering directory '/home/opc/ruby/build/master' I, [2024-05-07T10:12:56.809093 #3065062] INFO -- : make[2]: 'ruby' is up to date. I, [2024-05-07T10:12:56.809169 #3065062] INFO -- : make[2]: Leaving directory '/home/opc/ruby/build/master' I, [2024-05-07T10:12:56.809295 #3065062] INFO -- : make[1]: Leaving directory '/home/opc/ruby/build/master' I, [2024-05-07T10:12:56.814083 #3065062] INFO -- : make[1]: Entering directory '/home/opc/ruby/build/master' I, [2024-05-07T10:12:56.814114 #3065062] INFO -- : make[1]: Nothing to be done for 'note'. I, [2024-05-07T10:12:56.814124 #3065062] INFO -- : make[1]: Leaving directory '/home/opc/ruby/build/master' I, [2024-05-07T10:12:56.814383 #3065062] INFO -- : ./miniruby -I/home/opc/ruby/src/master/lib -I. -I.ext/common /home/opc/ruby/src/master/tool/runruby.rb --extout=.ext -- --disable-gems -r./aarch64-linux-fake /home/opc/ruby/src/master/tool/rbinstall.rb --make="make" --dest-dir="" --extout=".ext" --ext-build-dir="./ext" --mflags="-j3 --jobserver-auth=4,5" --make-flags=" -j3 --jobserver-auth=4,5" --data-mode=0644 --prog-mode=0755 --installed-list .installed.list --mantype="doc" --gnumake --install=all --exclude=doc I, [2024-05-07T10:12:56.960690 #3065062] INFO -- : Installing to I, [2024-05-07T10:12:56.960753 #3065062] INFO -- : installing binary commands: /home/opc/ruby/install/master/bin I, [2024-05-07T10:12:56.972516 #3065062] INFO -- : installing base libraries: /home/opc/ruby/install/master/lib I, [2024-05-07T10:12:56.972997 #3065062] INFO -- : installing arch files: /home/opc/ruby/install/master/lib/ruby/3.4.0+0/aarch64-linux I, [2024-05-07T10:12:56.973209 #3065062] INFO -- : installing pkgconfig data: /home/opc/ruby/install/master/lib/pkgconfig I, [2024-05-07T10:12:56.973263 #3065062] INFO -- : installing extension objects: /home/opc/ruby/install/master/lib/ruby/3.4.0+0/aarch64-linux I, [2024-05-07T10:12:56.985718 #3065062] INFO -- : installing extension objects: /home/opc/ruby/install/master/lib/ruby/site_ruby/3.4.0+0/aarch64-linux I, [2024-05-07T10:12:56.985769 #3065062] INFO -- : installing extension objects: /home/opc/ruby/install/master/lib/ruby/vendor_ruby/3.4.0+0/aarch64-linux I, [2024-05-07T10:12:56.985872 #3065062] INFO -- : installing extension headers: /home/opc/ruby/install/master/include/ruby-3.4.0+0/aarch64-linux I, [2024-05-07T10:12:56.986149 #3065062] INFO -- : installing extension scripts: /home/opc/ruby/install/master/lib/ruby/3.4.0+0 I, [2024-05-07T10:12:56.995183 #3065062] INFO -- : installing extension scripts: /home/opc/ruby/install/master/lib/ruby/site_ruby/3.4.0+0 I, [2024-05-07T10:12:56.995226 #3065062] INFO -- : installing extension scripts: /home/opc/ruby/install/master/lib/ruby/vendor_ruby/3.4.0+0 I, [2024-05-07T10:12:56.995247 #3065062] INFO -- : installing extension headers: /home/opc/ruby/install/master/include/ruby-3.4.0+0/ruby I, [2024-05-07T10:12:56.995401 #3065062] INFO -- : installing command scripts: /home/opc/ruby/install/master/bin I, [2024-05-07T10:12:56.995541 #3065062] INFO -- : installing library scripts: /home/opc/ruby/install/master/lib/ruby/3.4.0+0 I, [2024-05-07T10:12:57.078379 #3065062] INFO -- : installing common headers: /home/opc/ruby/install/master/include/ruby-3.4.0+0 I, [2024-05-07T10:12:57.093720 #3065062] INFO -- : installing manpages: /home/opc/ruby/install/master/share/man/man1 I, [2024-05-07T10:12:57.093997 #3065062] INFO -- : installing default gems from lib: /home/opc/ruby/install/master/lib/ruby/gems/3.4.0+0 I, [2024-05-07T10:12:57.132949 #3065062] INFO -- : benchmark 0.3.0 I, [2024-05-07T10:12:57.145893 #3065062] INFO -- : bundler 2.6.0.dev I, [2024-05-07T10:12:57.150839 #3065062] INFO -- : cgi 0.4.1 I, [2024-05-07T10:12:57.151955 #3065062] INFO -- : delegate 0.3.1 I, [2024-05-07T10:12:57.153094 #3065062] INFO -- : did_you_mean 1.6.3 I, [2024-05-07T10:12:57.154224 #3065062] INFO -- : english 0.8.0 I, [2024-05-07T10:12:57.155472 #3065062] INFO -- : erb 4.0.4 I, [2024-05-07T10:12:57.158258 #3065062] INFO -- : error_highlight 0.6.0 I, [2024-05-07T10:12:57.159343 #3065062] INFO -- : fileutils 1.7.2 I, [2024-05-07T10:12:57.160403 #3065062] INFO -- : find 0.2.0 I, [2024-05-07T10:12:57.161546 #3065062] INFO -- : forwardable 1.3.3 I, [2024-05-07T10:12:57.162608 #3065062] INFO -- : ipaddr 1.2.6 I, [2024-05-07T10:12:57.163676 #3065062] INFO -- : irb 1.13.1 I, [2024-05-07T10:12:57.166405 #3065062] INFO -- : logger 1.6.0 I, [2024-05-07T10:12:57.167488 #3065062] INFO -- : net-http 0.4.1 I, [2024-05-07T10:12:57.170266 #3065062] INFO -- : net-protocol 0.2.2 I, [2024-05-07T10:12:57.171421 #3065062] INFO -- : open-uri 0.4.1 I, [2024-05-07T10:12:57.172598 #3065062] INFO -- : open3 0.2.1 I, [2024-05-07T10:12:57.173741 #3065062] INFO -- : optparse 0.5.0 I, [2024-05-07T10:12:57.174862 #3065062] INFO -- : ostruct 0.6.0 I, [2024-05-07T10:12:57.175923 #3065062] INFO -- : pp 0.5.0 I, [2024-05-07T10:12:57.177092 #3065062] INFO -- : prettyprint 0.2.0 I, [2024-05-07T10:12:57.178231 #3065062] INFO -- : prism 0.27.0 I, [2024-05-07T10:12:57.179404 #3065062] INFO -- : pstore 0.1.3 I, [2024-05-07T10:12:57.180500 #3065062] INFO -- : rdoc 6.6.3.1 I, [2024-05-07T10:12:57.184624 #3065062] INFO -- : readline 0.0.4 I, [2024-05-07T10:12:57.185770 #3065062] INFO -- : reline 0.5.5 I, [2024-05-07T10:12:57.186919 #3065062] INFO -- : resolv 0.4.0 I, [2024-05-07T10:12:57.188026 #3065062] INFO -- : ruby2_keywords 0.0.5 I, [2024-05-07T10:12:57.189165 #3065062] INFO -- : securerandom 0.3.1 I, [2024-05-07T10:12:57.190313 #3065062] INFO -- : set 1.1.0 I, [2024-05-07T10:12:57.191413 #3065062] INFO -- : shellwords 0.2.0 I, [2024-05-07T10:12:57.192575 #3065062] INFO -- : singleton 0.2.0 I, [2024-05-07T10:12:57.193718 #3065062] INFO -- : syntax_suggest 2.0.0 I, [2024-05-07T10:12:57.197929 #3065062] INFO -- : tempfile 0.2.1 I, [2024-05-07T10:12:57.199051 #3065062] INFO -- : time 0.3.0 I, [2024-05-07T10:12:57.200180 #3065062] INFO -- : timeout 0.4.1 I, [2024-05-07T10:12:57.201304 #3065062] INFO -- : tmpdir 0.2.0 I, [2024-05-07T10:12:57.202471 #3065062] INFO -- : tsort 0.2.0 I, [2024-05-07T10:12:57.203571 #3065062] INFO -- : un 0.3.0 I, [2024-05-07T10:12:57.204693 #3065062] INFO -- : uri 0.13.0 I, [2024-05-07T10:12:57.205899 #3065062] INFO -- : weakref 0.1.3 I, [2024-05-07T10:12:57.207007 #3065062] INFO -- : yaml 0.3.0 I, [2024-05-07T10:12:57.207903 #3065062] INFO -- : installing default gems from ext: /home/opc/ruby/install/master/lib/ruby/gems/3.4.0+0 I, [2024-05-07T10:12:57.217334 #3065062] INFO -- : date 3.3.4 I, [2024-05-07T10:12:57.219904 #3065062] INFO -- : digest 3.1.1 I, [2024-05-07T10:12:57.221024 #3065062] INFO -- : etc 1.4.3 I, [2024-05-07T10:12:57.222198 #3065062] INFO -- : fcntl 1.1.0 I, [2024-05-07T10:12:57.223291 #3065062] INFO -- : fiddle 1.1.3 I, [2024-05-07T10:12:57.224391 #3065062] INFO -- : io-console 0.7.2 I, [2024-05-07T10:12:57.225552 #3065062] INFO -- : io-nonblock 0.3.0 I, [2024-05-07T10:12:57.226644 #3065062] INFO -- : io-wait 0.3.1 I, [2024-05-07T10:12:57.227697 #3065062] INFO -- : json 2.7.2 I, [2024-05-07T10:12:57.228974 #3065062] INFO -- : openssl 3.2.0 I, [2024-05-07T10:12:57.230343 #3065062] INFO -- : pathname 0.3.0 I, [2024-05-07T10:12:57.231835 #3065062] INFO -- : psych 5.1.2 I, [2024-05-07T10:12:57.233091 #3065062] INFO -- : stringio 3.1.1 I, [2024-05-07T10:12:57.234276 #3065062] INFO -- : strscan 3.1.1 I, [2024-05-07T10:12:57.235383 #3065062] INFO -- : zlib 3.1.0 I, [2024-05-07T10:12:57.236292 #3065062] INFO -- : installing bundled gems: /home/opc/ruby/install/master/lib/ruby/gems/3.4.0+0 I, [2024-05-07T10:12:57.236974 #3065062] INFO -- : minitest 5.22.3 I, [2024-05-07T10:12:57.250716 #3065062] INFO -- : rake 13.2.1 I, [2024-05-07T10:12:57.263867 #3065062] INFO -- : test-unit 3.6.2 I, [2024-05-07T10:12:57.279563 #3065062] INFO -- : rexml 3.2.6 I, [2024-05-07T10:12:57.293608 #3065062] INFO -- : rss 0.3.0 I, [2024-05-07T10:12:57.303490 #3065062] INFO -- : net-ftp 0.3.4 I, [2024-05-07T10:12:57.307156 #3065062] INFO -- : net-imap 0.4.10 I, [2024-05-07T10:12:57.317996 #3065062] INFO -- : net-pop 0.1.2 I, [2024-05-07T10:12:57.322100 #3065062] INFO -- : net-smtp 0.5.0 I, [2024-05-07T10:12:57.325269 #3065062] INFO -- : matrix 0.4.2 I, [2024-05-07T10:12:57.331059 #3065062] INFO -- : prime 0.1.2 I, [2024-05-07T10:12:57.341083 #3065062] INFO -- : rbs 3.4.4 I, [2024-05-07T10:12:57.449725 #3065062] INFO -- : typeprof 0.21.11 I, [2024-05-07T10:12:57.457709 #3065062] INFO -- : debug 1.9.2 I, [2024-05-07T10:12:57.467140 #3065062] INFO -- : racc 1.7.3 I, [2024-05-07T10:12:57.476523 #3065062] INFO -- : mutex_m 0.2.0 I, [2024-05-07T10:12:57.479362 #3065062] INFO -- : getoptlong 0.2.1 I, [2024-05-07T10:12:57.484841 #3065062] INFO -- : base64 0.2.0 I, [2024-05-07T10:12:57.487174 #3065062] INFO -- : bigdecimal 3.1.8 I, [2024-05-07T10:12:57.493246 #3065062] INFO -- : observer 0.1.2 I, [2024-05-07T10:12:57.496137 #3065062] INFO -- : abbrev 0.1.2 I, [2024-05-07T10:12:57.499173 #3065062] INFO -- : resolv-replace 0.1.1 I, [2024-05-07T10:12:57.502210 #3065062] INFO -- : rinda 0.2.0 I, [2024-05-07T10:12:57.505745 #3065062] INFO -- : drb 2.2.1 I, [2024-05-07T10:12:57.510043 #3065062] INFO -- : nkf 0.2.0 I, [2024-05-07T10:12:57.517579 #3065062] INFO -- : syslog 0.1.2 I, [2024-05-07T10:12:57.522039 #3065062] INFO -- : csv 3.3.0 I, [2024-05-07T10:12:57.530903 #3065062] INFO -- : installing bundled gem cache: /home/opc/ruby/install/master/lib/ruby/gems/3.4.0+0/cache I, [2024-05-07T10:12:57.532883 #3065062] INFO -- : skipped bundled gems: I, [2024-05-07T10:12:57.532904 #3065062] INFO -- : power_assert-2.0.4dev.gem not found in bundled_gems I, [2024-05-07T10:12:57.535674 #3065062] INFO -- : $$$[end] "make install -j3" exit with 0. I, [2024-05-07T10:12:57.535800 #3065062] INFO -- : $$$[beg] make yes-btest TESTOPTS='-q -j3' I, [2024-05-07T10:13:19.290129 #3065062] INFO -- : PASS all 1936 tests E, [2024-05-07T10:13:19.291957 #3065062] ERROR -- : I, [2024-05-07T10:13:19.292067 #3065062] INFO -- : $$$[end] "make yes-btest TESTOPTS='-q -j3'" exit with 0. I, [2024-05-07T10:13:19.292216 #3065062] INFO -- : $$$[beg] make yes-test-basic TESTS='-j3' I, [2024-05-07T10:13:19.384391 #3065062] INFO -- : BASERUBY = /usr/local/bin/ruby --disable=gems I, [2024-05-07T10:13:19.384457 #3065062] INFO -- : CC = gcc I, [2024-05-07T10:13:19.384469 #3065062] INFO -- : LD = ld I, [2024-05-07T10:13:19.384478 #3065062] INFO -- : LDSHARED = gcc -shared I, [2024-05-07T10:13:19.384503 #3065062] INFO -- : CFLAGS = -O3 -fno-fast-math -ggdb3 -Wall -Wextra -Wdeprecated-declarations -Wdiv-by-zero -Wduplicated-cond -Wimplicit-function-declaration -Wimplicit-int -Wpointer-arith -Wwrite-strings -Wold-style-definition -Wimplicit-fallthrough=0 -Wmissing-noreturn -Wno-cast-function-type -Wno-constant-logical-operand -Wno-long-long -Wno-missing-field-initializers -Wno-overlength-strings -Wno-packed-bitfield-compat -Wno-parentheses-equality -Wno-self-assign -Wno-tautological-compare -Wno-unused-parameter -Wno-unused-value -Wsuggest-attribute=format -Wsuggest-attribute=noreturn -Wunused-variable -Wmisleading-indentation -Wundef I, [2024-05-07T10:13:19.385982 #3065062] INFO -- : XCFLAGS = -U_FORTIFY_SOURCE -D_FORTIFY_SOURCE=2 -fstack-protector-strong -msign-return-address=all -fno-strict-overflow -fvisibility=hidden -fexcess-precision=standard -DRUBY_EXPORT -fPIE -I. -I.ext/include/aarch64-linux -I/home/opc/ruby/src/master/include -I/home/opc/ruby/src/master -I/home/opc/ruby/src/master/prism -I/home/opc/ruby/src/master/enc/unicode/15.0.0 I, [2024-05-07T10:13:19.385997 #3065062] INFO -- : CPPFLAGS = I, [2024-05-07T10:13:19.386005 #3065062] INFO -- : DLDFLAGS = -Wl,--compress-debug-sections=zlib -fstack-protector-strong -pie I, [2024-05-07T10:13:19.386014 #3065062] INFO -- : SOLIBS = -lz -lrt -lrt -ldl -lcrypt -lm -lpthread I, [2024-05-07T10:13:19.386021 #3065062] INFO -- : LANG = en_US.UTF-8 I, [2024-05-07T10:13:19.386029 #3065062] INFO -- : LC_ALL = I, [2024-05-07T10:13:19.386036 #3065062] INFO -- : LC_CTYPE = I, [2024-05-07T10:13:19.386044 #3065062] INFO -- : MFLAGS = I, [2024-05-07T10:13:19.386051 #3065062] INFO -- : RUSTC = rustc I, [2024-05-07T10:13:19.386059 #3065062] INFO -- : YJIT_RUSTC_ARGS = --crate-name=yjit --crate-type=staticlib --edition=2021 -g -C lto=thin -C opt-level=3 -C overflow-checks=on '--out-dir=/home/opc/ruby/build/master/yjit/target/release/' /home/opc/ruby/src/master/yjit/src/lib.rs I, [2024-05-07T10:13:19.386070 #3065062] INFO -- : gcc (GCC) 8.5.0 20210514 (Red Hat 8.5.0-10.1.0.1) I, [2024-05-07T10:13:19.386078 #3065062] INFO -- : Copyright (C) 2018 Free Software Foundation, Inc. I, [2024-05-07T10:13:19.386086 #3065062] INFO -- : This is free software; see the source for copying conditions. There is NO I, [2024-05-07T10:13:19.386094 #3065062] INFO -- : warranty; not even for MERCHANTABILITY or FITNESS FOR A PARTICULAR PURPOSE. I, [2024-05-07T10:13:19.386102 #3065062] INFO -- : I, [2024-05-07T10:13:19.542563 #3065062] INFO -- : Checking leaked global symbols...none I, [2024-05-07T10:13:19.594944 #3065062] INFO -- : /home/opc/ruby/src/master/basictest/test.rb:assignment ....................................................................................................................................................................................................................................................................................................................................................................................OK 372 I, [2024-05-07T10:13:19.595019 #3065062] INFO -- : /home/opc/ruby/src/master/basictest/test.rb:condition ..OK 2 I, [2024-05-07T10:13:19.595047 #3065062] INFO -- : /home/opc/ruby/src/master/basictest/test.rb:if/unless ...OK 3 I, [2024-05-07T10:13:19.595090 #3065062] INFO -- : /home/opc/ruby/src/master/basictest/test.rb:case .....OK 5 I, [2024-05-07T10:13:19.595643 #3065062] INFO -- : /home/opc/ruby/src/master/basictest/test.rb:while/until ........OK 8 I, [2024-05-07T10:13:19.595761 #3065062] INFO -- : /home/opc/ruby/src/master/basictest/test.rb:exception ..........OK 10 I, [2024-05-07T10:13:19.596376 #3065062] INFO -- : /home/opc/ruby/src/master/basictest/test.rb:array .......................................OK 39 I, [2024-05-07T10:13:19.596649 #3065062] INFO -- : /home/opc/ruby/src/master/basictest/test.rb:hash ...........................OK 27 I, [2024-05-07T10:13:19.598346 #3065062] INFO -- : /home/opc/ruby/src/master/basictest/test.rb:iterator ...........................................................................................................OK 107 I, [2024-05-07T10:13:19.599082 #3065062] INFO -- : /home/opc/ruby/src/master/basictest/test.rb:float ................................................................................OK 80 I, [2024-05-07T10:13:19.602744 #3065062] INFO -- : /home/opc/ruby/src/master/basictest/test.rb:bignum ...............................OK 31 I, [2024-05-07T10:13:19.604307 #3065062] INFO -- : /home/opc/ruby/src/master/basictest/test.rb:string & char ..............................................................OK 62 I, [2024-05-07T10:13:19.604430 #3065062] INFO -- : /home/opc/ruby/src/master/basictest/test.rb:assignment ..........OK 10 I, [2024-05-07T10:13:19.604473 #3065062] INFO -- : /home/opc/ruby/src/master/basictest/test.rb:call ......OK 6 I, [2024-05-07T10:13:19.604612 #3065062] INFO -- : /home/opc/ruby/src/master/basictest/test.rb:proc .........OK 9 I, [2024-05-07T10:13:19.705096 #3065062] INFO -- : /home/opc/ruby/src/master/basictest/test.rb:signal ..OK 2 I, [2024-05-07T10:13:19.706931 #3065062] INFO -- : /home/opc/ruby/src/master/basictest/test.rb:eval ...........................OK 27 I, [2024-05-07T10:13:19.838368 #3065062] INFO -- : /home/opc/ruby/src/master/basictest/test.rb:system ........OK 8 I, [2024-05-07T10:13:19.838434 #3065062] INFO -- : /home/opc/ruby/src/master/basictest/test.rb:const .....OK 5 I, [2024-05-07T10:13:19.838538 #3065062] INFO -- : /home/opc/ruby/src/master/basictest/test.rb:clone .....OK 5 I, [2024-05-07T10:13:19.838728 #3065062] INFO -- : /home/opc/ruby/src/master/basictest/test.rb:marshal ....OK 4 I, [2024-05-07T10:13:19.838806 #3065062] INFO -- : /home/opc/ruby/src/master/basictest/test.rb:pack ....OK 4 I, [2024-05-07T10:13:19.838838 #3065062] INFO -- : /home/opc/ruby/src/master/basictest/test.rb:math ..OK 2 I, [2024-05-07T10:13:19.838926 #3065062] INFO -- : /home/opc/ruby/src/master/basictest/test.rb:struct ......OK 6 I, [2024-05-07T10:13:19.839094 #3065062] INFO -- : /home/opc/ruby/src/master/basictest/test.rb:variable ............OK 12 I, [2024-05-07T10:13:19.839135 #3065062] INFO -- : /home/opc/ruby/src/master/basictest/test.rb:trace ...OK 3 I, [2024-05-07T10:13:19.839262 #3065062] INFO -- : /home/opc/ruby/src/master/basictest/test.rb:defined? ............OK 12 I, [2024-05-07T10:13:19.839348 #3065062] INFO -- : /home/opc/ruby/src/master/basictest/test.rb:alias ......OK 6 I, [2024-05-07T10:13:19.839835 #3065062] INFO -- : /home/opc/ruby/src/master/basictest/test.rb:path .......................OK 23 I, [2024-05-07T10:13:19.908280 #3065062] INFO -- : /home/opc/ruby/src/master/basictest/test.rb:gc ....OK 4 I, [2024-05-07T10:13:19.910164 #3065062] INFO -- : I, [2024-05-07T10:13:19.910200 #3065062] INFO -- : test succeeded I, [2024-05-07T10:13:19.910877 #3065062] INFO -- : $$$[end] "make yes-test-basic TESTS='-j3'" exit with 0. I, [2024-05-07T10:13:19.911073 #3065062] INFO -- : $$$[beg] make yes-test-all TESTOPTS='--stderr-on-failure' TESTS='-j3' I, [2024-05-07T10:13:20.035816 #3065062] INFO -- : BASERUBY = /usr/local/bin/ruby --disable=gems I, [2024-05-07T10:13:20.035894 #3065062] INFO -- : CC = gcc I, [2024-05-07T10:13:20.035904 #3065062] INFO -- : LD = ld I, [2024-05-07T10:13:20.035914 #3065062] INFO -- : LDSHARED = gcc -shared I, [2024-05-07T10:13:20.035926 #3065062] INFO -- : CFLAGS = -O3 -fno-fast-math -ggdb3 -Wall -Wextra -Wdeprecated-declarations -Wdiv-by-zero -Wduplicated-cond -Wimplicit-function-declaration -Wimplicit-int -Wpointer-arith -Wwrite-strings -Wold-style-definition -Wimplicit-fallthrough=0 -Wmissing-noreturn -Wno-cast-function-type -Wno-constant-logical-operand -Wno-long-long -Wno-missing-field-initializers -Wno-overlength-strings -Wno-packed-bitfield-compat -Wno-parentheses-equality -Wno-self-assign -Wno-tautological-compare -Wno-unused-parameter -Wno-unused-value -Wsuggest-attribute=format -Wsuggest-attribute=noreturn -Wunused-variable -Wmisleading-indentation -Wundef I, [2024-05-07T10:13:20.035936 #3065062] INFO -- : XCFLAGS = -U_FORTIFY_SOURCE -D_FORTIFY_SOURCE=2 -fstack-protector-strong -msign-return-address=all -fno-strict-overflow -fvisibility=hidden -fexcess-precision=standard -DRUBY_EXPORT -fPIE -I. -I.ext/include/aarch64-linux -I/home/opc/ruby/src/master/include -I/home/opc/ruby/src/master -I/home/opc/ruby/src/master/prism -I/home/opc/ruby/src/master/enc/unicode/15.0.0 I, [2024-05-07T10:13:20.035945 #3065062] INFO -- : CPPFLAGS = I, [2024-05-07T10:13:20.035954 #3065062] INFO -- : DLDFLAGS = -Wl,--compress-debug-sections=zlib -fstack-protector-strong -pie I, [2024-05-07T10:13:20.035963 #3065062] INFO -- : SOLIBS = -lz -lrt -lrt -ldl -lcrypt -lm -lpthread I, [2024-05-07T10:13:20.035972 #3065062] INFO -- : LANG = en_US.UTF-8 I, [2024-05-07T10:13:20.035980 #3065062] INFO -- : LC_ALL = I, [2024-05-07T10:13:20.035987 #3065062] INFO -- : LC_CTYPE = I, [2024-05-07T10:13:20.035995 #3065062] INFO -- : MFLAGS = I, [2024-05-07T10:13:20.036003 #3065062] INFO -- : RUSTC = rustc I, [2024-05-07T10:13:20.036012 #3065062] INFO -- : YJIT_RUSTC_ARGS = --crate-name=yjit --crate-type=staticlib --edition=2021 -g -C lto=thin -C opt-level=3 -C overflow-checks=on '--out-dir=/home/opc/ruby/build/master/yjit/target/release/' /home/opc/ruby/src/master/yjit/src/lib.rs I, [2024-05-07T10:13:20.036770 #3065062] INFO -- : gcc (GCC) 8.5.0 20210514 (Red Hat 8.5.0-10.1.0.1) I, [2024-05-07T10:13:20.036797 #3065062] INFO -- : Copyright (C) 2018 Free Software Foundation, Inc. I, [2024-05-07T10:13:20.036807 #3065062] INFO -- : This is free software; see the source for copying conditions. There is NO I, [2024-05-07T10:13:20.036815 #3065062] INFO -- : warranty; not even for MERCHANTABILITY or FITNESS FOR A PARTICULAR PURPOSE. I, [2024-05-07T10:13:20.036824 #3065062] INFO -- : I, [2024-05-07T10:13:20.038846 #3065062] INFO -- : generating enc.mk I, [2024-05-07T10:13:20.275391 #3065062] INFO -- : making enc I, [2024-05-07T10:13:20.302557 #3065062] INFO -- : make[1]: Entering directory '/home/opc/ruby/build/master' I, [2024-05-07T10:13:20.302611 #3065062] INFO -- : make[1]: Nothing to be done for 'enc'. I, [2024-05-07T10:13:20.302624 #3065062] INFO -- : make[1]: Leaving directory '/home/opc/ruby/build/master' I, [2024-05-07T10:13:20.303285 #3065062] INFO -- : making srcs under enc I, [2024-05-07T10:13:20.345177 #3065062] INFO -- : make[1]: Entering directory '/home/opc/ruby/build/master' I, [2024-05-07T10:13:20.345225 #3065062] INFO -- : make[1]: Nothing to be done for 'srcs'. I, [2024-05-07T10:13:20.345236 #3065062] INFO -- : make[1]: Leaving directory '/home/opc/ruby/build/master' I, [2024-05-07T10:13:20.346457 #3065062] INFO -- : generating transdb.h I, [2024-05-07T10:13:20.490261 #3065062] INFO -- : transdb.h unchanged I, [2024-05-07T10:13:20.491554 #3065062] INFO -- : making trans I, [2024-05-07T10:13:20.539859 #3065062] INFO -- : make[1]: Entering directory '/home/opc/ruby/build/master' I, [2024-05-07T10:13:20.539940 #3065062] INFO -- : make[1]: Nothing to be done for 'trans'. I, [2024-05-07T10:13:20.539958 #3065062] INFO -- : make[1]: Leaving directory '/home/opc/ruby/build/master' I, [2024-05-07T10:13:20.540679 #3065062] INFO -- : making encs I, [2024-05-07T10:13:20.592946 #3065062] INFO -- : make[1]: Entering directory '/home/opc/ruby/build/master' I, [2024-05-07T10:13:20.593014 #3065062] INFO -- : make[1]: Nothing to be done for 'encs'. I, [2024-05-07T10:13:20.593024 #3065062] INFO -- : make[1]: Leaving directory '/home/opc/ruby/build/master' I, [2024-05-07T10:13:20.595086 #3065062] INFO -- : generating makefiles ext/configure-ext.mk I, [2024-05-07T10:13:20.635150 #3065062] INFO -- : ext/configure-ext.mk updated I, [2024-05-07T10:13:20.638768 #3065062] INFO -- : make[1]: Entering directory '/home/opc/ruby/build/master' I, [2024-05-07T10:13:22.695529 #3065062] INFO -- : make[1]: Leaving directory '/home/opc/ruby/build/master' I, [2024-05-07T10:13:22.696412 #3065062] INFO -- : generating makefile exts.mk I, [2024-05-07T10:13:22.755504 #3065062] INFO -- : exts.mk unchanged I, [2024-05-07T10:13:22.760297 #3065062] INFO -- : make[1]: Entering directory '/home/opc/ruby/build/master' I, [2024-05-07T10:13:23.058560 #3065062] INFO -- : make[2]: Entering directory '/home/opc/ruby/build/master/ext/coverage' I, [2024-05-07T10:13:23.063226 #3065062] INFO -- : make[2]: Leaving directory '/home/opc/ruby/build/master/ext/coverage' I, [2024-05-07T10:13:23.068938 #3065062] INFO -- : make[2]: Entering directory '/home/opc/ruby/build/master/ext/date' I, [2024-05-07T10:13:23.074132 #3065062] INFO -- : make[2]: Leaving directory '/home/opc/ruby/build/master/ext/date' I, [2024-05-07T10:13:23.077552 #3065062] INFO -- : make[2]: Entering directory '/home/opc/ruby/build/master/ext/digest' I, [2024-05-07T10:13:23.086372 #3065062] INFO -- : make[2]: Leaving directory '/home/opc/ruby/build/master/ext/digest' I, [2024-05-07T10:13:23.109081 #3065062] INFO -- : make[2]: Entering directory '/home/opc/ruby/build/master/ext/digest/sha2' I, [2024-05-07T10:13:23.114320 #3065062] INFO -- : make[2]: Leaving directory '/home/opc/ruby/build/master/ext/digest/sha2' I, [2024-05-07T10:13:23.132745 #3065062] INFO -- : make[2]: Entering directory '/home/opc/ruby/build/master/ext/fiddle' I, [2024-05-07T10:13:23.142974 #3065062] INFO -- : make[2]: Leaving directory '/home/opc/ruby/build/master/ext/fiddle' I, [2024-05-07T10:13:23.147107 #3065062] INFO -- : make[2]: Entering directory '/home/opc/ruby/build/master/ext/io/console' I, [2024-05-07T10:13:23.151312 #3065062] INFO -- : make[2]: Leaving directory '/home/opc/ruby/build/master/ext/io/console' I, [2024-05-07T10:13:23.161992 #3065062] INFO -- : make[2]: Entering directory '/home/opc/ruby/build/master/ext/json' I, [2024-05-07T10:13:23.171259 #3065062] INFO -- : make[2]: Leaving directory '/home/opc/ruby/build/master/ext/json' I, [2024-05-07T10:13:23.184049 #3065062] INFO -- : make[2]: Entering directory '/home/opc/ruby/build/master/ext/monitor' I, [2024-05-07T10:13:23.188102 #3065062] INFO -- : make[2]: Leaving directory '/home/opc/ruby/build/master/ext/monitor' I, [2024-05-07T10:13:23.194205 #3065062] INFO -- : make[2]: Entering directory '/home/opc/ruby/build/master/ext/objspace' I, [2024-05-07T10:13:23.200119 #3065062] INFO -- : make[2]: Leaving directory '/home/opc/ruby/build/master/ext/objspace' I, [2024-05-07T10:13:23.219160 #3065062] INFO -- : make[2]: Entering directory '/home/opc/ruby/build/master/ext/openssl' I, [2024-05-07T10:13:23.240553 #3065062] INFO -- : make[2]: Leaving directory '/home/opc/ruby/build/master/ext/openssl' I, [2024-05-07T10:13:23.244856 #3065062] INFO -- : make[2]: Entering directory '/home/opc/ruby/build/master/ext/pathname' I, [2024-05-07T10:13:23.248932 #3065062] INFO -- : make[2]: Leaving directory '/home/opc/ruby/build/master/ext/pathname' I, [2024-05-07T10:13:23.255410 #3065062] INFO -- : make[2]: Entering directory '/home/opc/ruby/build/master/ext/psych' I, [2024-05-07T10:13:23.277137 #3065062] INFO -- : make[2]: Leaving directory '/home/opc/ruby/build/master/ext/psych' I, [2024-05-07T10:13:23.281729 #3065062] INFO -- : make[2]: Entering directory '/home/opc/ruby/build/master/ext/pty' I, [2024-05-07T10:13:23.285743 #3065062] INFO -- : make[2]: Leaving directory '/home/opc/ruby/build/master/ext/pty' I, [2024-05-07T10:13:23.299109 #3065062] INFO -- : make[2]: Entering directory '/home/opc/ruby/build/master/ext/ripper' I, [2024-05-07T10:13:23.306825 #3065062] INFO -- : make[2]: Leaving directory '/home/opc/ruby/build/master/ext/ripper' I, [2024-05-07T10:13:23.308880 #3065062] INFO -- : make[2]: Entering directory '/home/opc/ruby/build/master/ext/rubyvm' I, [2024-05-07T10:13:23.312331 #3065062] INFO -- : make[2]: Leaving directory '/home/opc/ruby/build/master/ext/rubyvm' I, [2024-05-07T10:13:23.324466 #3065062] INFO -- : make[2]: Entering directory '/home/opc/ruby/build/master/ext/socket' I, [2024-05-07T10:13:23.335120 #3065062] INFO -- : make[2]: Leaving directory '/home/opc/ruby/build/master/ext/socket' I, [2024-05-07T10:13:23.350228 #3065062] INFO -- : make[2]: Entering directory '/home/opc/ruby/build/master/.bundle/gems/bigdecimal-3.1.7/ext/bigdecimal' I, [2024-05-07T10:13:23.380705 #3065062] INFO -- : make[2]: Leaving directory '/home/opc/ruby/build/master/.bundle/gems/bigdecimal-3.1.7/ext/bigdecimal' I, [2024-05-07T10:13:23.383464 #3065062] INFO -- : make[2]: Entering directory '/home/opc/ruby/build/master/.bundle/gems/bigdecimal-3.1.8/ext/bigdecimal' I, [2024-05-07T10:13:23.414159 #3065062] INFO -- : make[2]: Leaving directory '/home/opc/ruby/build/master/.bundle/gems/bigdecimal-3.1.8/ext/bigdecimal' I, [2024-05-07T10:13:23.416950 #3065062] INFO -- : make[2]: Entering directory '/home/opc/ruby/build/master/.bundle/gems/debug-1.9.2/ext/debug' I, [2024-05-07T10:13:23.447375 #3065062] INFO -- : make[2]: Leaving directory '/home/opc/ruby/build/master/.bundle/gems/debug-1.9.2/ext/debug' I, [2024-05-07T10:13:23.449895 #3065062] INFO -- : make[2]: Entering directory '/home/opc/ruby/build/master/.bundle/gems/nkf-0.2.0/ext/nkf' I, [2024-05-07T10:13:23.480797 #3065062] INFO -- : make[2]: Leaving directory '/home/opc/ruby/build/master/.bundle/gems/nkf-0.2.0/ext/nkf' I, [2024-05-07T10:13:23.483253 #3065062] INFO -- : make[2]: Entering directory '/home/opc/ruby/build/master/.bundle/gems/racc-1.7.3/ext/racc/cparse' I, [2024-05-07T10:13:23.514063 #3065062] INFO -- : make[2]: Leaving directory '/home/opc/ruby/build/master/.bundle/gems/racc-1.7.3/ext/racc/cparse' I, [2024-05-07T10:13:23.516964 #3065062] INFO -- : make[2]: Entering directory '/home/opc/ruby/build/master/.bundle/gems/rbs-3.4.4/ext/rbs_extension' I, [2024-05-07T10:13:23.548716 #3065062] INFO -- : make[2]: Leaving directory '/home/opc/ruby/build/master/.bundle/gems/rbs-3.4.4/ext/rbs_extension' I, [2024-05-07T10:13:23.551324 #3065062] INFO -- : make[2]: Entering directory '/home/opc/ruby/build/master/.bundle/gems/syslog-0.1.2/ext/syslog' I, [2024-05-07T10:13:23.581435 #3065062] INFO -- : make[2]: Leaving directory '/home/opc/ruby/build/master/.bundle/gems/syslog-0.1.2/ext/syslog' I, [2024-05-07T10:13:23.619744 #3065062] INFO -- : make[2]: Entering directory '/home/opc/ruby/build/master' I, [2024-05-07T10:13:23.703188 #3065062] INFO -- : make[2]: 'ruby' is up to date. I, [2024-05-07T10:13:23.703262 #3065062] INFO -- : make[2]: Leaving directory '/home/opc/ruby/build/master' I, [2024-05-07T10:13:23.703474 #3065062] INFO -- : make[1]: Leaving directory '/home/opc/ruby/build/master' I, [2024-05-07T10:13:23.707967 #3065062] INFO -- : make[1]: Entering directory '/home/opc/ruby/build/master' I, [2024-05-07T10:13:23.708014 #3065062] INFO -- : make[1]: Nothing to be done for 'note'. I, [2024-05-07T10:13:23.708034 #3065062] INFO -- : make[1]: Leaving directory '/home/opc/ruby/build/master' I, [2024-05-07T10:13:23.820044 #3065062] INFO -- : Run options: I, [2024-05-07T10:13:23.820135 #3065062] INFO -- : --seed=19094 I, [2024-05-07T10:13:23.820155 #3065062] INFO -- : "--ruby=./miniruby -I/home/opc/ruby/src/master/lib -I. -I.ext/common /home/opc/ruby/src/master/tool/runruby.rb --extout=.ext -- --disable-gems" I, [2024-05-07T10:13:23.820172 #3065062] INFO -- : --excludes-dir=/home/opc/ruby/src/master/test/.excludes I, [2024-05-07T10:13:23.820188 #3065062] INFO -- : --name=!/memory_leak/ I, [2024-05-07T10:13:23.820204 #3065062] INFO -- : --stderr-on-failure I, [2024-05-07T10:13:23.820219 #3065062] INFO -- : -j3 I, [2024-05-07T10:13:23.820235 #3065062] INFO -- : I, [2024-05-07T10:13:23.820251 #3065062] INFO -- : # Running tests: I, [2024-05-07T10:13:23.820267 #3065062] INFO -- : I, [2024-05-07T10:13:23.950328 #3065062] INFO -- : [ 1/885] 3105944=test_severity I, [2024-05-07T10:13:23.954720 #3065062] INFO -- : [ 2/885] 3105945=test_case I, [2024-05-07T10:13:23.957245 #3065062] INFO -- : [ 3/885] 3105944=test_ractor I, [2024-05-07T10:13:23.960058 #3065062] INFO -- : [ 4/885] 3105946=test_gem_package_tar_writer I, [2024-05-07T10:13:23.963718 #3065062] INFO -- : [ 5/885] 3105945=test_str2big I, [2024-05-07T10:13:23.967969 #3065062] INFO -- : [ 6/885] 3105945=test_set I, [2024-05-07T10:13:23.991724 #3065062] INFO -- : [ 7/885] 3105944=test_http I, [2024-05-07T10:13:24.002265 #3065062] INFO -- : [ 8/885] 3105945=test_utf16 I, [2024-05-07T10:13:24.077882 #3065062] INFO -- : [ 9/885] 3105945=attribute_write_test I, [2024-05-07T10:13:24.108175 #3065062] INFO -- : [ 10/885] 3105945=test_rdoc_markup_to_rdoc I, [2024-05-07T10:13:24.235126 #3065062] INFO -- : [ 11/885] 3105946=test_argf I, [2024-05-07T10:13:24.290890 #3065062] INFO -- : [ 12/885] 3105945=test_x509name I, [2024-05-07T10:13:24.307673 #3065062] INFO -- : [ 13/885] 3105945=test_yaml I, [2024-05-07T10:13:24.391242 #3065062] INFO -- : [ 14/885] 3105945=test_cclass I, [2024-05-07T10:13:24.519010 #3065062] INFO -- : [ 15/885] 3105945=test_gem_uninstaller I, [2024-05-07T10:13:25.816313 #3065062] INFO -- : [ 16/885] 3105945=test_yjit I, [2024-05-07T10:13:25.828986 #3065062] INFO -- : [ 17/885] 3105945=test_gem_dependency I, [2024-05-07T10:13:25.980923 #3065062] INFO -- : [ 18/885] 3105945=test_m17n I, [2024-05-07T10:13:26.051878 #3065062] INFO -- : [ 19/885] 3105945=test_method I, [2024-05-07T10:13:27.844218 #3065062] INFO -- : [ 20/885] 3105946=test_filter I, [2024-05-07T10:13:27.880878 #3065062] INFO -- : [ 21/885] 3105946=test_parser_events I, [2024-05-07T10:13:28.056452 #3065062] INFO -- : [ 22/885] 3105946=test_pkcs12 I, [2024-05-07T10:13:28.681202 #3065062] INFO -- : [ 23/885] 3105946=test_gem_remote_fetcher I, [2024-05-07T10:13:29.494765 #3065062] INFO -- : [ 24/885] 3105945=test_koi8 I, [2024-05-07T10:13:29.502263 #3065062] INFO -- : [ 25/885] 3105945=test_json_tree I, [2024-05-07T10:13:29.511200 #3065062] INFO -- : [ 26/885] 3105945=test_pty I, [2024-05-07T10:13:29.514268 #3065062] INFO -- : Leaked file descriptor: TestPTY#test_open_with_block: 8 # I, [2024-05-07T10:13:29.546016 #3065062] INFO -- : COMMAND PID USER FD TYPE DEVICE SIZE/OFF NODE NAME I, [2024-05-07T10:13:29.546232 #3065062] INFO -- : ruby 3105945 opc 8r REG 252,0 6940392 13705429 /var/lib/sss/mc/group I, [2024-05-07T10:13:30.057248 #3065062] INFO -- : [ 27/885] 3105945=test_gem_dependency_installer I, [2024-05-07T10:13:30.486544 #3065062] INFO -- : [ 28/885] 3105946=test_http I, [2024-05-07T10:13:30.508742 #3065062] INFO -- : [ 29/885] 3105946=test_hash I, [2024-05-07T10:13:32.200563 #3065062] INFO -- : [ 30/885] 3105945=parser_test I, [2024-05-07T10:13:32.208093 #3065062] INFO -- : [ 31/885] 3105945=encoding_test I, [2024-05-07T10:13:32.275269 #3065062] INFO -- : [ 32/885] 3105945=test_gem_commands_specification_command I, [2024-05-07T10:13:32.415092 #3065062] INFO -- : [ 33/885] 3105945=test_scan_args I, [2024-05-07T10:13:32.430126 #3065062] INFO -- : [ 34/885] 3105945=test_gem_request I, [2024-05-07T10:13:32.624482 #3065062] INFO -- : [ 35/885] 3105944=test_gem_commands_which_command I, [2024-05-07T10:13:32.669840 #3065062] INFO -- : [ 36/885] 3105945=test_gem_package_old I, [2024-05-07T10:13:32.745840 #3065062] INFO -- : [ 37/885] 3105945=test_gem_commands_push_command I, [2024-05-07T10:13:32.812826 #3065062] INFO -- : [ 38/885] 3105944=locals_test I, [2024-05-07T10:13:33.301609 #3065062] INFO -- : [ 39/885] 3105944=test_too_many_dummy_encodings I, [2024-05-07T10:13:33.358319 #3065062] INFO -- : [ 40/885] 3105944=test_method_cache I, [2024-05-07T10:13:33.367637 #3065062] INFO -- : [ 41/885] 3105944=test_sprintf_comb I, [2024-05-07T10:13:33.387124 #3065062] INFO -- : [ 42/885] 3105945=test_rendering I, [2024-05-07T10:13:33.463543 #3065062] INFO -- : [ 43/885] 3105945=test_win32ole I, [2024-05-07T10:13:33.468740 #3065062] INFO -- : [ 44/885] 3105945=test_internal_ivar I, [2024-05-07T10:13:33.475355 #3065062] INFO -- : [ 45/885] 3105945=test_gem_source_local I, [2024-05-07T10:13:33.529201 #3065062] INFO -- : [ 46/885] 3105944=desugar_compiler_test I, [2024-05-07T10:13:33.532436 #3065062] INFO -- : [ 47/885] 3105944=test_gem_gemcutter_utilities I, [2024-05-07T10:13:33.573079 #3065062] INFO -- : [ 48/885] 3105946=test_rdoc_task I, [2024-05-07T10:13:33.582176 #3065062] INFO -- : [ 49/885] 3105946=test_backtrace I, [2024-05-07T10:13:33.779823 #3065062] INFO -- : [ 50/885] 3105945=test_tracepoint I, [2024-05-07T10:13:33.992339 #3065062] INFO -- : [ 51/885] 3105945=test_gem_text I, [2024-05-07T10:13:33.999499 #3065062] INFO -- : [ 52/885] 3105944=test_settracefunc I, [2024-05-07T10:13:34.072250 #3065062] INFO -- : [ 53/885] 3105945=test_framework I, [2024-05-07T10:13:34.076281 #3065062] INFO -- : [ 54/885] 3105945=test_inadvertent_creation I, [2024-05-07T10:13:34.206384 #3065062] INFO -- : [ 55/885] 3105945=test_ansi_with_terminfo I, [2024-05-07T10:13:34.216525 #3065062] INFO -- : [ 56/885] 3105945=test_coderange I, [2024-05-07T10:13:34.223523 #3065062] INFO -- : [ 57/885] 3105945=test_weakmap I, [2024-05-07T10:13:34.822725 #3065062] INFO -- : [ 58/885] 3105944=test_pack I, [2024-05-07T10:13:34.842948 #3065062] INFO -- : [ 59/885] 3105944=test_cgi_tag_helper I, [2024-05-07T10:13:34.855157 #3065062] INFO -- : [ 60/885] 3105946=test_pinned I, [2024-05-07T10:13:34.875053 #3065062] INFO -- : [ 61/885] 3105944=test_rdoc_generator_json_index I, [2024-05-07T10:13:34.892442 #3065062] INFO -- : [ 62/885] 3105946=test_nil2vtempty I, [2024-05-07T10:13:34.904780 #3065062] INFO -- : [ 63/885] 3105946=test_date_time I, [2024-05-07T10:13:34.960057 #3065062] INFO -- : [ 64/885] 3105946=test_open-uri I, [2024-05-07T10:13:35.090242 #3065062] INFO -- : [ 65/885] 3105944=test_case I, [2024-05-07T10:13:35.154422 #3065062] INFO -- : [ 66/885] 3105944=test_enumerator I, [2024-05-07T10:13:35.295135 #3065062] INFO -- : [ 67/885] 3105946=test_enc_associate I, [2024-05-07T10:13:35.924400 #3065062] INFO -- : [ 68/885] 3105946=test_rdoc_context I, [2024-05-07T10:13:36.648217 #3065062] INFO -- : [ 69/885] 3105946=test_gem_command_manager I, [2024-05-07T10:13:36.831701 #3065062] INFO -- : [ 70/885] 3105946=test_array I, [2024-05-07T10:13:36.896373 #3065062] INFO -- : [ 71/885] 3105946=comments_test I, [2024-05-07T10:13:36.900162 #3065062] INFO -- : [ 72/885] 3105946=test_qsort I, [2024-05-07T10:13:36.903533 #3065062] INFO -- : [ 73/885] 3105946=test_gc I, [2024-05-07T10:13:36.914440 #3065062] INFO -- : [ 74/885] 3105946=test_math I, [2024-05-07T10:13:36.956378 #3065062] INFO -- : [ 75/885] 3105946=test_libs I, [2024-05-07T10:13:36.971853 #3065062] INFO -- : [ 76/885] 3105946=test_iso_8859 I, [2024-05-07T10:13:37.058051 #3065062] INFO -- : [ 77/885] 3105946=ripper_test I, [2024-05-07T10:13:37.690480 #3065062] INFO -- : [ 78/885] 3105946=test_safe_load I, [2024-05-07T10:13:37.706532 #3065062] INFO -- : [ 79/885] 3105946=test_sprintf I, [2024-05-07T10:13:37.913170 #3065062] INFO -- : [ 80/885] 3105946=test_name_error I, [2024-05-07T10:13:38.004087 #3065062] INFO -- : [ 81/885] 3105946=test_gem_source_list I, [2024-05-07T10:13:38.086012 #3065062] INFO -- : [ 82/885] 3105946=json_addition_test I, [2024-05-07T10:13:38.099096 #3065062] INFO -- : [ 83/885] 3105946=test_gem_commands_sources_command I, [2024-05-07T10:13:38.324068 #3065062] INFO -- : [ 84/885] 3105946=test_yaml_special_cases I, [2024-05-07T10:13:38.333028 #3065062] INFO -- : [ 85/885] 3105946=test_recorder I, [2024-05-07T10:13:38.338117 #3065062] INFO -- : [ 86/885] 3105946=test_const I, [2024-05-07T10:13:38.343952 #3065062] INFO -- : [ 87/885] 3105946=index_write_test I, [2024-05-07T10:13:38.353129 #3065062] INFO -- : [ 88/885] 3105946=test_rdoc_parser_rd I, [2024-05-07T10:13:38.410968 #3065062] INFO -- : [ 89/885] 3105946=test_class I, [2024-05-07T10:13:38.887392 #3065062] INFO -- : [ 90/885] 3105945=test_exit I, [2024-05-07T10:13:38.911586 #3065062] INFO -- : [ 91/885] 3105945=test_gem_specification I, [2024-05-07T10:13:41.330260 #3065062] INFO -- : [ 92/885] 3105945=test_pkey_rsa I, [2024-05-07T10:13:41.618398 #3065062] INFO -- : [ 93/885] 3105945=test_flush I, [2024-05-07T10:13:41.624403 #3065062] INFO -- : [ 94/885] 3105945=test_numhash I, [2024-05-07T10:13:42.206145 #3065062] INFO -- : [ 95/885] 3105945=test_system I, [2024-05-07T10:13:42.578132 #3065062] INFO -- : [ 96/885] 3105945=test_rdoc_class_module I, [2024-05-07T10:13:43.120129 #3065062] INFO -- : [ 97/885] 3105945=test_rdoc_cross_reference I, [2024-05-07T10:13:43.554198 #3065062] INFO -- : [ 98/885] 3105945=test_parse I, [2024-05-07T10:13:44.020050 #3065062] INFO -- : [ 99/885] 3105945=test_method_cache I, [2024-05-07T10:13:44.023286 #3065062] INFO -- : [100/885] 3105945=test_win32ole_variable I, [2024-05-07T10:13:44.026965 #3065062] INFO -- : [101/885] 3105945=test_condition I, [2024-05-07T10:13:44.040447 #3065062] INFO -- : [102/885] 3105945=test_gem_resolver_vendor_set I, [2024-05-07T10:13:44.072410 #3065062] INFO -- : [103/885] 3105945=test_cp949 I, [2024-05-07T10:13:44.081528 #3065062] INFO -- : [104/885] 3105945=test_jaro_winkler I, [2024-05-07T10:13:44.085619 #3065062] INFO -- : [105/885] 3105945=test_mixed_unicode_escapes I, [2024-05-07T10:13:44.132475 #3065062] INFO -- : [106/885] 3105945=test_sleep I, [2024-05-07T10:13:45.307414 #3065062] INFO -- : [107/885] 3105946=test_fileutils I, [2024-05-07T10:13:45.677527 #3065062] INFO -- : Leaked file descriptor: TestFileUtils#test_chown_error: 11 # I, [2024-05-07T10:13:45.701420 #3065062] INFO -- : COMMAND PID USER FD TYPE DEVICE SIZE/OFF NODE NAME I, [2024-05-07T10:13:45.701492 #3065062] INFO -- : ruby 3105946 opc 11r REG 252,0 9253600 13705411 /var/lib/sss/mc/passwd I, [2024-05-07T10:13:45.848303 #3065062] INFO -- : [108/885] 3105946=test_gem_dependency_resolution_error I, [2024-05-07T10:13:45.853520 #3065062] INFO -- : [109/885] 3105946=test_windows_1252 I, [2024-05-07T10:13:46.038251 #3065062] INFO -- : [110/885] 3105946=test_stack I, [2024-05-07T10:13:46.206053 #3065062] INFO -- : [111/885] 3105945=test_sorted_set I, [2024-05-07T10:13:46.350850 #3065062] INFO -- : [112/885] 3105945=test_emoji I, [2024-05-07T10:13:46.373746 #3065062] INFO -- : [113/885] 3105945=test_date_attr I, [2024-05-07T10:13:46.416845 #3065062] INFO -- : [114/885] 3105945=test_sizeof I, [2024-05-07T10:13:46.537839 #3065062] INFO -- : [115/885] 3105944=test_gem_request_set_lockfile_parser I, [2024-05-07T10:13:46.708334 #3065062] INFO -- : [116/885] 3105944=test_face I, [2024-05-07T10:13:46.739627 #3065062] INFO -- : [117/885] 3105944=warnings_test I, [2024-05-07T10:13:46.752021 #3065062] INFO -- : [118/885] 3105944=test_stringchar I, [2024-05-07T10:13:46.845084 #3065062] INFO -- : [119/885] 3105944=test_econv I, [2024-05-07T10:13:46.887302 #3065062] INFO -- : [120/885] 3105946=test_gem_install_update_options I, [2024-05-07T10:13:47.074275 #3065062] INFO -- : [121/885] 3105946=test_utf32 I, [2024-05-07T10:13:47.085895 #3065062] INFO -- : [122/885] 3105946=test_gem_resolver_git_specification I, [2024-05-07T10:13:47.393856 #3065062] INFO -- : [123/885] 3105946=test_basicinstructions I, [2024-05-07T10:13:47.458987 #3065062] INFO -- : [124/885] 3105946=test_erb I, [2024-05-07T10:13:47.669207 #3065062] INFO -- : [125/885] 3105946=test_date_ractor I, [2024-05-07T10:13:47.731055 #3065062] INFO -- : [126/885] 3105944=test_key_actor_emacs I, [2024-05-07T10:13:47.746015 #3065062] INFO -- : [127/885] 3105946=test_gem_security I, [2024-05-07T10:13:47.876819 #3065062] INFO -- : [128/885] 3105944=test_hash I, [2024-05-07T10:13:47.965949 #3065062] INFO -- : [129/885] 3105944=test_variable I, [2024-05-07T10:13:48.019262 #3065062] INFO -- : [130/885] 3105944=test_gem_commands_pristine_command I, [2024-05-07T10:13:48.884713 #3065062] INFO -- : [131/885] 3105945=test_optarg I, [2024-05-07T10:13:48.946755 #3065062] INFO -- : [132/885] 3105945=test_rdoc_tom_doc I, [2024-05-07T10:13:48.970209 #3065062] INFO -- : [133/885] 3105945=test_pp I, [2024-05-07T10:13:49.002718 #3065062] INFO -- : .Leaked file descriptor: PPTestModule::PPFileStatTest#test_nothing_raised: 10 # I, [2024-05-07T10:13:49.028721 #3065062] INFO -- : COMMAND PID USER FD TYPE DEVICE SIZE/OFF NODE NAME I, [2024-05-07T10:13:49.028797 #3065062] INFO -- : ruby 3105945 opc 10r REG 252,0 9253600 13705411 /var/lib/sss/mc/passwd I, [2024-05-07T10:13:49.073825 #3065062] INFO -- : [134/885] 3105945=test_gem_impossible_dependencies_error I, [2024-05-07T10:13:49.081053 #3065062] INFO -- : [135/885] 3105945=test_raise_exception I, [2024-05-07T10:13:49.422385 #3065062] INFO -- : [136/885] 3105944=test_arith_seq_beg_len_step I, [2024-05-07T10:13:49.472265 #3065062] INFO -- : [137/885] 3105944=test_exception I, [2024-05-07T10:13:49.483376 #3065062] INFO -- : [138/885] 3105944=test_noarg I, [2024-05-07T10:13:49.655140 #3065062] INFO -- : [139/885] 3105944=test_gem_resolver_requirement_list I, [2024-05-07T10:13:49.659964 #3065062] INFO -- : [140/885] 3105945=memsize_test I, [2024-05-07T10:13:49.662219 #3065062] INFO -- : [141/885] 3105945=test_rdoc_generator_darkfish I, [2024-05-07T10:13:49.669928 #3065062] INFO -- : [142/885] 3105944=test_gem_resolver_lock_set I, [2024-05-07T10:13:49.702958 #3065062] INFO -- : [143/885] 3105944=test_random I, [2024-05-07T10:13:49.707014 #3065062] INFO -- : [144/885] 3105944=test_undef I, [2024-05-07T10:13:49.716746 #3065062] INFO -- : [145/885] 3105944=test_gem_command I, [2024-05-07T10:13:49.832949 #3065062] INFO -- : [146/885] 3105944=test_asn1 I, [2024-05-07T10:13:49.836351 #3065062] INFO -- : [147/885] 3105944=test_normalize I, [2024-05-07T10:13:49.840775 #3065062] INFO -- : [148/885] 3105944=test_emoji_breaks I, [2024-05-07T10:13:49.845827 #3065062] INFO -- : [149/885] 3105944=test_verbose I, [2024-05-07T10:13:49.881774 #3065062] INFO -- : [150/885] 3105944=test_gem_commands_open_command I, [2024-05-07T10:13:49.984036 #3065062] INFO -- : [151/885] 3105944=test_assignment I, [2024-05-07T10:13:50.024092 #3065062] INFO -- : [152/885] 3105945=test_gem_update_suggestion I, [2024-05-07T10:13:50.141961 #3065062] INFO -- : [153/885] 3105945=!Nothing_to_test I, [2024-05-07T10:13:50.152407 #3065062] INFO -- : [154/885] 3105945=test_process I, [2024-05-07T10:13:50.179656 #3065062] INFO -- : [155/885] 3105945=test_forwardable I, [2024-05-07T10:13:50.193827 #3065062] INFO -- : [156/885] 3105945=test_fd_setsize I, [2024-05-07T10:13:50.303003 #3065062] INFO -- : [157/885] 3105945=test_dir_m17n I, [2024-05-07T10:13:51.323491 #3065062] INFO -- : [158/885] 3105944=test_memory_view I, [2024-05-07T10:13:51.370919 #3065062] INFO -- : [159/885] 3105945=test_array_create I, [2024-05-07T10:13:51.393257 #3065062] INFO -- : [160/885] 3105945=test_complex I, [2024-05-07T10:13:51.516658 #3065062] INFO -- : [161/885] 3105945=test_threadgroup I, [2024-05-07T10:13:51.518824 #3065062] INFO -- : [162/885] 3105944=test_shapes I, [2024-05-07T10:13:51.529831 #3065062] INFO -- : [163/885] 3105944=test_did_you_mean I, [2024-05-07T10:13:51.600827 #3065062] INFO -- : [164/885] 3105944=test_rdoc_extend I, [2024-05-07T10:13:51.617899 #3065062] INFO -- : [165/885] 3105944=test_cesu8 I, [2024-05-07T10:13:51.629407 #3065062] INFO -- : [166/885] 3105944=test_method_name_check I, [2024-05-07T10:13:51.664764 #3065062] INFO -- : [167/885] 3105944=test_err_in_callback I, [2024-05-07T10:13:51.669889 #3065062] INFO -- : [168/885] 3105944=test_storage I, [2024-05-07T10:13:51.676787 #3065062] INFO -- : [169/885] 3105944=test_merge_keys I, [2024-05-07T10:13:51.685501 #3065062] INFO -- : [170/885] 3105944=test_iterator I, [2024-05-07T10:13:51.741230 #3065062] INFO -- : [171/885] 3105944=test_string I, [2024-05-07T10:13:51.766191 #3065062] INFO -- : [172/885] 3105944=test_gem_commands_install_command I, [2024-05-07T10:13:52.536753 #3065062] INFO -- : [173/885] 3105945=test_kernel I, [2024-05-07T10:13:53.168807 #3065062] INFO -- : [174/885] 3105945=test_rendering I, [2024-05-07T10:13:53.204099 #3065062] INFO -- : [175/885] 3105945=test_gem_rdoc I, [2024-05-07T10:13:53.360720 #3065062] INFO -- : [176/885] 3105945=test_dot_dot I, [2024-05-07T10:13:53.365903 #3065062] INFO -- : [177/885] 3105945=pattern_test I, [2024-05-07T10:13:53.393719 #3065062] INFO -- : [178/885] 3105945=test_gem_spec_fetcher I, [2024-05-07T10:13:53.477741 #3065062] INFO -- : [179/885] 3105944=test_yamldbm I, [2024-05-07T10:13:53.478764 #3065062] INFO -- : [180/885] 3105944=test_switch_hitter I, [2024-05-07T10:13:53.504992 #3065062] INFO -- : [181/885] 3105944=test_default_gems I, [2024-05-07T10:13:53.560180 #3065062] INFO -- : [182/885] 3105944=test_unicode_escape I, [2024-05-07T10:13:53.596947 #3065062] INFO -- : [183/885] 3105945=test_gbk I, [2024-05-07T10:13:53.601171 #3065062] INFO -- : [184/885] 3105945=test_backtrace I, [2024-05-07T10:13:53.616233 #3065062] INFO -- : [185/885] 3105945=test_gem_commands_dependency_command I, [2024-05-07T10:13:53.629597 #3065062] INFO -- : [186/885] 3105944=test_set I, [2024-05-07T10:13:53.667318 #3065062] INFO -- : [187/885] 3105944=test_rdoc_method_attr I, [2024-05-07T10:13:53.707830 #3065062] INFO -- : [188/885] 3105945=test_enumerable I, [2024-05-07T10:13:53.716777 #3065062] INFO -- : [189/885] 3105945=static_literals_test I, [2024-05-07T10:13:53.728708 #3065062] INFO -- : [190/885] 3105945=test_tree_spell_checker I, [2024-05-07T10:13:53.756060 #3065062] INFO -- : [191/885] 3105945=test_hash_create I, [2024-05-07T10:13:53.762817 #3065062] INFO -- : [192/885] 3105945=test_grapheme_breaks I, [2024-05-07T10:13:53.816262 #3065062] INFO -- : [193/885] 3105944=test_gem_ext_cargo_builder_unit I, [2024-05-07T10:13:53.818959 #3065062] INFO -- : [194/885] 3105945=test_case_mapping I, [2024-05-07T10:13:53.835364 #3065062] INFO -- : [195/885] 3105945=test_rational I, [2024-05-07T10:13:53.845110 #3065062] INFO -- : [196/885] 3105944=test_gem_resolver_api_specification I, [2024-05-07T10:13:53.869532 #3065062] INFO -- : [197/885] 3105945=test_rdoc_rubygems_hook I, [2024-05-07T10:13:53.886532 #3065062] INFO -- : [198/885] 3105944=test_ractor I, [2024-05-07T10:13:53.904939 #3065062] INFO -- : [199/885] 3105944=test_webauthn_listener I, [2024-05-07T10:13:53.950162 #3065062] INFO -- : [200/885] 3105945=test_key_event_record I, [2024-05-07T10:13:53.950232 #3065062] INFO -- : [201/885] 3105945=test_date_parse I, [2024-05-07T10:13:53.951480 #3065062] INFO -- : Leaked file descriptor: WebauthnListenerTest#test_wait_for_otp_code_options_request: 10 : # I, [2024-05-07T10:13:53.986534 #3065062] INFO -- : COMMAND PID USER FD TYPE DEVICE SIZE/OFF NODE NAME I, [2024-05-07T10:13:53.986608 #3065062] INFO -- : ruby 3105944 opc 10u IPv4 2878378602 0t0 TCP localhost:46153->localhost:46766 (CLOSE_WAIT) I, [2024-05-07T10:13:54.069527 #3065062] INFO -- : [202/885] 3105944=test_open3 I, [2024-05-07T10:13:54.088511 #3065062] INFO -- : [203/885] 3105945=test_mdns I, [2024-05-07T10:13:54.093192 #3065062] INFO -- : [204/885] 3105945=test_thread I, [2024-05-07T10:13:54.102618 #3065062] INFO -- : [205/885] 3105945=test_arity I, [2024-05-07T10:13:54.113307 #3065062] INFO -- : [206/885] 3105945=test_buffering I, [2024-05-07T10:13:54.122462 #3065062] INFO -- : [207/885] 3105945=test_svcb_https I, [2024-05-07T10:13:54.128869 #3065062] INFO -- : [208/885] 3105945=test_pkey_ec I, [2024-05-07T10:13:54.193804 #3065062] INFO -- : [209/885] 3105945=test_rubyoptions I, [2024-05-07T10:13:55.152909 #3065062] INFO -- : Closed file descriptor: TestOpen3#test_pipeline_r: 10 I, [2024-05-07T10:13:56.754028 #3065062] INFO -- : [210/885] 3105944=test_data_error I, [2024-05-07T10:13:56.785716 #3065062] INFO -- : [211/885] 3105946=test_rdoc_stats I, [2024-05-07T10:13:56.815108 #3065062] INFO -- : [212/885] 3105944=test_files_sample I, [2024-05-07T10:13:56.857554 #3065062] INFO -- : [213/885] 3105946=test_force_exit I, [2024-05-07T10:13:56.905487 #3065062] INFO -- : [214/885] 3105944=test_optimization I, [2024-05-07T10:13:56.947983 #3065062] INFO -- : [215/885] 3105946=test_rdoc_store I, [2024-05-07T10:13:57.621447 #3065062] INFO -- : [216/885] 3105946=test_shift_jis I, [2024-05-07T10:13:57.636212 #3065062] INFO -- : [217/885] 3105946=regexp_test I, [2024-05-07T10:13:57.672093 #3065062] INFO -- : [218/885] 3105946=test_show_source I, [2024-05-07T10:13:57.679715 #3065062] INFO -- : [219/885] 3105946=test_remote_fetch_error I, [2024-05-07T10:13:57.698952 #3065062] INFO -- : [220/885] 3105946=test_yield I, [2024-05-07T10:14:00.354579 #3065062] INFO -- : [221/885] 3105946=test_queue I, [2024-05-07T10:14:00.362669 #3065062] INFO -- : [222/885] 3105946=test_boolean I, [2024-05-07T10:14:00.370849 #3065062] INFO -- : [223/885] 3105946=test_gem_resolver_lock_specification I, [2024-05-07T10:14:00.414855 #3065062] INFO -- : [224/885] 3105946=test_dryrun I, [2024-05-07T10:14:00.441875 #3065062] INFO -- : [225/885] 3105946=test_rdoc_i18n_locale I, [2024-05-07T10:14:00.492607 #3065062] INFO -- : [226/885] 3105946=test_gc_compact I, [2024-05-07T10:14:00.747173 #3065062] INFO -- : [227/885] 3105945=test_prettyprint I, [2024-05-07T10:14:00.769529 #3065062] INFO -- : [228/885] 3105945=test_gem_uri_formatter I, [2024-05-07T10:14:00.799169 #3065062] INFO -- : [229/885] 3105945=test_cgi_util I, [2024-05-07T10:14:01.051240 #3065062] INFO -- : [230/885] 3105945=test_ole_methods I, [2024-05-07T10:14:01.212202 #3065062] INFO -- : [231/885] 3105945=test_clone I, [2024-05-07T10:14:01.219572 #3065062] INFO -- : [232/885] 3105945=test_enc_raise I, [2024-05-07T10:14:01.223410 #3065062] INFO -- : [233/885] 3105945=ruby_parser_test I, [2024-05-07T10:14:01.237384 #3065062] INFO -- : [234/885] 3105945=test_gem_commands_stale_command I, [2024-05-07T10:14:01.262921 #3065062] INFO -- : [235/885] 3105945=json_parser_test I, [2024-05-07T10:14:01.341769 #3065062] INFO -- : [236/885] 3105945=test_date_strftime I, [2024-05-07T10:14:01.728482 #3065062] INFO -- : [237/885] 3105945=test_ws I, [2024-05-07T10:14:01.737880 #3065062] INFO -- : [238/885] 3105945=test_rdoc_markup_to_tt_only I, [2024-05-07T10:14:01.790788 #3065062] INFO -- : [239/885] 3105945=test_gem_commands_cert_command I, [2024-05-07T10:14:02.542489 #3065062] INFO -- : [240/885] 3105945=test_numeric I, [2024-05-07T10:14:02.594406 #3065062] INFO -- : [241/885] 3105945=test_fstring I, [2024-05-07T10:14:02.681207 #3065062] INFO -- : [242/885] 3105945=test_singleton I, [2024-05-07T10:14:02.685141 #3065062] INFO -- : [243/885] 3105945=test_word I, [2024-05-07T10:14:02.697479 #3065062] INFO -- : [244/885] 3105945=test_rdoc_require I, [2024-05-07T10:14:02.704690 #3065062] INFO -- : [245/885] 3105945=test_gem_ext_rake_builder I, [2024-05-07T10:14:03.258651 #3065062] INFO -- : [246/885] 3105946=test_rdoc_markup_raw I, [2024-05-07T10:14:03.268740 #3065062] INFO -- : [247/885] 3105946=test_rdoc_markup_to_bs I, [2024-05-07T10:14:03.328609 #3065062] INFO -- : [248/885] 3105946=test_key_name_check I, [2024-05-07T10:14:03.338037 #3065062] INFO -- : [249/885] 3105946=test_timeout I, [2024-05-07T10:14:03.348779 #3065062] INFO -- : [250/885] 3105945=test_rdoc_alias I, [2024-05-07T10:14:03.404792 #3065062] INFO -- : [251/885] 3105945=test_instrumentation_api I, [2024-05-07T10:14:03.507976 #3065062] INFO -- : [252/885] 3105944=test_weakref I, [2024-05-07T10:14:03.654991 #3065062] INFO -- : [253/885] 3105944=test_deprecated I, [2024-05-07T10:14:03.731193 #3065062] INFO -- : [254/885] 3105944=test_io_buffer I, [2024-05-07T10:14:03.772867 #3065062] INFO -- : [255/885] 3105944=test_rdoc_context_section I, [2024-05-07T10:14:03.778583 #3065062] INFO -- : [256/885] 3105944=test_optparse I, [2024-05-07T10:14:03.796769 #3065062] INFO -- : [257/885] 3105944=test_exception I, [2024-05-07T10:14:04.270144 #3065062] INFO -- : [258/885] 3105946=test_bash_completion I, [2024-05-07T10:14:04.288233 #3065062] INFO -- : [259/885] 3105946=test_div I, [2024-05-07T10:14:04.361078 #3065062] INFO -- : [260/885] 3105946=test_files_test_2 I, [2024-05-07T10:14:06.315928 #3065062] INFO -- : [261/885] 3105944=test_rdoc_markup_to_html_crossref I, [2024-05-07T10:14:06.320904 #3065062] INFO -- : [262/885] 3105945=test_scalar I, [2024-05-07T10:14:06.328046 #3065062] INFO -- : [263/885] 3105945=test_syntax I, [2024-05-07T10:14:06.608311 #3065062] INFO -- : [264/885] 3105944=test_class_name_check I, [2024-05-07T10:14:06.678086 #3065062] INFO -- : [265/885] 3105944=test_basicsocket I, [2024-05-07T10:14:06.690857 #3065062] INFO -- : [266/885] 3105944=test_zsh_completion I, [2024-05-07T10:14:06.707247 #3065062] INFO -- : [267/885] 3105944=test_pkcs7 I, [2024-05-07T10:14:06.860515 #3065062] INFO -- : [268/885] 3105944=test_gem_commands_environment_command I, [2024-05-07T10:14:06.922982 #3065062] INFO -- : [269/885] 3105944=test_pack I, [2024-05-07T10:14:07.076860 #3065062] INFO -- : [270/885] 3105946=test_literal I, [2024-05-07T10:14:07.102547 #3065062] INFO -- : [271/885] 3105944=test_gem_unsatisfiable_dependency_error I, [2024-05-07T10:14:07.153787 #3065062] INFO -- : [272/885] 3105944=test_thread I, [2024-05-07T10:14:07.356732 #3065062] INFO -- : [273/885] 3105944=test_gem_util I, [2024-05-07T10:14:07.527575 #3065062] INFO -- : [274/885] 3105944=test_complex2 I, [2024-05-07T10:14:07.536720 #3065062] INFO -- : [275/885] 3105944=test_config I, [2024-05-07T10:14:07.593558 #3065062] INFO -- : [276/885] 3105944=test_gem_security_signer I, [2024-05-07T10:14:07.647876 #3065062] INFO -- : [277/885] 3105946=test_input_method I, [2024-05-07T10:14:07.678520 #3065062] INFO -- : [278/885] 3105946=test_io I, [2024-05-07T10:14:07.695292 #3065062] INFO -- : [279/885] 3105944=test_rdoc_i18n_text I, [2024-05-07T10:14:07.754655 #3065062] INFO -- : [280/885] 3105944=test_ractor I, [2024-05-07T10:14:07.759197 #3065062] INFO -- : [281/885] 3105944=test_null I, [2024-05-07T10:14:07.766293 #3065062] INFO -- : [282/885] 3105944=test_memory_view I, [2024-05-07T10:14:07.794553 #3065062] INFO -- : [283/885] 3105944=test_data I, [2024-05-07T10:14:07.802166 #3065062] INFO -- : [284/885] 3105944=test_pkey_dh I, [2024-05-07T10:14:07.894143 #3065062] INFO -- : [285/885] 3105946=test_multi_irb_commands I, [2024-05-07T10:14:07.907880 #3065062] INFO -- : [286/885] 3105946=test_m17n_comb I, [2024-05-07T10:14:09.112073 #3065062] INFO -- : [287/885] 3105944=test_win32ole_typelib I, [2024-05-07T10:14:09.116754 #3065062] INFO -- : [288/885] 3105944=test_external_new I, [2024-05-07T10:14:09.122585 #3065062] INFO -- : [289/885] 3105944=test_pkey I, [2024-05-07T10:14:09.132024 #3065062] INFO -- : [290/885] 3105944=test_bigzero I, [2024-05-07T10:14:09.139914 #3065062] INFO -- : [291/885] 3105944=test_gem_platform I, [2024-05-07T10:14:09.256043 #3065062] INFO -- : [292/885] 3105944=test_gem_commands_query_command I, [2024-05-07T10:14:09.909932 #3065062] INFO -- : [293/885] 3105944=redundant_return_test I, [2024-05-07T10:14:09.918572 #3065062] INFO -- : [294/885] 3105944=test_string_processing I, [2024-05-07T10:14:09.919105 #3065062] INFO -- : [295/885] 3105944=test_random_formatter I, [2024-05-07T10:14:09.975817 #3065062] INFO -- : [296/885] 3105944=test_rand I, [2024-05-07T10:14:10.175665 #3065062] INFO -- : [297/885] 3105946=test_rdoc_markup_attributes I, [2024-05-07T10:14:10.192172 #3065062] INFO -- : [298/885] 3105946=test_rdoc_code_object I, [2024-05-07T10:14:10.290188 #3065062] INFO -- : [299/885] 3105944=test_process I, [2024-05-07T10:14:10.508164 #3065062] INFO -- : [300/885] 3105946=test_euc_kr I, [2024-05-07T10:14:10.510369 #3065062] INFO -- : [301/885] 3105946=test_provider I, [2024-05-07T10:14:10.525247 #3065062] INFO -- : [302/885] 3105946=test_gem_source_specific_file I, [2024-05-07T10:14:10.622559 #3065062] INFO -- : [303/885] 3105946=test_bmethod I, [2024-05-07T10:14:10.629950 #3065062] INFO -- : [304/885] 3105946=json_fixtures_test I, [2024-05-07T10:14:10.639807 #3065062] INFO -- : [305/885] 3105946=test_gem_doctor I, [2024-05-07T10:14:10.694460 #3065062] INFO -- : [306/885] 3105946=test_len I, [2024-05-07T10:14:10.701005 #3065062] INFO -- : [307/885] 3105946=test_io_wait I, [2024-05-07T10:14:11.043073 #3065062] INFO -- : [308/885] 3105946=test_pack I, [2024-05-07T10:14:11.252640 #3065062] INFO -- : [309/885] 3105946=test_rdoc_parser_c I, [2024-05-07T10:14:11.535470 #3065062] INFO -- : [310/885] 3105946=test_kwargs I, [2024-05-07T10:14:11.536725 #3065062] INFO -- : [311/885] 3105946=parse_test I, [2024-05-07T10:14:13.710797 #3065062] INFO -- : [312/885] 3105945=test_typeddata I, [2024-05-07T10:14:13.945852 #3065062] INFO -- : [313/885] 3105945=test_gem_commands_fetch_command I, [2024-05-07T10:14:14.129771 #3065062] INFO -- : [314/885] 3105945=test_tsort I, [2024-05-07T10:14:14.138032 #3065062] INFO -- : [315/885] 3105945=test_securerandom I, [2024-05-07T10:14:14.183731 #3065062] INFO -- : [316/885] 3105945=test_gem_dependency_list I, [2024-05-07T10:14:14.251449 #3065062] INFO -- : [317/885] 3105946=test_gem_commands_outdated_command I, [2024-05-07T10:14:14.304060 #3065062] INFO -- : [318/885] 3105945=test_rdoc_parser_changelog I, [2024-05-07T10:14:14.314082 #3065062] INFO -- : [319/885] 3105946=parameters_signature_test I, [2024-05-07T10:14:14.327188 #3065062] INFO -- : [320/885] 3105946=test_stringify_symbols I, [2024-05-07T10:14:14.343611 #3065062] INFO -- : [321/885] 3105946=test_require I, [2024-05-07T10:14:14.351993 #3065062] INFO -- : [322/885] 3105946=test_objspace I, [2024-05-07T10:14:14.365175 #3065062] INFO -- : [323/885] 3105945=test_rdoc_text I, [2024-05-07T10:14:14.410713 #3065062] INFO -- : [324/885] 3105945=library_symbols_test I, [2024-05-07T10:14:14.523388 #3065062] INFO -- : [325/885] 3105945=test_iseq_load I, [2024-05-07T10:14:14.702436 #3065062] INFO -- : Leaked file descriptor: TestProcess#test_seteuid_name: 8 # I, [2024-05-07T10:14:14.729045 #3065062] INFO -- : COMMAND PID USER FD TYPE DEVICE SIZE/OFF NODE NAME I, [2024-05-07T10:14:14.729116 #3065062] INFO -- : ruby 3105944 opc 8r REG 252,0 9253600 13705411 /var/lib/sss/mc/passwd I, [2024-05-07T10:14:15.553921 #3065062] INFO -- : [326/885] 3105945=test_rdoc_markup_parser I, [2024-05-07T10:14:15.602111 #3065062] INFO -- : [327/885] 3105945=test_rdoc_markup_indented_paragraph I, [2024-05-07T10:14:15.714251 #3065062] INFO -- : [328/885] 3105945=test_have_library I, [2024-05-07T10:14:16.467018 #3065062] INFO -- : [329/885] 3105945=test_stream I, [2024-05-07T10:14:16.472942 #3065062] INFO -- : [330/885] 3105945=test_ns_spki I, [2024-05-07T10:14:16.478304 #3065062] INFO -- : [331/885] 3105945=test_win32ole_variant_outarg I, [2024-05-07T10:14:16.487349 #3065062] INFO -- : [332/885] 3105945=test_rdoc_encoding I, [2024-05-07T10:14:16.577077 #3065062] INFO -- : [333/885] 3105945=test_postponed_job I, [2024-05-07T10:14:16.858615 #3065062] INFO -- : [334/885] 3105945=test_key_actor_vi I, [2024-05-07T10:14:16.982898 #3065062] INFO -- : [335/885] 3105945=test_rdoc_markdown I, [2024-05-07T10:14:17.218059 #3065062] INFO -- : [336/885] 3105945=test_gem_request_set_lockfile I, [2024-05-07T10:14:17.697126 #3065062] INFO -- : [337/885] 3105945=test_httpresponses I, [2024-05-07T10:14:17.714033 #3065062] INFO -- : [338/885] 3105945=test_rdoc_constant I, [2024-05-07T10:14:17.836455 #3065062] INFO -- : [339/885] 3105945=test_deprecate I, [2024-05-07T10:14:17.889725 #3065062] INFO -- : [340/885] 3105945=test_generic I, [2024-05-07T10:14:17.914478 #3065062] INFO -- : [341/885] 3105945=test_rdoc_markup_to_html_snippet I, [2024-05-07T10:14:17.978221 #3065062] INFO -- : [342/885] 3105945=test_common I, [2024-05-07T10:14:18.167447 #3065062] INFO -- : [343/885] 3105945=test_pstore I, [2024-05-07T10:14:18.207550 #3065062] INFO -- : Leaked file descriptor: TestProcess#test_uid_from_name: 9 # I, [2024-05-07T10:14:18.242093 #3065062] INFO -- : COMMAND PID USER FD TYPE DEVICE SIZE/OFF NODE NAME I, [2024-05-07T10:14:18.242162 #3065062] INFO -- : ruby 3105944 opc 9u unix 0x0000000000000000 0t0 2878388314 type=STREAM I, [2024-05-07T10:14:18.397227 #3065062] INFO -- : [344/885] 3105945=test_ubf_async_safe I, [2024-05-07T10:14:18.408883 #3065062] INFO -- : [345/885] 3105945=test_gem_version_option I, [2024-05-07T10:14:18.473791 #3065062] INFO -- : [346/885] 3105945=test_win32ole_record I, [2024-05-07T10:14:18.487479 #3065062] INFO -- : [347/885] 3105945=test_rdoc_include I, [2024-05-07T10:14:18.516051 #3065062] INFO -- : [348/885] 3105945=test_date_compat I, [2024-05-07T10:14:18.539348 #3065062] INFO -- : [349/885] 3105945=test_proc I, [2024-05-07T10:14:19.444630 #3065062] INFO -- : [350/885] 3105945=test_console_attr I, [2024-05-07T10:14:19.445112 #3065062] INFO -- : [351/885] 3105945=test_gem_ext_cargo_builder I, [2024-05-07T10:14:19.510508 #3065062] INFO -- : [352/885] 3105945=test_gem_commands_unpack_command I, [2024-05-07T10:14:19.873213 #3065062] INFO -- : [353/885] 3105945=test_rdoc_options I, [2024-05-07T10:14:20.136781 #3065062] INFO -- : [354/885] 3105945=test_zlib I, [2024-05-07T10:14:27.154491 #3065062] INFO -- : [355/885] 3105945=test_path_to_class I, [2024-05-07T10:14:27.193985 #3065062] INFO -- : [356/885] 3105945=test_enumerator I, [2024-05-07T10:14:27.202393 #3065062] INFO -- : [357/885] 3105945=test_reqarg I, [2024-05-07T10:14:27.504985 #3065062] INFO -- : [358/885] 3105945=test_spell_checker I, [2024-05-07T10:14:27.516655 #3065062] INFO -- : [359/885] 3105945=test_gem_version I, [2024-05-07T10:14:27.735074 #3065062] INFO -- : [360/885] 3105945=test_gem_ext_ext_conf_builder I, [2024-05-07T10:14:28.379748 #3065062] INFO -- : [361/885] 3105944=test_frozen_error I, [2024-05-07T10:14:28.385205 #3065062] INFO -- : [362/885] 3105944=test_resource I, [2024-05-07T10:14:28.411826 #3065062] INFO -- : [363/885] 3105944=test_gem_package_tar_reader_entry I, [2024-05-07T10:14:28.704903 #3065062] INFO -- : [364/885] 3105944=test_gem_uri I, [2024-05-07T10:14:28.713722 #3065062] INFO -- : [365/885] 3105945=test_yield_block I, [2024-05-07T10:14:28.722608 #3065062] INFO -- : [366/885] 3105945=test_bug-5832 I, [2024-05-07T10:14:28.730702 #3065062] INFO -- : [367/885] 3105945=test_c_struct_builder I, [2024-05-07T10:14:28.749603 #3065062] INFO -- : [368/885] 3105944=test_pipe I, [2024-05-07T10:14:28.863040 #3065062] INFO -- : [369/885] 3105944=test_macro I, [2024-05-07T10:14:28.865576 #3065062] INFO -- : [370/885] 3105944=test_string I, [2024-05-07T10:14:29.002362 #3065062] INFO -- : [371/885] 3105945=test_gem_commands_server_command I, [2024-05-07T10:14:29.012009 #3065062] INFO -- : [372/885] 3105945=test_function I, [2024-05-07T10:14:29.244953 #3065062] INFO -- : [373/885] 3105945=test_gem_resolver_activation_request I, [2024-05-07T10:14:29.259210 #3065062] INFO -- : [374/885] 3105945=parse_comments_test I, [2024-05-07T10:14:29.265896 #3065062] INFO -- : [375/885] 3105945=test_tcp I, [2024-05-07T10:14:29.353254 #3065062] INFO -- : [376/885] 3105945=test_win32ole_method_event I, [2024-05-07T10:14:29.409164 #3065062] INFO -- : [377/885] 3105945=test_integer I, [2024-05-07T10:14:29.420232 #3065062] INFO -- : [378/885] 3105945=test_gem_name_tuple I, [2024-05-07T10:14:29.486599 #3065062] INFO -- : [379/885] 3105945=test_rdoc_markup_to_table_of_contents I, [2024-05-07T10:14:29.557257 #3065062] INFO -- : [380/885] 3105945=test_gem_requirement I, [2024-05-07T10:14:29.829553 #3065062] INFO -- : [381/885] 3105945=test_gem_request_connection_pools I, [2024-05-07T10:14:30.934537 #3065062] INFO -- : [382/885] 3105945=test_init I, [2024-05-07T10:14:31.276130 #3065062] INFO -- : [383/885] 3105945=test_rat I, [2024-05-07T10:14:31.326633 #3065062] INFO -- : [384/885] 3105945=test_bug-3571 I, [2024-05-07T10:14:31.334098 #3065062] INFO -- : [385/885] 3105945=test_yamlstore I, [2024-05-07T10:14:31.353178 #3065062] INFO -- : [386/885] 3105945=test_numeric I, [2024-05-07T10:14:31.740729 #3065062] INFO -- : [387/885] 3105945=test_flags I, [2024-05-07T10:14:32.288980 #3065062] INFO -- : [388/885] 3105945=test_file I, [2024-05-07T10:14:32.322463 #3065062] INFO -- : [389/885] 3105945=test_time I, [2024-05-07T10:14:32.538601 #3065062] INFO -- : [390/885] 3105945=test_gem_commands_owner_command I, [2024-05-07T10:14:33.376033 #3065062] INFO -- : [391/885] 3105945=test_nextafter I, [2024-05-07T10:14:33.645859 #3065062] INFO -- : [392/885] 3105945=test_capacity I, [2024-05-07T10:14:33.653490 #3065062] INFO -- : [393/885] 3105945=test_encoding I, [2024-05-07T10:14:33.901462 #3065062] INFO -- : [394/885] 3105945=test_hmac I, [2024-05-07T10:14:33.923765 #3065062] INFO -- : [395/885] 3105945=test_rdoc_generator_markup I, [2024-05-07T10:14:33.940721 #3065062] INFO -- : [396/885] 3105945=test_find I, [2024-05-07T10:14:34.358293 #3065062] INFO -- : [397/885] 3105945=test_constant I, [2024-05-07T10:14:36.745056 #3065062] INFO -- : [398/885] 3105945=test_files_lib I, [2024-05-07T10:14:40.594039 #3065062] INFO -- : [399/885] 3105945=test_help I, [2024-05-07T10:14:40.679714 #3065062] INFO -- : [400/885] 3105945=test_string_memory I, [2024-05-07T10:14:40.795400 #3065062] INFO -- : [401/885] 3105945=test_enumerator_kw I, [2024-05-07T10:14:40.812221 #3065062] INFO -- : [402/885] 3105945=reflection_test I, [2024-05-07T10:14:40.819783 #3065062] INFO -- : [403/885] 3105945=test_marshalable I, [2024-05-07T10:14:40.830203 #3065062] INFO -- : [404/885] 3105945=test_line_editor I, [2024-05-07T10:14:40.842745 #3065062] INFO -- : [405/885] 3105945=json_common_interface_test I, [2024-05-07T10:14:40.856831 #3065062] INFO -- : [406/885] 3105945=test_string I, [2024-05-07T10:14:40.868523 #3065062] INFO -- : [407/885] 3105945=test_function_entry I, [2024-05-07T10:14:40.882563 #3065062] INFO -- : [408/885] 3105945=test_error_highlight I, [2024-05-07T10:14:41.629301 #3065062] INFO -- : [409/885] 3105945=test_rdoc_any_method I, [2024-05-07T10:14:42.011863 #3065062] INFO -- : [410/885] 3105945=test_raise I, [2024-05-07T10:14:42.019612 #3065062] INFO -- : [411/885] 3105945=test_complexrational I, [2024-05-07T10:14:42.025534 #3065062] INFO -- : [412/885] 3105945=version_test I, [2024-05-07T10:14:42.032407 #3065062] INFO -- : [413/885] 3105945=test_tree_builder I, [2024-05-07T10:14:42.064783 #3065062] INFO -- : [414/885] 3105945=test_gem_commands_update_command I, [2024-05-07T10:14:43.743240 #3065062] INFO -- : [415/885] 3105945=test_date I, [2024-05-07T10:14:43.749313 #3065062] INFO -- : [416/885] 3105945=test_big5 I, [2024-05-07T10:14:43.754615 #3065062] INFO -- : [417/885] 3105945=test_protect I, [2024-05-07T10:14:43.763712 #3065062] INFO -- : [418/885] 3105945=test_fnmatch I, [2024-05-07T10:14:43.819479 #3065062] INFO -- : [419/885] 3105945=test_pathname I, [2024-05-07T10:14:44.088585 #3065062] INFO -- : [420/885] 3105945=test_coverage I, [2024-05-07T10:14:44.706429 #3065062] INFO -- : [421/885] 3105945=test_http_request I, [2024-05-07T10:14:44.718266 #3065062] INFO -- : [422/885] 3105945=test_tempfile I, [2024-05-07T10:14:44.944188 #3065062] INFO -- : [423/885] 3105945=test_rdoc_markup_pre_process I, [2024-05-07T10:14:45.112836 #3065062] INFO -- : [424/885] 3105945=test_store I, [2024-05-07T10:14:45.447252 #3065062] INFO -- : [425/885] 3105945=test_rdoc_generator_pot_po_entry I, [2024-05-07T10:14:45.458952 #3065062] INFO -- : [426/885] 3105945=test_erb_m17n I, [2024-05-07T10:14:45.470079 #3065062] INFO -- : [427/885] 3105945=test_timeout I, [2024-05-07T10:14:45.479628 #3065062] INFO -- : [428/885] 3105945=test_date_conv I, [2024-05-07T10:14:45.485338 #3065062] INFO -- : [429/885] 3105945=test_rdoc_markup_verbatim I, [2024-05-07T10:14:45.500302 #3065062] INFO -- : [430/885] 3105945=test_webauthn_poller I, [2024-05-07T10:14:45.727593 #3065062] INFO -- : [431/885] 3105945=test_egrep_cpp I, [2024-05-07T10:14:45.776937 #3065062] INFO -- : [432/885] 3105945=test_frozen I, [2024-05-07T10:14:45.791198 #3065062] INFO -- : [433/885] 3105945=test_gem_resolver_index_specification I, [2024-05-07T10:14:45.855708 #3065062] INFO -- : [434/885] 3105945=test_serialize_subclasses I, [2024-05-07T10:14:45.868892 #3065062] INFO -- : [435/885] 3105945=test_gem_config_file I, [2024-05-07T10:14:46.131319 #3065062] INFO -- : [436/885] 3105945=json_string_matching_test I, [2024-05-07T10:14:46.139919 #3065062] INFO -- : [437/885] 3105945=test_comparable I, [2024-05-07T10:14:46.142266 #3065062] INFO -- : [438/885] 3105945=test_yjit_exit_locations I, [2024-05-07T10:14:46.156826 #3065062] INFO -- : [439/885] 3105945=test_rdoc_rdoc I, [2024-05-07T10:14:46.216612 #3065062] INFO -- : [440/885] 3105945=test_io_timeout I, [2024-05-07T10:14:46.234458 #3065062] INFO -- : [441/885] 3105945=test_rdoc_normal_module I, [2024-05-07T10:14:46.273970 #3065062] INFO -- : [442/885] 3105945=test_type_completor I, [2024-05-07T10:14:46.464849 #3065062] INFO -- : [443/885] 3105945=test_rdoc_markdown_test I, [2024-05-07T10:14:47.525295 #3065062] INFO -- : [444/885] 3105945=test_io_buffer I, [2024-05-07T10:14:47.597330 #3065062] INFO -- : [445/885] 3105945=test_kdf I, [2024-05-07T10:14:47.673635 #3065062] INFO -- : [446/885] 3105945=test_ldap I, [2024-05-07T10:14:47.685325 #3065062] INFO -- : [447/885] 3105945=test_defined I, [2024-05-07T10:14:47.771603 #3065062] INFO -- : [448/885] 3105945=test_passing_block I, [2024-05-07T10:14:47.780442 #3065062] INFO -- : [449/885] 3105945=test_nowrite I, [2024-05-07T10:14:47.804687 #3065062] INFO -- : [450/885] 3105945=test_thread_queue I, [2024-05-07T10:14:49.316720 #3065062] INFO -- : [451/885] 3105946=test_human_typo I, [2024-05-07T10:14:49.370049 #3065062] INFO -- : [452/885] 3105946=test_import I, [2024-05-07T10:14:50.556228 #3065062] INFO -- : [453/885] 3105944=test_wait I, [2024-05-07T10:14:50.617815 #3065062] INFO -- : [454/885] 3105944=test_nil I, [2024-05-07T10:14:50.627676 #3065062] INFO -- : [455/885] 3105944=test_psych I, [2024-05-07T10:14:50.664526 #3065062] INFO -- : [456/885] 3105944=test_yaml_tree I, [2024-05-07T10:14:50.692714 #3065062] INFO -- : [457/885] 3105944=test_gem_commands_yank_command I, [2024-05-07T10:14:51.211311 #3065062] INFO -- : [458/885] 3105944=test_euc_tw I, [2024-05-07T10:14:51.242013 #3065062] INFO -- : [459/885] 3105944=test_command I, [2024-05-07T10:14:51.320669 #3065062] INFO -- : [460/885] 3105946=test_gem_resolver_dependency_request I, [2024-05-07T10:14:51.366023 #3065062] INFO -- : [461/885] 3105946=test_cstr I, [2024-05-07T10:14:51.514995 #3065062] INFO -- : [462/885] 3105944=test_gem_resolver_specification I, [2024-05-07T10:14:51.539418 #3065062] INFO -- : [463/885] 3105944=test_big2str I, [2024-05-07T10:14:51.545605 #3065062] INFO -- : [464/885] 3105944=test_pkey_dsa I, [2024-05-07T10:14:52.690499 #3065062] INFO -- : [465/885] 3105946=test_logger I, [2024-05-07T10:14:52.711469 #3065062] INFO -- : [466/885] 3105946=test_allocation I, [2024-05-07T10:14:54.545114 #3065062] INFO -- : [467/885] 3105945=test_ifunless I, [2024-05-07T10:14:54.557260 #3065062] INFO -- : [468/885] 3105945=test_gem_console_ui I, [2024-05-07T10:14:54.562435 #3065062] INFO -- : [469/885] 3105945=test_insns_leaf I, [2024-05-07T10:14:54.582294 #3065062] INFO -- : [470/885] 3105945=test_readpartial I, [2024-05-07T10:14:54.904059 #3065062] INFO -- : [471/885] 3105946=test_rdoc_parser_ruby I, [2024-05-07T10:14:54.975695 #3065062] INFO -- : [472/885] 3105945=test_httpresponse I, [2024-05-07T10:14:55.007820 #3065062] INFO -- : [473/885] 3105945=test_x509req I, [2024-05-07T10:14:55.030399 #3065062] INFO -- : [474/885] 3105945=test_gem_source_vendor I, [2024-05-07T10:14:55.106247 #3065062] INFO -- : [475/885] 3105945=test_gem_resolver I, [2024-05-07T10:14:55.184728 #3065062] INFO -- : [476/885] 3105944=test_dln I, [2024-05-07T10:14:55.185109 #3065062] INFO -- : [477/885] 3105944=test_object I, [2024-05-07T10:14:55.524546 #3065062] INFO -- : [478/885] 3105945=unescape_test I, [2024-05-07T10:14:55.569294 #3065062] INFO -- : [479/885] 3105944=test_gem_commands_exec_command I, [2024-05-07T10:14:55.741685 #3065062] INFO -- : [480/885] 3105946=test_super I, [2024-05-07T10:14:56.877855 #3065062] INFO -- : [481/885] 3105945=test_color_printer I, [2024-05-07T10:14:56.897193 #3065062] INFO -- : [482/885] 3105945=test_gem_available_set I, [2024-05-07T10:14:56.985423 #3065062] INFO -- : [483/885] 3105944=test_pkg_config I, [2024-05-07T10:14:57.010741 #3065062] INFO -- : [484/885] 3105945=test_modify_expand I, [2024-05-07T10:14:57.020097 #3065062] INFO -- : [485/885] 3105945=errors_test I, [2024-05-07T10:14:57.032758 #3065062] INFO -- : [486/885] 3105944=test_convertible I, [2024-05-07T10:14:57.104741 #3065062] INFO -- : [487/885] 3105945=test_config I, [2024-05-07T10:14:57.192576 #3065062] INFO -- : [488/885] 3105945=test_func I, [2024-05-07T10:15:00.669693 #3065062] INFO -- : [489/885] 3105944=test_vm_dump I, [2024-05-07T10:15:00.680665 #3065062] INFO -- : [490/885] 3105944=json_encoding_test I, [2024-05-07T10:15:00.695044 #3065062] INFO -- : [491/885] 3105944=test_compile_prism I, [2024-05-07T10:15:00.978937 #3065062] INFO -- : [492/885] 3105944=test_helper I, [2024-05-07T10:15:00.983460 #3065062] INFO -- : [493/885] 3105944=test_win32ole_event I, [2024-05-07T10:15:00.992462 #3065062] INFO -- : [494/885] 3105944=test_rdoc_markup_formatter I, [2024-05-07T10:15:00.995463 #3065062] INFO -- : [495/885] 3105944=test_gem_commands_uninstall_command I, [2024-05-07T10:15:01.012733 #3065062] INFO -- : [496/885] 3105946=test_digest_extend I, [2024-05-07T10:15:01.029496 #3065062] INFO -- : [497/885] 3105946=test_gem_ext_cmake_builder I, [2024-05-07T10:15:01.067313 #3065062] INFO -- : [498/885] 3105946=test_thread_fd_close I, [2024-05-07T10:15:01.077812 #3065062] INFO -- : [499/885] 3105946=test_last_thread I, [2024-05-07T10:15:01.843671 #3065062] INFO -- : [500/885] 3105944=test_getopts I, [2024-05-07T10:15:01.852601 #3065062] INFO -- : [501/885] 3105944=test_alias I, [2024-05-07T10:15:01.939974 #3065062] INFO -- : [502/885] 3105945=test_fips I, [2024-05-07T10:15:01.996774 #3065062] INFO -- : [503/885] 3105944=test_emitter I, [2024-05-07T10:15:02.001981 #3065062] INFO -- : [504/885] 3105944=test_pattern_key_name_check I, [2024-05-07T10:15:02.008293 #3065062] INFO -- : [505/885] 3105944=test_profile_frames I, [2024-05-07T10:15:02.132587 #3065062] INFO -- : [506/885] 3105946=test_transcode I, [2024-05-07T10:15:02.148650 #3065062] INFO -- : [507/885] 3105945=test_refinement I, [2024-05-07T10:15:02.174648 #3065062] INFO -- : [508/885] 3105944=test_debug I, [2024-05-07T10:15:02.181521 #3065062] INFO -- : [509/885] 3105944=test_gem_commands_cleanup_command I, [2024-05-07T10:15:02.331336 #3065062] INFO -- : [510/885] 3105946=test_class2name I, [2024-05-07T10:15:02.390121 #3065062] INFO -- : [511/885] 3105946=test_notimplement I, [2024-05-07T10:15:02.394404 #3065062] INFO -- : [512/885] 3105946=test_cgi_session I, [2024-05-07T10:15:02.414819 #3065062] INFO -- : [513/885] 3105946=test_c_union_entity I, [2024-05-07T10:15:02.551831 #3065062] INFO -- : [514/885] 3105946=test_dns I, [2024-05-07T10:15:02.826475 #3065062] INFO -- : [515/885] 3105944=test_x509crl I, [2024-05-07T10:15:02.911681 #3065062] INFO -- : [516/885] 3105944=test_rdoc_markup_heading I, [2024-05-07T10:15:02.923834 #3065062] INFO -- : [517/885] 3105944=test_io_console I, [2024-05-07T10:15:03.008860 #3065062] INFO -- : [518/885] 3105946=test_flip I, [2024-05-07T10:15:03.032798 #3065062] INFO -- : [519/885] 3105946=test_emitter I, [2024-05-07T10:15:03.041936 #3065062] INFO -- : [520/885] 3105946=test_x509ext I, [2024-05-07T10:15:03.053016 #3065062] INFO -- : [521/885] 3105946=test_helper_method I, [2024-05-07T10:15:03.076627 #3065062] INFO -- : [522/885] 3105946=test_summary I, [2024-05-07T10:15:03.221186 #3065062] INFO -- : [523/885] 3105946=test_config I, [2024-05-07T10:15:03.580641 #3065062] INFO -- : [524/885] 3105946=test_file I, [2024-05-07T10:15:05.588055 #3065062] INFO -- : [525/885] 3105944=bom_test I, [2024-05-07T10:15:05.595275 #3065062] INFO -- : [526/885] 3105944=test_foreach I, [2024-05-07T10:15:05.604776 #3065062] INFO -- : [527/885] 3105944=test_rdoc_markup_to_html I, [2024-05-07T10:15:05.716754 #3065062] INFO -- : [528/885] 3105944=test_gem_resolver_installer_set I, [2024-05-07T10:15:05.821261 #3065062] INFO -- : [529/885] 3105945=test_append I, [2024-05-07T10:15:05.822775 #3065062] INFO -- : [530/885] 3105945=test_trace I, [2024-05-07T10:15:05.833718 #3065062] INFO -- : [531/885] 3105945=test_gem_path_support I, [2024-05-07T10:15:05.946275 #3065062] INFO -- : [532/885] 3105945=test_arity I, [2024-05-07T10:15:05.953457 #3065062] INFO -- : [533/885] 3105945=test_win32ole_type_event I, [2024-05-07T10:15:05.958059 #3065062] INFO -- : [534/885] 3105945=test_keyword I, [2024-05-07T10:15:05.968704 #3065062] INFO -- : [535/885] 3105944=test_scalar_scanner I, [2024-05-07T10:15:05.976920 #3065062] INFO -- : [536/885] 3105944=test_rb_str_dup I, [2024-05-07T10:15:05.984938 #3065062] INFO -- : [537/885] 3105944=test_lambda I, [2024-05-07T10:15:06.046440 #3065062] INFO -- : [538/885] 3105944=test_monitor I, [2024-05-07T10:15:06.269760 #3065062] INFO -- : [539/885] 3105944=test_beginendblock I, [2024-05-07T10:15:06.562229 #3065062] INFO -- : [540/885] 3105945=test_eval I, [2024-05-07T10:15:06.598757 #3065062] INFO -- : [541/885] 3105944=test_regexp I, [2024-05-07T10:15:06.808805 #3065062] INFO -- : [542/885] 3105945=test_whileuntil I, [2024-05-07T10:15:06.813809 #3065062] INFO -- : [543/885] 3105945=test_nofree I, [2024-05-07T10:15:06.825560 #3065062] INFO -- : [544/885] 3105945=test_within_pipe I, [2024-05-07T10:15:06.852652 #3065062] INFO -- : [545/885] 3105945=test_rdoc_normal_class I, [2024-05-07T10:15:06.955353 #3065062] INFO -- : [546/885] 3105945=test_pointer I, [2024-05-07T10:15:08.706749 #3065062] INFO -- : [547/885] 3105945=test_bug_reporter I, [2024-05-07T10:15:08.734915 #3065062] INFO -- : [548/885] 3105945=test_gem_installer I, [2024-05-07T10:15:09.886168 #3065062] INFO -- : [549/885] 3105946=test_ossl I, [2024-05-07T10:15:13.996467 #3065062] INFO -- : [550/885] 3105945=test_buffered_io I, [2024-05-07T10:15:14.003225 #3065062] INFO -- : [551/885] 3105945=compiler_test I, [2024-05-07T10:15:14.058781 #3065062] INFO -- : [552/885] 3105945=test_arith_seq_extract I, [2024-05-07T10:15:14.167141 #3065062] INFO -- : [553/885] 3105945=test_ruby_lex I, [2024-05-07T10:15:14.279570 #3065062] INFO -- : [554/885] 3105945=test_object_references I, [2024-05-07T10:15:14.332453 #3065062] INFO -- : [555/885] 3105945=test_gem_source_subpath_problem I, [2024-05-07T10:15:14.422009 #3065062] INFO -- : [556/885] 3105945=test_helper I, [2024-05-07T10:15:14.436852 #3065062] INFO -- : [557/885] 3105945=test_gem_resolver_api_set I, [2024-05-07T10:15:14.537535 #3065062] INFO -- : [558/885] 3105945=test_duplicate I, [2024-05-07T10:15:14.545817 #3065062] INFO -- : [559/885] 3105945=test_kill_ring I, [2024-05-07T10:15:14.556657 #3065062] INFO -- : [560/885] 3105945=test_mailto I, [2024-05-07T10:15:14.566314 #3065062] INFO -- : [561/885] 3105945=test_addr I, [2024-05-07T10:15:14.580130 #3065062] INFO -- : [562/885] 3105945=test_object I, [2024-05-07T10:15:14.586148 #3065062] INFO -- : [563/885] 3105945=test_member I, [2024-05-07T10:15:14.594911 #3065062] INFO -- : [564/885] 3105945=test_cgi_header I, [2024-05-07T10:15:14.600277 #3065062] INFO -- : [565/885] 3105945=format_errors_test I, [2024-05-07T10:15:14.606854 #3065062] INFO -- : [566/885] 3105945=test_case_options I, [2024-05-07T10:15:14.612810 #3065062] INFO -- : [567/885] 3105945=test_windows_1251 I, [2024-05-07T10:15:14.627842 #3065062] INFO -- : [568/885] 3105945=test_gem_ext_builder I, [2024-05-07T10:15:15.752996 #3065062] INFO -- : [569/885] 3105945=test_history I, [2024-05-07T10:15:17.432290 #3065062] INFO -- : [570/885] 3105945=test_to_ary_concat I, [2024-05-07T10:15:17.447108 #3065062] INFO -- : [571/885] 3105946=test_reline I, [2024-05-07T10:15:17.604172 #3065062] INFO -- : [572/885] 3105946=test_gem_commands_build_command I, [2024-05-07T10:15:17.946373 #3065062] INFO -- : [573/885] 3105946=test_call I, [2024-05-07T10:15:18.119660 #3065062] INFO -- : [574/885] 3105946=test_ellipsize I, [2024-05-07T10:15:18.129934 #3065062] INFO -- : [575/885] 3105946=test_data I, [2024-05-07T10:15:18.199684 #3065062] INFO -- : [576/885] 3105946=test_bug-14834 I, [2024-05-07T10:15:18.201921 #3065062] INFO -- : [577/885] 3105946=test_terminfo I, [2024-05-07T10:15:18.212594 #3065062] INFO -- : [578/885] 3105946=test_socket I, [2024-05-07T10:15:18.557823 #3065062] INFO -- : .Leaked thread: TestSocket#test_accept_loop: # I, [2024-05-07T10:15:18.559097 #3065062] INFO -- : Finished thread: TestSocket#test_unix: # I, [2024-05-07T10:15:19.188990 #3065062] INFO -- : [579/885] 3105946=test_inlinecache I, [2024-05-07T10:15:19.250986 #3065062] INFO -- : [580/885] 3105946=test_thread I, [2024-05-07T10:15:19.832782 #3065062] INFO -- : [581/885] 3105945=test_time_tz I, [2024-05-07T10:15:19.890481 #3065062] INFO -- : [582/885] 3105945=test_addrinfo I, [2024-05-07T10:15:19.917927 #3065062] INFO -- : Leaked file descriptor: TestSocketAddrinfo#test_addrinfo_timeout: 11 # I, [2024-05-07T10:15:19.953585 #3065062] INFO -- : COMMAND PID USER FD TYPE DEVICE SIZE/OFF NODE NAME I, [2024-05-07T10:15:19.953659 #3065062] INFO -- : ruby 3105945 opc 11u unix 0x0000000000000000 0t0 2878393643 type=STREAM I, [2024-05-07T10:15:20.030784 #3065062] INFO -- : [583/885] 3105945=test_to_ruby I, [2024-05-07T10:15:20.050011 #3065062] INFO -- : [584/885] 3105945=ruby_api_test I, [2024-05-07T10:15:20.198557 #3065062] INFO -- : [585/885] 3105945=test_gem_resolver_index_set I, [2024-05-07T10:15:20.260918 #3065062] INFO -- : [586/885] 3105945=test_webauthn_listener_response I, [2024-05-07T10:15:25.227681 #3065062] INFO -- : [587/885] 3105945=test_sleep I, [2024-05-07T10:15:25.301004 #3065062] INFO -- : [588/885] 3105945=test_folderitem2_invokeverb I, [2024-05-07T10:15:25.320358 #3065062] INFO -- : [589/885] 3105945=test_interned_str I, [2024-05-07T10:15:25.330509 #3065062] INFO -- : [590/885] 3105945=constant_path_node_test I, [2024-05-07T10:15:25.344369 #3065062] INFO -- : [591/885] 3105945=test_set_len I, [2024-05-07T10:15:25.375736 #3065062] INFO -- : [592/885] 3105945=test_pattern_matching I, [2024-05-07T10:15:25.399493 #3065062] INFO -- : [593/885] 3105945=test_gc I, [2024-05-07T10:15:28.117695 #3065062] INFO -- : [594/885] 3105946=test_gem_request_set I, [2024-05-07T10:15:28.652808 #3065062] INFO -- : [595/885] 3105946=test_gem_bundler_version_finder I, [2024-05-07T10:15:28.694366 #3065062] INFO -- : [596/885] 3105946=test_symbol I, [2024-05-07T10:15:28.758015 #3065062] INFO -- : [597/885] 3105946=test_project_sanity I, [2024-05-07T10:15:28.772621 #3065062] INFO -- : [598/885] 3105946=location_test I, [2024-05-07T10:15:28.814107 #3065062] INFO -- : [599/885] 3105946=test_delegate I, [2024-05-07T10:15:28.823631 #3065062] INFO -- : [600/885] 3105946=test_chilled I, [2024-05-07T10:15:28.886145 #3065062] INFO -- : [601/885] 3105946=test_ensured I, [2024-05-07T10:15:28.891296 #3065062] INFO -- : [602/885] 3105946=test_key_stroke I, [2024-05-07T10:15:28.911771 #3065062] INFO -- : [603/885] 3105946=test_rdoc_markup I, [2024-05-07T10:15:28.924185 #3065062] INFO -- : [604/885] 3105946=test_euc_jp I, [2024-05-07T10:15:28.933617 #3065062] INFO -- : [605/885] 3105946=test_alias_and_anchor I, [2024-05-07T10:15:29.033970 #3065062] INFO -- : [606/885] 3105946=test_popen_deadlock I, [2024-05-07T10:15:29.576864 #3065062] INFO -- : [607/885] 3105946=test_time I, [2024-05-07T10:15:29.737111 #3065062] INFO -- : [608/885] 3105946=test_rbconfig I, [2024-05-07T10:15:29.747927 #3065062] INFO -- : [609/885] 3105946=test_num2int I, [2024-05-07T10:15:29.766781 #3065062] INFO -- : [610/885] 3105946=test_gem_commands_signin_command I, [2024-05-07T10:15:29.890990 #3065062] INFO -- : [611/885] 3105944=test_range I, [2024-05-07T10:15:29.926481 #3065062] INFO -- : [612/885] 3105946=test_iter_break I, [2024-05-07T10:15:29.983096 #3065062] INFO -- : [613/885] 3105946=test_extlibs I, [2024-05-07T10:15:30.688906 #3065062] INFO -- : [614/885] 3105944=test_enum I, [2024-05-07T10:15:31.508629 #3065062] INFO -- : [615/885] 3105946=test_rdoc_markup_include I, [2024-05-07T10:15:31.526616 #3065062] INFO -- : [616/885] 3105946=test_require I, [2024-05-07T10:15:31.614390 #3065062] INFO -- : [617/885] 3105944=test_recursion I, [2024-05-07T10:15:31.678007 #3065062] INFO -- : [618/885] 3105944=test_ractor I, [2024-05-07T10:15:31.693683 #3065062] INFO -- : [619/885] 3105944=test_trick I, [2024-05-07T10:15:32.864634 #3065062] INFO -- : [620/885] 3105946=test_stream I, [2024-05-07T10:15:32.874861 #3065062] INFO -- : [621/885] 3105946=test_address_resolve I, [2024-05-07T10:15:32.891320 #3065062] INFO -- : [622/885] 3105946=test_rdoc_attr I, [2024-05-07T10:15:32.904664 #3065062] INFO -- : [623/885] 3105946=test_locale I, [2024-05-07T10:15:32.939062 #3065062] INFO -- : [624/885] 3105946=test_ts I, [2024-05-07T10:15:33.493061 #3065062] INFO -- : [625/885] 3105946=test_have_func I, [2024-05-07T10:15:34.170613 #3065062] INFO -- : [626/885] 3105944=test_date_marshal I, [2024-05-07T10:15:34.186890 #3065062] INFO -- : [627/885] 3105944=test_gem_commands_list_command I, [2024-05-07T10:15:34.198278 #3065062] INFO -- : [628/885] 3105944=test_date_new I, [2024-05-07T10:15:34.207182 #3065062] INFO -- : [629/885] 3105944=test_configuration I, [2024-05-07T10:15:34.302131 #3065062] INFO -- : [630/885] 3105944=test_gem_resolver_local_specification I, [2024-05-07T10:15:34.334530 #3065062] INFO -- : [631/885] 3105944=test_coder I, [2024-05-07T10:15:34.354707 #3065062] INFO -- : [632/885] 3105944=test_rdoc_servlet I, [2024-05-07T10:15:34.478420 #3065062] INFO -- : [633/885] 3105944=test_gem_commands_search_command I, [2024-05-07T10:15:34.502783 #3065062] INFO -- : [634/885] 3105944=test_symbol I, [2024-05-07T10:15:34.594759 #3065062] INFO -- : [635/885] 3105946=test_udp I, [2024-05-07T10:15:34.611955 #3065062] INFO -- : [636/885] 3105946=test_context I, [2024-05-07T10:15:34.709046 #3065062] INFO -- : [637/885] 3105946=test_gem_commands_contents_command I, [2024-05-07T10:15:34.830998 #3065062] INFO -- : [638/885] 3105946=test_formatter I, [2024-05-07T10:15:34.844425 #3065062] INFO -- : [639/885] 3105946=test_integer I, [2024-05-07T10:15:35.263853 #3065062] INFO -- : [640/885] 3105945=test_unix I, [2024-05-07T10:15:35.305251 #3065062] INFO -- : [641/885] 3105945=test_enc_str_buf_cat I, [2024-05-07T10:15:35.315092 #3065062] INFO -- : [642/885] 3105945=newline_test I, [2024-05-07T10:15:35.404398 #3065062] INFO -- : [643/885] 3105945=test_bignum I, [2024-05-07T10:15:37.255282 #3065062] INFO -- : [644/885] 3105946=test_rdoc_markup_hard_break I, [2024-05-07T10:15:37.266747 #3065062] INFO -- : [645/885] 3105946=test_nesting_parser I, [2024-05-07T10:15:37.333089 #3065062] INFO -- : [646/885] 3105946=ractor_test I, [2024-05-07T10:15:37.339552 #3065062] INFO -- : [647/885] 3105946=test_ancdata I, [2024-05-07T10:15:37.354613 #3065062] INFO -- : [648/885] 3105946=test_marshal I, [2024-05-07T10:15:38.561442 #3065062] INFO -- : [649/885] 3105946=test_gem_resolver_conflict I, [2024-05-07T10:15:38.648860 #3065062] INFO -- : [650/885] 3105946=test_ractor I, [2024-05-07T10:15:38.898506 #3065062] INFO -- : [651/885] 3105944=test_ssl I, [2024-05-07T10:15:38.918667 #3065062] INFO -- : [652/885] 3105946=test_scheduler I, [2024-05-07T10:15:39.044322 #3065062] INFO -- : [653/885] 3105945=test_gem_commands_help_command I, [2024-05-07T10:15:39.059514 #3065062] INFO -- : [654/885] 3105944=test_gem I, [2024-05-07T10:15:39.082269 #3065062] INFO -- : [655/885] 3105946=test_registry I, [2024-05-07T10:15:39.085944 #3065062] INFO -- : [656/885] 3105946=test_ansi_without_terminfo I, [2024-05-07T10:15:39.103837 #3065062] INFO -- : [657/885] 3105946=json_generator_test I, [2024-05-07T10:15:39.212564 #3065062] INFO -- : [658/885] 3105945=test_ractor I, [2024-05-07T10:15:39.220821 #3065062] INFO -- : [659/885] 3105946=test_parser I, [2024-05-07T10:15:39.222862 #3065062] INFO -- : [660/885] 3105945=test_rdoc_markup_to_label I, [2024-05-07T10:15:39.233756 #3065062] INFO -- : [661/885] 3105946=test_gem_resolver_best_set I, [2024-05-07T10:15:39.271220 #3065062] INFO -- : [662/885] 3105945=test_cgi_core I, [2024-05-07T10:15:39.289169 #3065062] INFO -- : [663/885] 3105945=test_gem_source_lock I, [2024-05-07T10:15:39.322857 #3065062] INFO -- : [664/885] 3105946=test_update I, [2024-05-07T10:15:39.335525 #3065062] INFO -- : [665/885] 3105946=test_cipher I, [2024-05-07T10:15:39.358733 #3065062] INFO -- : [666/885] 3105946=test_new I, [2024-05-07T10:15:39.365619 #3065062] INFO -- : [667/885] 3105946=test_rdoc_rd_inline_parser I, [2024-05-07T10:15:39.374081 #3065062] INFO -- : [668/885] 3105945=test_win32ole_type I, [2024-05-07T10:15:39.379221 #3065062] INFO -- : [669/885] 3105945=test_load I, [2024-05-07T10:15:39.381395 #3065062] INFO -- : [670/885] 3105945=test_x509store I, [2024-05-07T10:15:39.392108 #3065062] INFO -- : [671/885] 3105946=test_rdoc_rd_block_parser I, [2024-05-07T10:15:39.418562 #3065062] INFO -- : [672/885] 3105946=test_rdoc_generator_pot I, [2024-05-07T10:15:39.436625 #3065062] INFO -- : [673/885] 3105946=test_rdoc_markup_to_markdown I, [2024-05-07T10:15:39.477116 #3065062] INFO -- : [674/885] 3105946=test_rdoc_markup_to_joined_paragraph I, [2024-05-07T10:15:39.488036 #3065062] INFO -- : [675/885] 3105946=test_rdoc_rd I, [2024-05-07T10:15:39.499795 #3065062] INFO -- : [676/885] 3105946=test_gem_gem_runner I, [2024-05-07T10:15:39.568686 #3065062] INFO -- : [677/885] 3105946=test_require_lib I, [2024-05-07T10:15:39.894817 #3065062] INFO -- : [678/885] 3105945=test_metaclass I, [2024-05-07T10:15:39.909680 #3065062] INFO -- : [679/885] 3105945=test_objectspace I, [2024-05-07T10:15:40.824911 #3065062] INFO -- : [680/885] 3105945=test_require I, [2024-05-07T10:15:41.479096 #3065062] INFO -- : [681/885] 3105944=test_my_integer I, [2024-05-07T10:15:41.490885 #3065062] INFO -- : [682/885] 3105944=test_gem_resolver_composed_set I, [2024-05-07T10:15:41.504808 #3065062] INFO -- : [683/885] 3105944=test_debugger_integration I, [2024-05-07T10:15:41.521599 #3065062] INFO -- : [684/885] 3105944=test_not I, [2024-05-07T10:15:41.529801 #3065062] INFO -- : [685/885] 3105944=test_cgi_cookie I, [2024-05-07T10:15:41.542430 #3065062] INFO -- : [686/885] 3105944=test_tracer I, [2024-05-07T10:15:41.549835 #3065062] INFO -- : [687/885] 3105944=test_rdoc_markup_attribute_manager I, [2024-05-07T10:15:41.588870 #3065062] INFO -- : [688/885] 3105944=test_wss I, [2024-05-07T10:15:41.646294 #3065062] INFO -- : [689/885] 3105944=test_option I, [2024-05-07T10:15:41.709148 #3065062] INFO -- : [690/885] 3105944=test_erb_command I, [2024-05-07T10:15:41.780890 #3065062] INFO -- : [691/885] 3105944=test_module I, [2024-05-07T10:15:42.506067 #3065062] INFO -- : [692/885] 3105946=test_gem_security_trust_dir I, [2024-05-07T10:15:42.552351 #3065062] INFO -- : [693/885] 3105946=test_gem_validator I, [2024-05-07T10:15:42.605690 #3065062] INFO -- : [694/885] 3105946=test_gem_source_installed I, [2024-05-07T10:15:42.612849 #3065062] INFO -- : [695/885] 3105946=test_usrmarshal I, [2024-05-07T10:15:42.828646 #3065062] INFO -- : [696/885] 3105946=test_bundled_ca I, [2024-05-07T10:15:43.480212 #3065062] INFO -- : [697/885] 3105945=test_integer_comb I, [2024-05-07T10:15:44.176449 #3065062] INFO -- : [698/885] 3105946=test_load I, [2024-05-07T10:15:44.241845 #3065062] INFO -- : [699/885] 3105946=test_abi I, [2024-05-07T10:15:44.347756 #3065062] INFO -- : [700/885] 3105944=test_ssl I, [2024-05-07T10:15:44.390091 #3065062] INFO -- : [701/885] 3105946=test_lock_native_thread I, [2024-05-07T10:15:44.619800 #3065062] INFO -- : [702/885] 3105946=test_gem_package_task I, [2024-05-07T10:15:44.641683 #3065062] INFO -- : [703/885] 3105946=test_resize I, [2024-05-07T10:15:44.647481 #3065062] INFO -- : [704/885] 3105946=test_win32ole_param I, [2024-05-07T10:15:44.653287 #3065062] INFO -- : [705/885] 3105946=test_key_error I, [2024-05-07T10:15:44.662780 #3065062] INFO -- : [706/885] 3105946=test_fiber I, [2024-05-07T10:15:46.029528 #3065062] INFO -- : [707/885] 3105945=test_gem_commands_mirror I, [2024-05-07T10:15:46.056272 #3065062] INFO -- : [708/885] 3105945=test_engine I, [2024-05-07T10:15:46.508277 #3065062] INFO -- : [709/885] 3105945=test_custom_command I, [2024-05-07T10:15:46.516377 #3065062] INFO -- : [710/885] 3105945=test_rdoc_parser_markdown I, [2024-05-07T10:15:46.611656 #3065062] INFO -- : [711/885] 3105945=test_cparser I, [2024-05-07T10:15:49.154136 #3065062] INFO -- : [712/885] 3105945=fuzzer_test I, [2024-05-07T10:15:49.167087 #3065062] INFO -- : [713/885] 3105945=test_rubyvm I, [2024-05-07T10:15:49.242219 #3065062] INFO -- : [714/885] 3105945=test_c_struct_entry I, [2024-05-07T10:15:50.260350 #3065062] INFO -- : [715/885] 3105945=static_inspect_test I, [2024-05-07T10:15:50.278546 #3065062] INFO -- : [716/885] 3105945=test_struct I, [2024-05-07T10:15:50.299293 #3065062] INFO -- : [717/885] 3105945=test_config I, [2024-05-07T10:15:50.400781 #3065062] INFO -- : [718/885] 3105945=test_ostruct I, [2024-05-07T10:15:50.535283 #3065062] INFO -- : [719/885] 3105945=test_depth_first I, [2024-05-07T10:15:50.544186 #3065062] INFO -- : [720/885] 3105945=test_change_word I, [2024-05-07T10:15:50.558396 #3065062] INFO -- : [721/885] 3105945=test_gem_resolver_installed_specification I, [2024-05-07T10:15:50.618509 #3065062] INFO -- : [722/885] 3105945=test_exception_at_throwing I, [2024-05-07T10:15:50.665265 #3065062] INFO -- : [723/885] 3105945=test_ractor I, [2024-05-07T10:15:50.766785 #3065062] INFO -- : [724/885] 3105945=test_stringscanner I, [2024-05-07T10:15:50.799439 #3065062] INFO -- : [725/885] 3105946=json_generic_object_test I, [2024-05-07T10:15:50.803004 #3065062] INFO -- : [726/885] 3105946=test_fiddle I, [2024-05-07T10:15:50.827181 #3065062] INFO -- : [727/885] 3105945=test_gem_resolver_vendor_specification I, [2024-05-07T10:15:50.948622 #3065062] INFO -- : [728/885] 3105945=test_date_arith I, [2024-05-07T10:15:50.959117 #3065062] INFO -- : [729/885] 3105945=test_gem_safe_marshal I, [2024-05-07T10:15:51.011632 #3065062] INFO -- : [730/885] 3105946=test_ractor I, [2024-05-07T10:15:51.078384 #3065062] INFO -- : [731/885] 3105946=test_httpheader I, [2024-05-07T10:15:51.097814 #3065062] INFO -- : [732/885] 3105946=test_sexp I, [2024-05-07T10:15:51.124481 #3065062] INFO -- : [733/885] 3105946=test_rdoc_ri_driver I, [2024-05-07T10:15:51.535158 #3065062] INFO -- : [734/885] 3105946=test_signedness I, [2024-05-07T10:15:52.398529 #3065062] INFO -- : [735/885] 3105945=test_gem_resolver_git_set I, [2024-05-07T10:15:53.005731 #3065062] INFO -- : [736/885] 3105945=test_gem_commands_check_command I, [2024-05-07T10:15:53.045752 #3065062] INFO -- : [737/885] 3105945=test_digest I, [2024-05-07T10:15:53.301025 #3065062] INFO -- : [738/885] 3105946=test_dup I, [2024-05-07T10:15:53.448709 #3065062] INFO -- : [739/885] 3105946=test_rdoc_single_class I, [2024-05-07T10:15:53.459705 #3065062] INFO -- : [740/885] 3105946=test_acceptable I, [2024-05-07T10:15:53.519932 #3065062] INFO -- : [741/885] 3105946=test_gem_ext_cargo_builder_link_flag_converter I, [2024-05-07T10:15:53.604738 #3065062] INFO -- : [742/885] 3105946=test_gem_local_remote_options I, [2024-05-07T10:15:53.670354 #3065062] INFO -- : [743/885] 3105946=test_mutex I, [2024-05-07T10:15:53.864892 #3065062] INFO -- : [744/885] 3105945=test_rdoc_token_stream I, [2024-05-07T10:15:53.876597 #3065062] INFO -- : [745/885] 3105945=test_type I, [2024-05-07T10:15:53.888809 #3065062] INFO -- : [746/885] 3105945=heredoc_dedent_test I, [2024-05-07T10:15:53.900436 #3065062] INFO -- : [747/885] 3105945=test_tmpdir I, [2024-05-07T10:15:53.981834 #3065062] INFO -- : [748/885] 3105945=test_struct I, [2024-05-07T10:15:54.586952 #3065062] INFO -- : [749/885] 3105945=test_gem_package_tar_header I, [2024-05-07T10:15:54.765866 #3065062] INFO -- : [750/885] 3105945=test_ssl_session I, [2024-05-07T10:15:54.795076 #3065062] INFO -- : [751/885] 3105946=test_logperiod I, [2024-05-07T10:15:54.819584 #3065062] INFO -- : [752/885] 3105946=test_case_comprehensive I, [2024-05-07T10:15:54.837097 #3065062] INFO -- : [753/885] 3105944=test_rational2 I, [2024-05-07T10:15:54.847030 #3065062] INFO -- : [754/885] 3105944=test_placearg I, [2024-05-07T10:15:54.911808 #3065062] INFO -- : [755/885] 3105944=test_completion I, [2024-05-07T10:15:55.556326 #3065062] INFO -- : [756/885] 3105945=test_file_exhaustive I, [2024-05-07T10:15:55.633688 #3065062] INFO -- : [757/885] 3105944=test_gem_security_policy I, [2024-05-07T10:15:56.081284 #3065062] INFO -- : [758/885] 3105944=test_rdoc_markup_document I, [2024-05-07T10:15:56.101853 #3065062] INFO -- : [759/885] 3105944=test_delete I, [2024-05-07T10:15:56.110141 #3065062] INFO -- : [760/885] 3105944=parse_stream_test I, [2024-05-07T10:15:56.129498 #3065062] INFO -- : [761/885] 3105944=test_handle I, [2024-05-07T10:15:56.968159 #3065062] INFO -- : [762/885] 3105944=test_io_wait_uncommon I, [2024-05-07T10:15:56.981473 #3065062] INFO -- : [763/885] 3105944=test_continuation I, [2024-05-07T10:15:56.990923 #3065062] INFO -- : [764/885] 3105944=test_fixnum I, [2024-05-07T10:15:57.007364 #3065062] INFO -- : [765/885] 3105944=test_gem_silent_ui I, [2024-05-07T10:15:57.060286 #3065062] INFO -- : [766/885] 3105944=test_signal I, [2024-05-07T10:15:59.073677 #3065062] INFO -- : [767/885] 3105944=test_gem_ci_detector I, [2024-05-07T10:15:59.079808 #3065062] INFO -- : [768/885] 3105944=test_evaluation I, [2024-05-07T10:15:59.087444 #3065062] INFO -- : [769/885] 3105944=test_protocol I, [2024-05-07T10:15:59.454783 #3065062] INFO -- : [770/885] 3105944=test_weakkeymap I, [2024-05-07T10:15:59.812342 #3065062] INFO -- : [771/885] 3105944=test_files_test I, [2024-05-07T10:15:59.821644 #3065062] INFO -- : [772/885] 3105944=test_rdoc_markup_to_ansi I, [2024-05-07T10:15:59.866106 #3065062] INFO -- : [773/885] 3105944=test_object_create_start I, [2024-05-07T10:15:59.871845 #3065062] INFO -- : [774/885] 3105944=test_gem_commands_info_command I, [2024-05-07T10:15:59.911218 #3065062] INFO -- : [775/885] 3105944=test_https I, [2024-05-07T10:16:00.086017 #3065062] INFO -- : [776/885] 3105944=test_gem_request_set_gem_dependency_api I, [2024-05-07T10:16:00.438910 #3065062] INFO -- : [777/885] 3105944=test_name_error_extension I, [2024-05-07T10:16:00.439854 #3065062] INFO -- : [778/885] 3105944=test_rdoc_markup_paragraph I, [2024-05-07T10:16:00.452201 #3065062] INFO -- : [779/885] 3105944=test_x509cert I, [2024-05-07T10:16:00.568096 #3065062] INFO -- : [780/885] 3105944=test_irb I, [2024-05-07T10:16:00.844914 #3065062] INFO -- : [781/885] 3105944=test_variable_name_check I, [2024-05-07T10:16:00.961794 #3065062] INFO -- : [782/885] 3105944=test_bn I, [2024-05-07T10:16:01.013119 #3065062] INFO -- : [783/885] 3105944=test_require_path_check I, [2024-05-07T10:16:01.151186 #3065062] INFO -- : [784/885] 3105944=test_logdevice I, [2024-05-07T10:16:02.020536 #3065062] INFO -- : [785/885] 3105944=test_ast I, [2024-05-07T10:16:08.077159 #3065062] INFO -- : [786/885] 3105945=test_gem_request_set_lockfile_tokenizer I, [2024-05-07T10:16:08.196528 #3065062] INFO -- : [787/885] 3105945=test_lazy_enumerator I, [2024-05-07T10:16:08.668535 #3065062] INFO -- : [788/885] 3105945=test_cgi_multipart I, [2024-05-07T10:16:08.772596 #3065062] INFO -- : [789/885] 3105945=test_autoconf I, [2024-05-07T10:16:08.783213 #3065062] INFO -- : [790/885] 3105945=integer_parse_test I, [2024-05-07T10:16:08.821764 #3065062] INFO -- : [791/885] 3105945=test_ractor_compatibility I, [2024-05-07T10:16:09.154908 #3065062] INFO -- : [792/885] 3105945=test_arithmetic_sequence I, [2024-05-07T10:16:09.163670 #3065062] INFO -- : [793/885] 3105945=test_find_executable I, [2024-05-07T10:16:09.192104 #3065062] INFO -- : [794/885] 3105945=test_ftp I, [2024-05-07T10:16:09.201656 #3065062] INFO -- : [795/885] 3105945=test_sockopt I, [2024-05-07T10:16:09.204305 #3065062] INFO -- : [796/885] 3105945=test_gem_source_fetch_problem I, [2024-05-07T10:16:09.242353 #3065062] INFO -- : [797/885] 3105945=test_rdoc_comment I, [2024-05-07T10:16:09.383333 #3065062] INFO -- : [798/885] 3105945=test_install I, [2024-05-07T10:16:09.549894 #3065062] INFO -- : [799/885] 3105945=test_encoding I, [2024-05-07T10:16:09.566945 #3065062] INFO -- : [800/885] 3105945=command_line_test I, [2024-05-07T10:16:09.584054 #3065062] INFO -- : [801/885] 3105945=test_gem_package_tar_reader I, [2024-05-07T10:16:09.673422 #3065062] INFO -- : [802/885] 3105945=test_gem_commands_signout_command I, [2024-05-07T10:16:09.703849 #3065062] INFO -- : [803/885] 3105945=test_env I, [2024-05-07T10:16:12.256162 #3065062] INFO -- : [804/885] 3105945=test_win32ole_variant_m I, [2024-05-07T10:16:12.298857 #3065062] INFO -- : [805/885] 3105945=test_pair I, [2024-05-07T10:16:15.510183 #3065062] INFO -- : [806/885] 3105946=test_gem_commands_setup_command I, [2024-05-07T10:16:16.317134 #3065062] INFO -- : [807/885] 3105946=test_history I, [2024-05-07T10:16:16.344635 #3065062] INFO -- : [808/885] 3105946=test_document I, [2024-05-07T10:16:16.351890 #3065062] INFO -- : [809/885] 3105946=test_eval I, [2024-05-07T10:16:16.362097 #3065062] INFO -- : [810/885] 3105946=test_gem_safe_yaml I, [2024-05-07T10:16:16.369734 #3065062] INFO -- : [811/885] 3105946=test_singleton_function I, [2024-05-07T10:16:16.413106 #3065062] INFO -- : [812/885] 3105946=test_iseq I, [2024-05-07T10:16:17.006355 #3065062] INFO -- : [813/885] 3105946=test_primitive I, [2024-05-07T10:16:17.019722 #3065062] INFO -- : [814/885] 3105946=test_rdoc_ri_paths I, [2024-05-07T10:16:17.057340 #3065062] INFO -- : [815/885] 3105946=test_parser I, [2024-05-07T10:16:17.142093 #3065062] INFO -- : [816/885] 3105946=test_win32ole_method I, [2024-05-07T10:16:17.154777 #3065062] INFO -- : [817/885] 3105946=test_lexer I, [2024-05-07T10:16:17.190126 #3065062] INFO -- : [818/885] 3105946=test_regex_casefold I, [2024-05-07T10:16:17.629962 #3065062] INFO -- : [819/885] 3105946=test_gem_source_git I, [2024-05-07T10:16:17.692786 #3065062] INFO -- : [820/885] 3105945=test_ripper I, [2024-05-07T10:16:18.001269 #3065062] INFO -- : [821/885] 3105945=test_thread_cv I, [2024-05-07T10:16:18.632830 #3065062] INFO -- : [822/885] 3105946=test_stringio I, [2024-05-07T10:16:18.648833 #3065062] INFO -- : [823/885] 3105945=test_assembler I, [2024-05-07T10:16:18.650725 #3065062] INFO -- : [824/885] 3105945=test_files_ext I, [2024-05-07T10:16:18.657882 #3065062] INFO -- : [825/885] 3105945=test_random I, [2024-05-07T10:16:18.725420 #3065062] INFO -- : [826/885] 3105946=test_eval_history I, [2024-05-07T10:16:18.740224 #3065062] INFO -- : [827/885] 3105946=dispatcher_test I, [2024-05-07T10:16:18.760834 #3065062] INFO -- : [828/885] 3105946=test_unicode I, [2024-05-07T10:16:18.764855 #3065062] INFO -- : [829/885] 3105945=test_autoload I, [2024-05-07T10:16:18.786492 #3065062] INFO -- : [830/885] 3105946=test_gem_package I, [2024-05-07T10:16:19.626000 #3065062] INFO -- : [831/885] 3105946=test_array I, [2024-05-07T10:16:23.186388 #3065062] INFO -- : [832/885] 3105945=test_at_exit I, [2024-05-07T10:16:23.196908 #3065062] INFO -- : [833/885] 3105945=test_benchmark I, [2024-05-07T10:16:25.129275 #3065062] INFO -- : [834/885] 3105945=test_have_macro I, [2024-05-07T10:16:25.403230 #3065062] INFO -- : [835/885] 3105945=test_gem_source I, [2024-05-07T10:16:25.835263 #3065062] INFO -- : [836/885] 3105945=test_mkmf I, [2024-05-07T10:16:25.881263 #3065062] INFO -- : [837/885] 3105945=test_class I, [2024-05-07T10:16:25.894720 #3065062] INFO -- : [838/885] 3105945=test_ipaddr I, [2024-05-07T10:16:25.930423 #3065062] INFO -- : [839/885] 3105945=test_scanner_events I, [2024-05-07T10:16:25.976512 #3065062] INFO -- : [840/885] 3105945=test_ocsp I, [2024-05-07T10:16:26.063551 #3065062] INFO -- : [841/885] 3105945=test_omap I, [2024-05-07T10:16:26.085691 #3065062] INFO -- : [842/885] 3105945=test_date_strptime I, [2024-05-07T10:16:26.223198 #3065062] INFO -- : [843/885] 3105945=test_shellwords I, [2024-05-07T10:16:26.236442 #3065062] INFO -- : [844/885] 3105945=test_mul I, [2024-05-07T10:16:26.252231 #3065062] INFO -- : [845/885] 3105945=test_rdoc_generator_pot_po I, [2024-05-07T10:16:26.255107 #3065062] INFO -- : [846/885] 3105945=test_gem_ext_configure_builder I, [2024-05-07T10:16:26.341609 #3065062] INFO -- : [847/885] 3105945=json_ext_parser_test I, [2024-05-07T10:16:26.344779 #3065062] INFO -- : [848/885] 3105945=test_nonblock I, [2024-05-07T10:16:26.381004 #3065062] INFO -- : [849/885] 3105945=test_rdoc_parser_simple I, [2024-05-07T10:16:26.442495 #3065062] INFO -- : [850/885] 3105945=test_io_m17n I, [2024-05-07T10:16:27.737270 #3065062] INFO -- : [851/885] 3105945=test_rdoc_top_level I, [2024-05-07T10:16:28.043887 #3065062] INFO -- : [852/885] 3105945=test_float I, [2024-05-07T10:16:30.341006 #3065062] INFO -- : [853/885] 3105945=test_gem_stub_specification I, [2024-05-07T10:16:30.576029 #3065062] INFO -- : [854/885] 3105945=test_cmethod I, [2024-05-07T10:16:30.591591 #3065062] INFO -- : [855/885] 3105945=test_color I, [2024-05-07T10:16:30.670000 #3065062] INFO -- : [856/885] 3105945=test_gb18030 I, [2024-05-07T10:16:30.682513 #3065062] INFO -- : [857/885] 3105945=test_propertyputref I, [2024-05-07T10:16:30.686544 #3065062] INFO -- : [858/885] 3105945=test_reline_key I, [2024-05-07T10:16:30.697124 #3065062] INFO -- : [859/885] 3105945=test_gem_commands_lock_command I, [2024-05-07T10:16:30.842145 #3065062] INFO -- : [860/885] 3105945=test_unicode_normalize I, [2024-05-07T10:16:33.289573 #3065062] INFO -- : [861/885] 3105946=test_rdoc_generator_ri I, [2024-05-07T10:16:33.294480 #3065062] INFO -- : [862/885] 3105946=test_gem_stream_ui I, [2024-05-07T10:16:33.428779 #3065062] INFO -- : [863/885] 3105946=test_files_test_1 I, [2024-05-07T10:16:33.438854 #3065062] INFO -- : [864/885] 3105946=test_dir I, [2024-05-07T10:16:33.816552 #3065062] INFO -- : [865/885] 3105946=test_rubygems I, [2024-05-07T10:16:33.936716 #3065062] INFO -- : [866/885] 3105946=test_resolve_symbol I, [2024-05-07T10:16:34.010720 #3065062] INFO -- : [867/885] 3105946=test_closure I, [2024-05-07T10:16:34.875742 #3065062] INFO -- : [868/885] 3105945=test_digest I, [2024-05-07T10:16:34.892666 #3065062] INFO -- : [869/885] 3105945=test_path I, [2024-05-07T10:16:34.906058 #3065062] INFO -- : [870/885] 3105945=test_rdoc_rd_inline I, [2024-05-07T10:16:35.017037 #3065062] INFO -- : [871/885] 3105945=test_io I, [2024-05-07T10:16:36.802585 #3065062] INFO -- : [872/885] 3105946=test_uncorrectable_name_check I, [2024-05-07T10:16:36.807417 #3065062] INFO -- : [873/885] 3105946=test_printf I, [2024-05-07T10:16:36.824766 #3065062] INFO -- : [874/885] 3105946=test_x509attr I, [2024-05-07T10:16:36.870351 #3065062] INFO -- : [875/885] 3105946=test_workspace I, [2024-05-07T10:16:36.945284 #3065062] INFO -- : [876/885] 3105946=test_cgi_modruby I, [2024-05-07T10:16:36.956040 #3065062] INFO -- : [877/885] 3105946=magic_comment_test I, [2024-05-07T10:16:36.967510 #3065062] INFO -- : [878/885] 3105946=test_win32ole_variant I, [2024-05-07T10:16:36.967709 #3065062] INFO -- : [879/885] 3105946=test_win32ole_param_event I, [2024-05-07T10:16:36.977065 #3065062] INFO -- : [880/885] 3105946=test_rdoc_parser I, [2024-05-07T10:16:36.998215 #3065062] INFO -- : [881/885] 3105946=test_https_proxy I, [2024-05-07T10:16:37.008343 #3065062] INFO -- : [882/885] 3105946=test_etc I, [2024-05-07T10:16:37.107296 #3065062] INFO -- : [883/885] 3105946=test_gem_commands_rebuild_command I, [2024-05-07T10:16:37.166441 #3065062] INFO -- : [884/885] 3105946=test_nomethod_error I, [2024-05-07T10:16:37.174361 #3065062] INFO -- : [885/885] 3105946=test_stat I, [2024-05-07T10:16:51.667904 #3065062] INFO -- : Finished tests in 207.861106s, 126.6230 tests/s, 44980.6565 assertions/s. E, [2024-05-07T10:16:51.668056 #3065062] ERROR -- : Children under /tmp/rubytest.tyy4ha: E, [2024-05-07T10:16:51.668184 #3065062] ERROR -- : * drwx------ 4 28 2024-05-07 10:16:37 +0000 gem_rebuild20240507-3105946-qu8t9g/ E, [2024-05-07T10:16:51.668218 #3065062] ERROR -- : * drwxrwxr-x 2 40 2024-05-07 10:16:37 +0000 old/ E, [2024-05-07T10:16:51.668250 #3065062] ERROR -- : * -rw-rw-r-- 1 4096 2024-05-07 10:16:37 +0000 rebuild_test_gem-1.0.0.gem E, [2024-05-07T10:16:51.668402 #3065062] ERROR -- : * drwxrwxr-x 2 40 2024-05-07 10:16:37 +0000 new/ E, [2024-05-07T10:16:51.668426 #3065062] ERROR -- : * -rw-rw-r-- 1 4096 2024-05-07 10:16:37 +0000 rebuild_test_gem-1.0.0.gem I, [2024-05-07T10:16:51.674253 #3065062] INFO -- : 26320 tests, 9349729 assertions, 0 failures, 0 errors, 320 skips I, [2024-05-07T10:16:51.674279 #3065062] INFO -- : I, [2024-05-07T10:16:51.674289 #3065062] INFO -- : ruby -v: ruby 3.4.0dev (2024-05-07T06:59:36Z master e1e6b4972f) [aarch64-linux] I, [2024-05-07T10:16:51.675114 #3065062] INFO -- : $$$[end] "make yes-test-all TESTOPTS='--stderr-on-failure' TESTS='-j3'" exit with 0. I, [2024-05-07T10:16:51.675265 #3065062] INFO -- : $$$[beg] make yes-test-rubyspec MSPECOPT='--error-output stderr --debug -j' TESTS='-j3' I, [2024-05-07T10:16:51.801466 #3065062] INFO -- : BASERUBY = /usr/local/bin/ruby --disable=gems I, [2024-05-07T10:16:51.801549 #3065062] INFO -- : CC = gcc I, [2024-05-07T10:16:51.801564 #3065062] INFO -- : LD = ld I, [2024-05-07T10:16:51.801573 #3065062] INFO -- : LDSHARED = gcc -shared I, [2024-05-07T10:16:51.801586 #3065062] INFO -- : CFLAGS = -O3 -fno-fast-math -ggdb3 -Wall -Wextra -Wdeprecated-declarations -Wdiv-by-zero -Wduplicated-cond -Wimplicit-function-declaration -Wimplicit-int -Wpointer-arith -Wwrite-strings -Wold-style-definition -Wimplicit-fallthrough=0 -Wmissing-noreturn -Wno-cast-function-type -Wno-constant-logical-operand -Wno-long-long -Wno-missing-field-initializers -Wno-overlength-strings -Wno-packed-bitfield-compat -Wno-parentheses-equality -Wno-self-assign -Wno-tautological-compare -Wno-unused-parameter -Wno-unused-value -Wsuggest-attribute=format -Wsuggest-attribute=noreturn -Wunused-variable -Wmisleading-indentation -Wundef I, [2024-05-07T10:16:51.801596 #3065062] INFO -- : XCFLAGS = -U_FORTIFY_SOURCE -D_FORTIFY_SOURCE=2 -fstack-protector-strong -msign-return-address=all -fno-strict-overflow -fvisibility=hidden -fexcess-precision=standard -DRUBY_EXPORT -fPIE -I. -I.ext/include/aarch64-linux -I/home/opc/ruby/src/master/include -I/home/opc/ruby/src/master -I/home/opc/ruby/src/master/prism -I/home/opc/ruby/src/master/enc/unicode/15.0.0 I, [2024-05-07T10:16:51.801605 #3065062] INFO -- : CPPFLAGS = I, [2024-05-07T10:16:51.801613 #3065062] INFO -- : DLDFLAGS = -Wl,--compress-debug-sections=zlib -fstack-protector-strong -pie I, [2024-05-07T10:16:51.801623 #3065062] INFO -- : SOLIBS = -lz -lrt -lrt -ldl -lcrypt -lm -lpthread I, [2024-05-07T10:16:51.801631 #3065062] INFO -- : LANG = en_US.UTF-8 I, [2024-05-07T10:16:51.801639 #3065062] INFO -- : LC_ALL = I, [2024-05-07T10:16:51.801647 #3065062] INFO -- : LC_CTYPE = I, [2024-05-07T10:16:51.801655 #3065062] INFO -- : MFLAGS = I, [2024-05-07T10:16:51.801663 #3065062] INFO -- : RUSTC = rustc I, [2024-05-07T10:16:51.801671 #3065062] INFO -- : YJIT_RUSTC_ARGS = --crate-name=yjit --crate-type=staticlib --edition=2021 -g -C lto=thin -C opt-level=3 -C overflow-checks=on '--out-dir=/home/opc/ruby/build/master/yjit/target/release/' /home/opc/ruby/src/master/yjit/src/lib.rs I, [2024-05-07T10:16:51.802564 #3065062] INFO -- : gcc (GCC) 8.5.0 20210514 (Red Hat 8.5.0-10.1.0.1) I, [2024-05-07T10:16:51.802582 #3065062] INFO -- : Copyright (C) 2018 Free Software Foundation, Inc. I, [2024-05-07T10:16:51.802591 #3065062] INFO -- : This is free software; see the source for copying conditions. There is NO I, [2024-05-07T10:16:51.802600 #3065062] INFO -- : warranty; not even for MERCHANTABILITY or FITNESS FOR A PARTICULAR PURPOSE. I, [2024-05-07T10:16:51.802608 #3065062] INFO -- : I, [2024-05-07T10:16:51.804633 #3065062] INFO -- : generating enc.mk I, [2024-05-07T10:16:52.048229 #3065062] INFO -- : making enc I, [2024-05-07T10:16:52.075837 #3065062] INFO -- : make[1]: Entering directory '/home/opc/ruby/build/master' I, [2024-05-07T10:16:52.075902 #3065062] INFO -- : make[1]: Nothing to be done for 'enc'. I, [2024-05-07T10:16:52.075913 #3065062] INFO -- : make[1]: Leaving directory '/home/opc/ruby/build/master' I, [2024-05-07T10:16:52.076689 #3065062] INFO -- : making srcs under enc I, [2024-05-07T10:16:52.119025 #3065062] INFO -- : make[1]: Entering directory '/home/opc/ruby/build/master' I, [2024-05-07T10:16:52.119094 #3065062] INFO -- : make[1]: Nothing to be done for 'srcs'. I, [2024-05-07T10:16:52.119114 #3065062] INFO -- : make[1]: Leaving directory '/home/opc/ruby/build/master' I, [2024-05-07T10:16:52.120209 #3065062] INFO -- : generating transdb.h I, [2024-05-07T10:16:52.270805 #3065062] INFO -- : transdb.h unchanged I, [2024-05-07T10:16:52.272172 #3065062] INFO -- : making trans I, [2024-05-07T10:16:52.320513 #3065062] INFO -- : make[1]: Entering directory '/home/opc/ruby/build/master' I, [2024-05-07T10:16:52.320589 #3065062] INFO -- : make[1]: Nothing to be done for 'trans'. I, [2024-05-07T10:16:52.320612 #3065062] INFO -- : make[1]: Leaving directory '/home/opc/ruby/build/master' I, [2024-05-07T10:16:52.321418 #3065062] INFO -- : making encs I, [2024-05-07T10:16:52.373691 #3065062] INFO -- : make[1]: Entering directory '/home/opc/ruby/build/master' I, [2024-05-07T10:16:52.373761 #3065062] INFO -- : make[1]: Nothing to be done for 'encs'. I, [2024-05-07T10:16:52.373772 #3065062] INFO -- : make[1]: Leaving directory '/home/opc/ruby/build/master' I, [2024-05-07T10:16:52.375843 #3065062] INFO -- : generating makefiles ext/configure-ext.mk I, [2024-05-07T10:16:52.415017 #3065062] INFO -- : ext/configure-ext.mk updated I, [2024-05-07T10:16:52.418764 #3065062] INFO -- : make[1]: Entering directory '/home/opc/ruby/build/master' I, [2024-05-07T10:16:54.492089 #3065062] INFO -- : make[1]: Leaving directory '/home/opc/ruby/build/master' I, [2024-05-07T10:16:54.492801 #3065062] INFO -- : generating makefile exts.mk I, [2024-05-07T10:16:54.553162 #3065062] INFO -- : exts.mk unchanged I, [2024-05-07T10:16:54.558038 #3065062] INFO -- : make[1]: Entering directory '/home/opc/ruby/build/master' I, [2024-05-07T10:16:54.852706 #3065062] INFO -- : make[2]: Entering directory '/home/opc/ruby/build/master/ext/coverage' I, [2024-05-07T10:16:54.857260 #3065062] INFO -- : make[2]: Leaving directory '/home/opc/ruby/build/master/ext/coverage' I, [2024-05-07T10:16:54.862840 #3065062] INFO -- : make[2]: Entering directory '/home/opc/ruby/build/master/ext/date' I, [2024-05-07T10:16:54.868015 #3065062] INFO -- : make[2]: Leaving directory '/home/opc/ruby/build/master/ext/date' I, [2024-05-07T10:16:54.871328 #3065062] INFO -- : make[2]: Entering directory '/home/opc/ruby/build/master/ext/digest' I, [2024-05-07T10:16:54.879946 #3065062] INFO -- : make[2]: Leaving directory '/home/opc/ruby/build/master/ext/digest' I, [2024-05-07T10:16:54.902526 #3065062] INFO -- : make[2]: Entering directory '/home/opc/ruby/build/master/ext/digest/sha2' I, [2024-05-07T10:16:54.908144 #3065062] INFO -- : make[2]: Leaving directory '/home/opc/ruby/build/master/ext/digest/sha2' I, [2024-05-07T10:16:54.926561 #3065062] INFO -- : make[2]: Entering directory '/home/opc/ruby/build/master/ext/fiddle' I, [2024-05-07T10:16:54.936814 #3065062] INFO -- : make[2]: Leaving directory '/home/opc/ruby/build/master/ext/fiddle' I, [2024-05-07T10:16:54.941203 #3065062] INFO -- : make[2]: Entering directory '/home/opc/ruby/build/master/ext/io/console' I, [2024-05-07T10:16:54.945650 #3065062] INFO -- : make[2]: Leaving directory '/home/opc/ruby/build/master/ext/io/console' I, [2024-05-07T10:16:54.956258 #3065062] INFO -- : make[2]: Entering directory '/home/opc/ruby/build/master/ext/json' I, [2024-05-07T10:16:54.965628 #3065062] INFO -- : make[2]: Leaving directory '/home/opc/ruby/build/master/ext/json' I, [2024-05-07T10:16:54.978385 #3065062] INFO -- : make[2]: Entering directory '/home/opc/ruby/build/master/ext/monitor' I, [2024-05-07T10:16:54.982432 #3065062] INFO -- : make[2]: Leaving directory '/home/opc/ruby/build/master/ext/monitor' I, [2024-05-07T10:16:54.988429 #3065062] INFO -- : make[2]: Entering directory '/home/opc/ruby/build/master/ext/objspace' I, [2024-05-07T10:16:54.994159 #3065062] INFO -- : make[2]: Leaving directory '/home/opc/ruby/build/master/ext/objspace' I, [2024-05-07T10:16:55.013201 #3065062] INFO -- : make[2]: Entering directory '/home/opc/ruby/build/master/ext/openssl' I, [2024-05-07T10:16:55.034831 #3065062] INFO -- : make[2]: Leaving directory '/home/opc/ruby/build/master/ext/openssl' I, [2024-05-07T10:16:55.039114 #3065062] INFO -- : make[2]: Entering directory '/home/opc/ruby/build/master/ext/pathname' I, [2024-05-07T10:16:55.043306 #3065062] INFO -- : make[2]: Leaving directory '/home/opc/ruby/build/master/ext/pathname' I, [2024-05-07T10:16:55.049589 #3065062] INFO -- : make[2]: Entering directory '/home/opc/ruby/build/master/ext/psych' I, [2024-05-07T10:16:55.070887 #3065062] INFO -- : make[2]: Leaving directory '/home/opc/ruby/build/master/ext/psych' I, [2024-05-07T10:16:55.075329 #3065062] INFO -- : make[2]: Entering directory '/home/opc/ruby/build/master/ext/pty' I, [2024-05-07T10:16:55.079505 #3065062] INFO -- : make[2]: Leaving directory '/home/opc/ruby/build/master/ext/pty' I, [2024-05-07T10:16:55.092887 #3065062] INFO -- : make[2]: Entering directory '/home/opc/ruby/build/master/ext/ripper' I, [2024-05-07T10:16:55.100571 #3065062] INFO -- : make[2]: Leaving directory '/home/opc/ruby/build/master/ext/ripper' I, [2024-05-07T10:16:55.102497 #3065062] INFO -- : make[2]: Entering directory '/home/opc/ruby/build/master/ext/rubyvm' I, [2024-05-07T10:16:55.106016 #3065062] INFO -- : make[2]: Leaving directory '/home/opc/ruby/build/master/ext/rubyvm' I, [2024-05-07T10:16:55.118100 #3065062] INFO -- : make[2]: Entering directory '/home/opc/ruby/build/master/ext/socket' I, [2024-05-07T10:16:55.128697 #3065062] INFO -- : make[2]: Leaving directory '/home/opc/ruby/build/master/ext/socket' I, [2024-05-07T10:16:55.143706 #3065062] INFO -- : make[2]: Entering directory '/home/opc/ruby/build/master/.bundle/gems/bigdecimal-3.1.7/ext/bigdecimal' I, [2024-05-07T10:16:55.174334 #3065062] INFO -- : make[2]: Leaving directory '/home/opc/ruby/build/master/.bundle/gems/bigdecimal-3.1.7/ext/bigdecimal' I, [2024-05-07T10:16:55.176938 #3065062] INFO -- : make[2]: Entering directory '/home/opc/ruby/build/master/.bundle/gems/bigdecimal-3.1.8/ext/bigdecimal' I, [2024-05-07T10:16:55.207090 #3065062] INFO -- : make[2]: Leaving directory '/home/opc/ruby/build/master/.bundle/gems/bigdecimal-3.1.8/ext/bigdecimal' I, [2024-05-07T10:16:55.209659 #3065062] INFO -- : make[2]: Entering directory '/home/opc/ruby/build/master/.bundle/gems/debug-1.9.2/ext/debug' I, [2024-05-07T10:16:55.239716 #3065062] INFO -- : make[2]: Leaving directory '/home/opc/ruby/build/master/.bundle/gems/debug-1.9.2/ext/debug' I, [2024-05-07T10:16:55.242244 #3065062] INFO -- : make[2]: Entering directory '/home/opc/ruby/build/master/.bundle/gems/nkf-0.2.0/ext/nkf' I, [2024-05-07T10:16:55.272685 #3065062] INFO -- : make[2]: Leaving directory '/home/opc/ruby/build/master/.bundle/gems/nkf-0.2.0/ext/nkf' I, [2024-05-07T10:16:55.275281 #3065062] INFO -- : make[2]: Entering directory '/home/opc/ruby/build/master/.bundle/gems/racc-1.7.3/ext/racc/cparse' I, [2024-05-07T10:16:55.305657 #3065062] INFO -- : make[2]: Leaving directory '/home/opc/ruby/build/master/.bundle/gems/racc-1.7.3/ext/racc/cparse' I, [2024-05-07T10:16:55.308580 #3065062] INFO -- : make[2]: Entering directory '/home/opc/ruby/build/master/.bundle/gems/rbs-3.4.4/ext/rbs_extension' I, [2024-05-07T10:16:55.340140 #3065062] INFO -- : make[2]: Leaving directory '/home/opc/ruby/build/master/.bundle/gems/rbs-3.4.4/ext/rbs_extension' I, [2024-05-07T10:16:55.342789 #3065062] INFO -- : make[2]: Entering directory '/home/opc/ruby/build/master/.bundle/gems/syslog-0.1.2/ext/syslog' I, [2024-05-07T10:16:55.374100 #3065062] INFO -- : make[2]: Leaving directory '/home/opc/ruby/build/master/.bundle/gems/syslog-0.1.2/ext/syslog' I, [2024-05-07T10:16:55.412269 #3065062] INFO -- : make[2]: Entering directory '/home/opc/ruby/build/master' I, [2024-05-07T10:16:55.496165 #3065062] INFO -- : make[2]: 'ruby' is up to date. I, [2024-05-07T10:16:55.496258 #3065062] INFO -- : make[2]: Leaving directory '/home/opc/ruby/build/master' I, [2024-05-07T10:16:55.496367 #3065062] INFO -- : make[1]: Leaving directory '/home/opc/ruby/build/master' I, [2024-05-07T10:16:55.500805 #3065062] INFO -- : make[1]: Entering directory '/home/opc/ruby/build/master' I, [2024-05-07T10:16:55.500826 #3065062] INFO -- : make[1]: Nothing to be done for 'note'. I, [2024-05-07T10:16:55.500836 #3065062] INFO -- : make[1]: Leaving directory '/home/opc/ruby/build/master' E, [2024-05-07T10:16:55.574890 #3065062] ERROR -- : $ /home/opc/ruby/build/master/miniruby -I/home/opc/ruby/src/master/lib /home/opc/ruby/src/master/tool/runruby.rb --archdir=/home/opc/ruby/build/master --extout=.ext -- /home/opc/ruby/src/master/spec/mspec/bin/mspec-run -B /home/opc/ruby/src/master/spec/default.mspec --error-output stderr --debug -fy -o /tmp/rubytest.af17bi/1-mspec-multi-0 E, [2024-05-07T10:16:55.575232 #3065062] ERROR -- : $ /home/opc/ruby/build/master/miniruby -I/home/opc/ruby/src/master/lib /home/opc/ruby/src/master/tool/runruby.rb --archdir=/home/opc/ruby/build/master --extout=.ext -- /home/opc/ruby/src/master/spec/mspec/bin/mspec-run -B /home/opc/ruby/src/master/spec/default.mspec --error-output stderr --debug -fy -o /tmp/rubytest.af17bi/2-mspec-multi-1 E, [2024-05-07T10:16:55.575461 #3065062] ERROR -- : $ /home/opc/ruby/build/master/miniruby -I/home/opc/ruby/src/master/lib /home/opc/ruby/src/master/tool/runruby.rb --archdir=/home/opc/ruby/build/master --extout=.ext -- /home/opc/ruby/src/master/spec/mspec/bin/mspec-run -B /home/opc/ruby/src/master/spec/default.mspec --error-output stderr --debug -fy -o /tmp/rubytest.af17bi/3-mspec-multi-2 I, [2024-05-07T10:16:55.703936 #3065062] INFO -- : ruby 3.4.0dev (2024-05-07T06:59:36Z master e1e6b4972f) [aarch64-linux] I, [2024-05-07T10:17:01.022535 #3065062] INFO -- : 0 ......................................................................... I, [2024-05-07T10:17:03.438568 #3065062] INFO -- : 73 ......................................................................... I, [2024-05-07T10:17:03.597725 #3065062] INFO -- : 146 ......................................................................... I, [2024-05-07T10:17:03.891824 #3065062] INFO -- : 219 ......................................................................... I, [2024-05-07T10:17:04.045645 #3065062] INFO -- : 292 ......................................................................... I, [2024-05-07T10:17:04.294257 #3065062] INFO -- : 365 ......................................................................... I, [2024-05-07T10:17:04.408954 #3065062] INFO -- : 438 ......................................................................... I, [2024-05-07T10:17:04.466524 #3065062] INFO -- : 511 ......................................................................... I, [2024-05-07T10:17:04.525733 #3065062] INFO -- : 584 ......................................................................... I, [2024-05-07T10:17:05.189008 #3065062] INFO -- : 657 ......................................................................... I, [2024-05-07T10:17:05.289966 #3065062] INFO -- : 730 ......................................................................... I, [2024-05-07T10:17:05.338694 #3065062] INFO -- : 803 ......................................................................... I, [2024-05-07T10:17:05.530354 #3065062] INFO -- : 876 ......................................................................... I, [2024-05-07T10:17:05.640131 #3065062] INFO -- : 949 ......................................................................... I, [2024-05-07T10:17:06.243034 #3065062] INFO -- : 1022 ......................................................................... I, [2024-05-07T10:17:08.574535 #3065062] INFO -- : 1095 ......................................................................... I, [2024-05-07T10:17:09.352545 #3065062] INFO -- : 1168 ......................................................................... I, [2024-05-07T10:17:09.535325 #3065062] INFO -- : 1241 ......................................................................... I, [2024-05-07T10:17:09.717469 #3065062] INFO -- : 1314 ......................................................................... I, [2024-05-07T10:17:09.812911 #3065062] INFO -- : 1387 ......................................................................... I, [2024-05-07T10:17:11.856542 #3065062] INFO -- : 1460 ......................................................................... I, [2024-05-07T10:17:14.986226 #3065062] INFO -- : 1533 ......................................................................... I, [2024-05-07T10:17:15.202165 #3065062] INFO -- : 1606 ......................................................................... I, [2024-05-07T10:17:15.995563 #3065062] INFO -- : 1679 ......................................................................... I, [2024-05-07T10:17:16.308169 #3065062] INFO -- : 1752 ......................................................................... I, [2024-05-07T10:17:16.571251 #3065062] INFO -- : 1825 ......................................................................... I, [2024-05-07T10:17:16.905343 #3065062] INFO -- : 1898 ......................................................................... I, [2024-05-07T10:17:17.323452 #3065062] INFO -- : 1971 ......................................................................... I, [2024-05-07T10:17:17.821452 #3065062] INFO -- : 2044 ......................................................................... I, [2024-05-07T10:17:17.897929 #3065062] INFO -- : 2117 ......................................................................... I, [2024-05-07T10:17:17.953840 #3065062] INFO -- : 2190 ......................................................................... I, [2024-05-07T10:17:18.002687 #3065062] INFO -- : 2263 ......................................................................... I, [2024-05-07T10:17:18.049279 #3065062] INFO -- : 2336 ......................................................................... I, [2024-05-07T10:17:18.142038 #3065062] INFO -- : 2409 ......................................................................... I, [2024-05-07T10:17:18.417952 #3065062] INFO -- : 2482 ......................................................................... I, [2024-05-07T10:17:18.549177 #3065062] INFO -- : 2555 ......................................................................... I, [2024-05-07T10:17:19.845456 #3065062] INFO -- : 2628 ......................................................................... I, [2024-05-07T10:17:19.994498 #3065062] INFO -- : 2701 ......................................................................... I, [2024-05-07T10:17:20.137090 #3065062] INFO -- : 2774 ......................................................................... I, [2024-05-07T10:17:20.462883 #3065062] INFO -- : 2847 ......................................................................... I, [2024-05-07T10:17:20.730446 #3065062] INFO -- : 2920 ......................................................................... I, [2024-05-07T10:17:20.852194 #3065062] INFO -- : 2993 ......................................................................... I, [2024-05-07T10:17:20.914227 #3065062] INFO -- : 3066 ......................................................................... I, [2024-05-07T10:17:20.967433 #3065062] INFO -- : 3139 ......................................................................... I, [2024-05-07T10:17:21.030136 #3065062] INFO -- : 3212 ......................................................................... I, [2024-05-07T10:17:21.107696 #3065062] INFO -- : 3285 ......................................................................... I, [2024-05-07T10:17:24.940015 #3065062] INFO -- : 3358 ........................................................................ I, [2024-05-07T10:17:24.940087 #3065062] INFO -- : I, [2024-05-07T10:17:24.940099 #3065062] INFO -- : Finished in 29.365055 seconds I, [2024-05-07T10:17:24.940108 #3065062] INFO -- : I, [2024-05-07T10:17:24.940117 #3065062] INFO -- : 3429 files, 32606 examples, 181317 expectations, 0 failures, 0 errors, 0 tagged I, [2024-05-07T10:17:24.941976 #3065062] INFO -- : $$$[end] "make yes-test-rubyspec MSPECOPT='--error-output stderr --debug -j' TESTS='-j3'" exit with 0.