# Logfile created on 2024-05-07 08:05:57 +0000 by logger.rb/v1.5.3 I, [2024-05-07T08:05:57.898618 #1604567] INFO -- : #, @formatter=nil, @logdev=#, @binmode=false, @mon_data=#, @mon_data_owner_object_id=860>>> I, [2024-05-07T08:05:57.898903 #1604567] INFO -- : $$$[beg] make update-unicode -j3 I, [2024-05-07T08:05:57.989263 #1604567] INFO -- : Downloading Unicode emoji 15.0 files... I, [2024-05-07T08:05:57.989448 #1604567] INFO -- : Downloading Unicode emoji 15.0 files... I, [2024-05-07T08:05:57.989727 #1604567] INFO -- : Downloading Unicode emoji 15.0 files... I, [2024-05-07T08:05:58.065054 #1604567] INFO -- : made symlink emoji/15.0/emoji-sequences.txt to /home/opc/ruby/src/master/.downloaded-cache/emoji/15.0/emoji-sequences.txt I, [2024-05-07T08:05:58.070939 #1604567] INFO -- : downloading emoji/15.0/emoji-test.txt ... /home/opc/ruby/src/master/enc/unicode/data/emoji/15.0/emoji-sequences.txt already exists I, [2024-05-07T08:05:58.071071 #1604567] INFO -- : /home/opc/ruby/src/master/enc/unicode/data/emoji/15.0/emoji-sequences.txt already exists E, [2024-05-07T08:05:58.596997 #1604567] ERROR -- : /home/opc/ruby/src/master/tool/downloader.rb:302:in `rescue in download': failed to download emoji/15.0/emoji-test.txt (RuntimeError) E, [2024-05-07T08:05:58.597064 #1604567] ERROR -- : OpenURI::HTTPError: 403 Forbidden: https://www.unicode.org/Public/emoji/15.0/emoji-test.txt E, [2024-05-07T08:05:58.597075 #1604567] ERROR -- : from /home/opc/ruby/src/master/tool/downloader.rb:201:in `download' E, [2024-05-07T08:05:58.597084 #1604567] ERROR -- : from /home/opc/ruby/src/master/tool/downloader.rb:136:in `download' E, [2024-05-07T08:05:58.597129 #1604567] ERROR -- : from /home/opc/ruby/src/master/tool/downloader.rb:482:in `block in
' E, [2024-05-07T08:05:58.597142 #1604567] ERROR -- : from /home/opc/ruby/src/master/tool/downloader.rb:465:in `each' E, [2024-05-07T08:05:58.597151 #1604567] ERROR -- : from /home/opc/ruby/src/master/tool/downloader.rb:465:in `
' E, [2024-05-07T08:05:58.597159 #1604567] ERROR -- : /usr/local/lib/ruby/3.2.0/open-uri.rb:369:in `open_http': 403 Forbidden (OpenURI::HTTPError) E, [2024-05-07T08:05:58.597167 #1604567] ERROR -- : from /usr/local/lib/ruby/3.2.0/open-uri.rb:760:in `buffer_open' E, [2024-05-07T08:05:58.597175 #1604567] ERROR -- : from /usr/local/lib/ruby/3.2.0/open-uri.rb:214:in `block in open_loop' E, [2024-05-07T08:05:58.597184 #1604567] ERROR -- : from /usr/local/lib/ruby/3.2.0/open-uri.rb:212:in `catch' E, [2024-05-07T08:05:58.597192 #1604567] ERROR -- : from /usr/local/lib/ruby/3.2.0/open-uri.rb:212:in `open_loop' E, [2024-05-07T08:05:58.597200 #1604567] ERROR -- : from /usr/local/lib/ruby/3.2.0/open-uri.rb:153:in `open_uri' E, [2024-05-07T08:05:58.597208 #1604567] ERROR -- : from /usr/local/lib/ruby/3.2.0/open-uri.rb:740:in `open' E, [2024-05-07T08:05:58.597220 #1604567] ERROR -- : from /usr/local/lib/ruby/3.2.0/open-uri.rb:748:in `read' E, [2024-05-07T08:05:58.597229 #1604567] ERROR -- : from /home/opc/ruby/src/master/tool/downloader.rb:247:in `block in download' E, [2024-05-07T08:05:58.597237 #1604567] ERROR -- : from /home/opc/ruby/src/master/tool/downloader.rb:378:in `with_retry' E, [2024-05-07T08:05:58.597245 #1604567] ERROR -- : from /home/opc/ruby/src/master/tool/downloader.rb:246:in `download' E, [2024-05-07T08:05:58.597253 #1604567] ERROR -- : from /home/opc/ruby/src/master/tool/downloader.rb:136:in `download' E, [2024-05-07T08:05:58.597261 #1604567] ERROR -- : from /home/opc/ruby/src/master/tool/downloader.rb:482:in `block in
' E, [2024-05-07T08:05:58.597269 #1604567] ERROR -- : from /home/opc/ruby/src/master/tool/downloader.rb:465:in `each' E, [2024-05-07T08:05:58.597277 #1604567] ERROR -- : from /home/opc/ruby/src/master/tool/downloader.rb:465:in `
' E, [2024-05-07T08:05:58.600001 #1604567] ERROR -- : make: *** [uncommon.mk:1787: /home/opc/ruby/src/master/enc/unicode/data/emoji/15.0/emoji-zwj-sequences.txt] Error 1 E, [2024-05-07T08:05:58.600035 #1604567] ERROR -- : make: *** Waiting for unfinished jobs.... E, [2024-05-07T08:05:58.631937 #1604567] ERROR -- : /home/opc/ruby/src/master/tool/downloader.rb:302:in `rescue in download': failed to download emoji/15.0/emoji-test.txt (RuntimeError) E, [2024-05-07T08:05:58.631986 #1604567] ERROR -- : OpenURI::HTTPError: 403 Forbidden: https://www.unicode.org/Public/emoji/15.0/emoji-test.txt E, [2024-05-07T08:05:58.631996 #1604567] ERROR -- : from /home/opc/ruby/src/master/tool/downloader.rb:201:in `download' E, [2024-05-07T08:05:58.632005 #1604567] ERROR -- : from /home/opc/ruby/src/master/tool/downloader.rb:136:in `download' E, [2024-05-07T08:05:58.632013 #1604567] ERROR -- : from /home/opc/ruby/src/master/tool/downloader.rb:482:in `block in
' E, [2024-05-07T08:05:58.632021 #1604567] ERROR -- : from /home/opc/ruby/src/master/tool/downloader.rb:465:in `each' E, [2024-05-07T08:05:58.632029 #1604567] ERROR -- : from /home/opc/ruby/src/master/tool/downloader.rb:465:in `
' E, [2024-05-07T08:05:58.632038 #1604567] ERROR -- : /usr/local/lib/ruby/3.2.0/open-uri.rb:369:in `open_http': 403 Forbidden (OpenURI::HTTPError) E, [2024-05-07T08:05:58.632046 #1604567] ERROR -- : from /usr/local/lib/ruby/3.2.0/open-uri.rb:760:in `buffer_open' E, [2024-05-07T08:05:58.632054 #1604567] ERROR -- : from /usr/local/lib/ruby/3.2.0/open-uri.rb:214:in `block in open_loop' E, [2024-05-07T08:05:58.632063 #1604567] ERROR -- : from /usr/local/lib/ruby/3.2.0/open-uri.rb:212:in `catch' E, [2024-05-07T08:05:58.632071 #1604567] ERROR -- : from /usr/local/lib/ruby/3.2.0/open-uri.rb:212:in `open_loop' E, [2024-05-07T08:05:58.632079 #1604567] ERROR -- : from /usr/local/lib/ruby/3.2.0/open-uri.rb:153:in `open_uri' E, [2024-05-07T08:05:58.632087 #1604567] ERROR -- : from /usr/local/lib/ruby/3.2.0/open-uri.rb:740:in `open' E, [2024-05-07T08:05:58.632095 #1604567] ERROR -- : from /usr/local/lib/ruby/3.2.0/open-uri.rb:748:in `read' E, [2024-05-07T08:05:58.632103 #1604567] ERROR -- : from /home/opc/ruby/src/master/tool/downloader.rb:247:in `block in download' E, [2024-05-07T08:05:58.632112 #1604567] ERROR -- : from /home/opc/ruby/src/master/tool/downloader.rb:378:in `with_retry' E, [2024-05-07T08:05:58.632120 #1604567] ERROR -- : from /home/opc/ruby/src/master/tool/downloader.rb:246:in `download' E, [2024-05-07T08:05:58.632128 #1604567] ERROR -- : from /home/opc/ruby/src/master/tool/downloader.rb:136:in `download' E, [2024-05-07T08:05:58.632136 #1604567] ERROR -- : from /home/opc/ruby/src/master/tool/downloader.rb:482:in `block in
' E, [2024-05-07T08:05:58.632144 #1604567] ERROR -- : from /home/opc/ruby/src/master/tool/downloader.rb:465:in `each' E, [2024-05-07T08:05:58.632153 #1604567] ERROR -- : from /home/opc/ruby/src/master/tool/downloader.rb:465:in `
' E, [2024-05-07T08:05:58.634984 #1604567] ERROR -- : make: *** [uncommon.mk:1787: /home/opc/ruby/src/master/enc/unicode/data/emoji/15.0/emoji-sequences.txt] Error 1 E, [2024-05-07T08:05:58.635027 #1604567] ERROR -- : make: *** Deleting file '/home/opc/ruby/src/master/enc/unicode/data/emoji/15.0/emoji-sequences.txt' E, [2024-05-07T08:05:58.654664 #1604567] ERROR -- : /home/opc/ruby/src/master/tool/downloader.rb:302:in `rescue in download': failed to download emoji/15.0/emoji-test.txt (RuntimeError) E, [2024-05-07T08:05:58.654705 #1604567] ERROR -- : OpenURI::HTTPError: 403 Forbidden: https://www.unicode.org/Public/emoji/15.0/emoji-test.txt E, [2024-05-07T08:05:58.654716 #1604567] ERROR -- : from /home/opc/ruby/src/master/tool/downloader.rb:201:in `download' E, [2024-05-07T08:05:58.654725 #1604567] ERROR -- : from /home/opc/ruby/src/master/tool/downloader.rb:136:in `download' E, [2024-05-07T08:05:58.654734 #1604567] ERROR -- : from /home/opc/ruby/src/master/tool/downloader.rb:482:in `block in
' E, [2024-05-07T08:05:58.654742 #1604567] ERROR -- : from /home/opc/ruby/src/master/tool/downloader.rb:465:in `each' E, [2024-05-07T08:05:58.654750 #1604567] ERROR -- : from /home/opc/ruby/src/master/tool/downloader.rb:465:in `
' E, [2024-05-07T08:05:58.654758 #1604567] ERROR -- : /usr/local/lib/ruby/3.2.0/open-uri.rb:369:in `open_http': 403 Forbidden (OpenURI::HTTPError) E, [2024-05-07T08:05:58.654766 #1604567] ERROR -- : from /usr/local/lib/ruby/3.2.0/open-uri.rb:760:in `buffer_open' E, [2024-05-07T08:05:58.654775 #1604567] ERROR -- : from /usr/local/lib/ruby/3.2.0/open-uri.rb:214:in `block in open_loop' E, [2024-05-07T08:05:58.654783 #1604567] ERROR -- : from /usr/local/lib/ruby/3.2.0/open-uri.rb:212:in `catch' E, [2024-05-07T08:05:58.654791 #1604567] ERROR -- : from /usr/local/lib/ruby/3.2.0/open-uri.rb:212:in `open_loop' E, [2024-05-07T08:05:58.654799 #1604567] ERROR -- : from /usr/local/lib/ruby/3.2.0/open-uri.rb:153:in `open_uri' E, [2024-05-07T08:05:58.654807 #1604567] ERROR -- : from /usr/local/lib/ruby/3.2.0/open-uri.rb:740:in `open' E, [2024-05-07T08:05:58.654815 #1604567] ERROR -- : from /usr/local/lib/ruby/3.2.0/open-uri.rb:748:in `read' E, [2024-05-07T08:05:58.654823 #1604567] ERROR -- : from /home/opc/ruby/src/master/tool/downloader.rb:247:in `block in download' E, [2024-05-07T08:05:58.654832 #1604567] ERROR -- : from /home/opc/ruby/src/master/tool/downloader.rb:378:in `with_retry' E, [2024-05-07T08:05:58.654840 #1604567] ERROR -- : from /home/opc/ruby/src/master/tool/downloader.rb:246:in `download' E, [2024-05-07T08:05:58.654848 #1604567] ERROR -- : from /home/opc/ruby/src/master/tool/downloader.rb:136:in `download' E, [2024-05-07T08:05:58.654856 #1604567] ERROR -- : from /home/opc/ruby/src/master/tool/downloader.rb:482:in `block in
' E, [2024-05-07T08:05:58.654864 #1604567] ERROR -- : from /home/opc/ruby/src/master/tool/downloader.rb:465:in `each' E, [2024-05-07T08:05:58.654872 #1604567] ERROR -- : from /home/opc/ruby/src/master/tool/downloader.rb:465:in `
' E, [2024-05-07T08:05:58.657714 #1604567] ERROR -- : make: *** [uncommon.mk:1787: /home/opc/ruby/src/master/enc/unicode/data/emoji/15.0/emoji-test.txt] Error 1 I, [2024-05-07T08:05:58.657775 #1604567] INFO -- : downloading emoji/15.0/emoji-test.txt ... downloading emoji/15.0/emoji-test.txt ... I, [2024-05-07T08:05:58.657985 #1604567] INFO -- : $$$[end] "make update-unicode -j3" exit with 512. I, [2024-05-07T08:05:58.658021 #1604567] INFO -- : $$$[beg] make update-download -j3 I, [2024-05-07T08:05:58.820318 #1604567] INFO -- : tool/config.guess already exists I, [2024-05-07T08:05:58.820389 #1604567] INFO -- : tool/config.sub already exists I, [2024-05-07T08:05:58.823172 #1604567] INFO -- : Update minitest to ea9caafc0754b1d6236a490d59e624b53209734a I, [2024-05-07T08:05:58.823275 #1604567] INFO -- : Update power_assert to 84e85124c5014a139af39161d484156cfe87a9ed I, [2024-05-07T08:05:58.823572 #1604567] INFO -- : Update rbs to ba7872795d5de04adb8ff500c0e6afdc81a041dd I, [2024-05-07T08:05:58.826638 #1604567] INFO -- : echo ea9caafc0754b1d6236a490d59e624b53209734a | /bin/sh /home/opc/ruby/src/master/tool/ifchange /home/opc/ruby/src/master/.bundle/.timestamp/minitest.revision - I, [2024-05-07T08:05:58.826831 #1604567] INFO -- : echo 84e85124c5014a139af39161d484156cfe87a9ed | /bin/sh /home/opc/ruby/src/master/tool/ifchange /home/opc/ruby/src/master/.bundle/.timestamp/power_assert.revision - I, [2024-05-07T08:05:58.827009 #1604567] INFO -- : echo ba7872795d5de04adb8ff500c0e6afdc81a041dd | /bin/sh /home/opc/ruby/src/master/tool/ifchange /home/opc/ruby/src/master/.bundle/.timestamp/rbs.revision - I, [2024-05-07T08:05:58.832558 #1604567] INFO -- : /home/opc/ruby/src/master/.bundle/.timestamp/power_assert.revision unchanged I, [2024-05-07T08:05:58.833594 #1604567] INFO -- : /home/opc/ruby/src/master/.bundle/.timestamp/minitest.revision unchanged I, [2024-05-07T08:05:58.834285 #1604567] INFO -- : /home/opc/ruby/src/master/.bundle/.timestamp/rbs.revision unchanged I, [2024-05-07T08:05:58.835125 #1604567] INFO -- : Update typeprof to b19a6416da3a05d57fadd6ffdadb382b6d236ca5 I, [2024-05-07T08:05:58.838684 #1604567] INFO -- : echo b19a6416da3a05d57fadd6ffdadb382b6d236ca5 | /bin/sh /home/opc/ruby/src/master/tool/ifchange /home/opc/ruby/src/master/.bundle/.timestamp/typeprof.revision - I, [2024-05-07T08:05:58.847606 #1604567] INFO -- : /home/opc/ruby/src/master/.bundle/.timestamp/typeprof.revision unchanged I, [2024-05-07T08:05:58.924458 #1604567] INFO -- : Building power_assert@84e85124c5014a139af39161d484156cfe87a9ed to /home/opc/ruby/src/master/gems/power_assert-2.0.3.gem I, [2024-05-07T08:05:59.037189 #1604567] INFO -- : Successfully built RubyGem I, [2024-05-07T08:05:59.037247 #1604567] INFO -- : Name: power_assert I, [2024-05-07T08:05:59.037257 #1604567] INFO -- : Version: 2.0.4dev I, [2024-05-07T08:05:59.037266 #1604567] INFO -- : File: power_assert-2.0.4dev.gem I, [2024-05-07T08:05:59.118775 #1604567] INFO -- : $$$[end] "make update-download -j3" exit with 0. I, [2024-05-07T08:05:59.118846 #1604567] INFO -- : $$$[beg] make update-rubyspec -j3 I, [2024-05-07T08:05:59.208209 #1604567] INFO -- : make: Nothing to be done for 'update-rubyspec'. I, [2024-05-07T08:05:59.208339 #1604567] INFO -- : $$$[end] "make update-rubyspec -j3" exit with 0. I, [2024-05-07T08:05:59.208364 #1604567] INFO -- : $$$[beg] make update-src -j3 I, [2024-05-07T08:06:00.321938 #1604567] INFO -- : Already up to date. I, [2024-05-07T08:06:00.336745 #1604567] INFO -- : Latest commit hash = e1e6b4972f I, [2024-05-07T08:06:00.337328 #1604567] INFO -- : $$$[end] "make update-src -j3" exit with 0. I, [2024-05-07T08:06:00.337368 #1604567] INFO -- : $$$[beg] make after-update -j3 I, [2024-05-07T08:06:00.443146 #1604567] INFO -- : generating /home/opc/ruby/src/master/ext/ripper/eventids2table.c I, [2024-05-07T08:06:00.449800 #1604567] INFO -- : make[1]: Entering directory '/home/opc/ruby/src/master/ext/ripper' I, [2024-05-07T08:06:00.449850 #1604567] INFO -- : make[1]: Nothing to be done for 'src'. I, [2024-05-07T08:06:00.449862 #1604567] INFO -- : make[1]: Leaving directory '/home/opc/ruby/src/master/ext/ripper' I, [2024-05-07T08:06:00.476025 #1604567] INFO -- : /home/opc/ruby/src/master/revision.h updated I, [2024-05-07T08:06:00.477106 #1604567] INFO -- : generating aarch64-linux-fake.rb I, [2024-05-07T08:06:00.536009 #1604567] INFO -- : aarch64-linux-fake.rb updated I, [2024-05-07T08:06:00.536071 #1604567] INFO -- : generating enc.mk I, [2024-05-07T08:06:00.767213 #1604567] INFO -- : making srcs under enc I, [2024-05-07T08:06:00.809458 #1604567] INFO -- : make[1]: Entering directory '/home/opc/ruby/build/master' I, [2024-05-07T08:06:00.809518 #1604567] INFO -- : make[1]: Nothing to be done for 'srcs'. I, [2024-05-07T08:06:00.809528 #1604567] INFO -- : make[1]: Leaving directory '/home/opc/ruby/build/master' I, [2024-05-07T08:06:00.889857 #1604567] INFO -- : Update minitest to ea9caafc0754b1d6236a490d59e624b53209734a I, [2024-05-07T08:06:00.890047 #1604567] INFO -- : Update power_assert to 84e85124c5014a139af39161d484156cfe87a9ed I, [2024-05-07T08:06:00.890226 #1604567] INFO -- : Update rbs to ba7872795d5de04adb8ff500c0e6afdc81a041dd I, [2024-05-07T08:06:00.893144 #1604567] INFO -- : echo ea9caafc0754b1d6236a490d59e624b53209734a | /bin/sh /home/opc/ruby/src/master/tool/ifchange /home/opc/ruby/src/master/.bundle/.timestamp/minitest.revision - I, [2024-05-07T08:06:00.893301 #1604567] INFO -- : echo 84e85124c5014a139af39161d484156cfe87a9ed | /bin/sh /home/opc/ruby/src/master/tool/ifchange /home/opc/ruby/src/master/.bundle/.timestamp/power_assert.revision - I, [2024-05-07T08:06:00.893342 #1604567] INFO -- : echo ba7872795d5de04adb8ff500c0e6afdc81a041dd | /bin/sh /home/opc/ruby/src/master/tool/ifchange /home/opc/ruby/src/master/.bundle/.timestamp/rbs.revision - I, [2024-05-07T08:06:00.898344 #1604567] INFO -- : /home/opc/ruby/src/master/.bundle/.timestamp/minitest.revision unchanged I, [2024-05-07T08:06:00.898542 #1604567] INFO -- : /home/opc/ruby/src/master/.bundle/.timestamp/rbs.revision unchanged I, [2024-05-07T08:06:00.899278 #1604567] INFO -- : /home/opc/ruby/src/master/.bundle/.timestamp/power_assert.revision unchanged I, [2024-05-07T08:06:00.900834 #1604567] INFO -- : Update typeprof to b19a6416da3a05d57fadd6ffdadb382b6d236ca5 I, [2024-05-07T08:06:00.906427 #1604567] INFO -- : echo b19a6416da3a05d57fadd6ffdadb382b6d236ca5 | /bin/sh /home/opc/ruby/src/master/tool/ifchange /home/opc/ruby/src/master/.bundle/.timestamp/typeprof.revision - I, [2024-05-07T08:06:00.912240 #1604567] INFO -- : /home/opc/ruby/src/master/.bundle/.timestamp/typeprof.revision unchanged I, [2024-05-07T08:06:00.994390 #1604567] INFO -- : Building power_assert@84e85124c5014a139af39161d484156cfe87a9ed to /home/opc/ruby/src/master/gems/power_assert-2.0.3.gem I, [2024-05-07T08:06:01.105586 #1604567] INFO -- : Successfully built RubyGem I, [2024-05-07T08:06:01.105641 #1604567] INFO -- : Name: power_assert I, [2024-05-07T08:06:01.105652 #1604567] INFO -- : Version: 2.0.4dev I, [2024-05-07T08:06:01.105661 #1604567] INFO -- : File: power_assert-2.0.4dev.gem I, [2024-05-07T08:06:01.107698 #1604567] INFO -- : Extracting bundle gem power_assert-2.0.3... I, [2024-05-07T08:06:01.205456 #1604567] INFO -- : Try with hash version of bundled gems instead of gems/power_assert-2.0.3.gem. We don't use this gem with release version of Ruby. I, [2024-05-07T08:06:01.216087 #1604567] INFO -- : Unpacked gems/power_assert-2.0.4dev.gem I, [2024-05-07T08:06:01.217974 #1604567] INFO -- : $$$[end] "make after-update -j3" exit with 0. I, [2024-05-07T08:06:01.218117 #1604567] INFO -- : $$$[beg] make miniruby -j3 I, [2024-05-07T08:06:01.309795 #1604567] INFO -- : BASERUBY = /usr/local/bin/ruby --disable=gems I, [2024-05-07T08:06:01.309865 #1604567] INFO -- : CC = gcc I, [2024-05-07T08:06:01.309876 #1604567] INFO -- : LD = ld I, [2024-05-07T08:06:01.309885 #1604567] INFO -- : LDSHARED = gcc -shared I, [2024-05-07T08:06:01.309896 #1604567] INFO -- : CFLAGS = -O3 -fno-fast-math -ggdb3 -Wall -Wextra -Wdeprecated-declarations -Wdiv-by-zero -Wduplicated-cond -Wimplicit-function-declaration -Wimplicit-int -Wpointer-arith -Wwrite-strings -Wold-style-definition -Wimplicit-fallthrough=0 -Wmissing-noreturn -Wno-cast-function-type -Wno-constant-logical-operand -Wno-long-long -Wno-missing-field-initializers -Wno-overlength-strings -Wno-packed-bitfield-compat -Wno-parentheses-equality -Wno-self-assign -Wno-tautological-compare -Wno-unused-parameter -Wno-unused-value -Wsuggest-attribute=format -Wsuggest-attribute=noreturn -Wunused-variable -Wmisleading-indentation -Wundef I, [2024-05-07T08:06:01.309906 #1604567] INFO -- : XCFLAGS = -U_FORTIFY_SOURCE -D_FORTIFY_SOURCE=2 -fstack-protector-strong -msign-return-address=all -fno-strict-overflow -fvisibility=hidden -fexcess-precision=standard -DRUBY_EXPORT -fPIE -I. -I.ext/include/aarch64-linux -I/home/opc/ruby/src/master/include -I/home/opc/ruby/src/master -I/home/opc/ruby/src/master/prism -I/home/opc/ruby/src/master/enc/unicode/15.0.0 I, [2024-05-07T08:06:01.309914 #1604567] INFO -- : CPPFLAGS = I, [2024-05-07T08:06:01.309922 #1604567] INFO -- : DLDFLAGS = -Wl,--compress-debug-sections=zlib -fstack-protector-strong -pie I, [2024-05-07T08:06:01.309958 #1604567] INFO -- : SOLIBS = -lz -lrt -lrt -ldl -lcrypt -lm -lpthread I, [2024-05-07T08:06:01.309966 #1604567] INFO -- : LANG = en_US.UTF-8 I, [2024-05-07T08:06:01.309974 #1604567] INFO -- : LC_ALL = I, [2024-05-07T08:06:01.309981 #1604567] INFO -- : LC_CTYPE = I, [2024-05-07T08:06:01.309989 #1604567] INFO -- : MFLAGS = -j3 --jobserver-auth=4,5 I, [2024-05-07T08:06:01.309997 #1604567] INFO -- : RUSTC = rustc I, [2024-05-07T08:06:01.310005 #1604567] INFO -- : YJIT_RUSTC_ARGS = --crate-name=yjit --crate-type=staticlib --edition=2021 -g -C lto=thin -C opt-level=3 -C overflow-checks=on '--out-dir=/home/opc/ruby/build/master/yjit/target/release/' /home/opc/ruby/src/master/yjit/src/lib.rs I, [2024-05-07T08:06:01.310615 #1604567] INFO -- : gcc (GCC) 8.5.0 20210514 (Red Hat 8.5.0-10.1.0.1) I, [2024-05-07T08:06:01.310637 #1604567] INFO -- : Copyright (C) 2018 Free Software Foundation, Inc. I, [2024-05-07T08:06:01.310646 #1604567] INFO -- : This is free software; see the source for copying conditions. There is NO I, [2024-05-07T08:06:01.310655 #1604567] INFO -- : warranty; not even for MERCHANTABILITY or FITNESS FOR A PARTICULAR PURPOSE. I, [2024-05-07T08:06:01.310663 #1604567] INFO -- : I, [2024-05-07T08:06:01.335935 #1604567] INFO -- : compiling /home/opc/ruby/src/master/version.c I, [2024-05-07T08:06:01.481813 #1604567] INFO -- : linking miniruby I, [2024-05-07T08:06:02.370407 #1604567] INFO -- : $$$[end] "make miniruby -j3" exit with 0. I, [2024-05-07T08:06:02.370575 #1604567] INFO -- : $$$[beg] make ruby -j3 I, [2024-05-07T08:06:02.462286 #1604567] INFO -- : BASERUBY = /usr/local/bin/ruby --disable=gems I, [2024-05-07T08:06:02.462356 #1604567] INFO -- : CC = gcc I, [2024-05-07T08:06:02.462366 #1604567] INFO -- : LD = ld I, [2024-05-07T08:06:02.462375 #1604567] INFO -- : LDSHARED = gcc -shared I, [2024-05-07T08:06:02.462386 #1604567] INFO -- : CFLAGS = -O3 -fno-fast-math -ggdb3 -Wall -Wextra -Wdeprecated-declarations -Wdiv-by-zero -Wduplicated-cond -Wimplicit-function-declaration -Wimplicit-int -Wpointer-arith -Wwrite-strings -Wold-style-definition -Wimplicit-fallthrough=0 -Wmissing-noreturn -Wno-cast-function-type -Wno-constant-logical-operand -Wno-long-long -Wno-missing-field-initializers -Wno-overlength-strings -Wno-packed-bitfield-compat -Wno-parentheses-equality -Wno-self-assign -Wno-tautological-compare -Wno-unused-parameter -Wno-unused-value -Wsuggest-attribute=format -Wsuggest-attribute=noreturn -Wunused-variable -Wmisleading-indentation -Wundef I, [2024-05-07T08:06:02.462396 #1604567] INFO -- : XCFLAGS = -U_FORTIFY_SOURCE -D_FORTIFY_SOURCE=2 -fstack-protector-strong -msign-return-address=all -fno-strict-overflow -fvisibility=hidden -fexcess-precision=standard -DRUBY_EXPORT -fPIE -I. -I.ext/include/aarch64-linux -I/home/opc/ruby/src/master/include -I/home/opc/ruby/src/master -I/home/opc/ruby/src/master/prism -I/home/opc/ruby/src/master/enc/unicode/15.0.0 I, [2024-05-07T08:06:02.462404 #1604567] INFO -- : CPPFLAGS = I, [2024-05-07T08:06:02.462413 #1604567] INFO -- : DLDFLAGS = -Wl,--compress-debug-sections=zlib -fstack-protector-strong -pie I, [2024-05-07T08:06:02.462422 #1604567] INFO -- : SOLIBS = -lz -lrt -lrt -ldl -lcrypt -lm -lpthread I, [2024-05-07T08:06:02.462430 #1604567] INFO -- : LANG = en_US.UTF-8 I, [2024-05-07T08:06:02.462438 #1604567] INFO -- : LC_ALL = I, [2024-05-07T08:06:02.462445 #1604567] INFO -- : LC_CTYPE = I, [2024-05-07T08:06:02.462453 #1604567] INFO -- : MFLAGS = -j3 --jobserver-auth=4,5 I, [2024-05-07T08:06:02.462461 #1604567] INFO -- : RUSTC = rustc I, [2024-05-07T08:06:02.462469 #1604567] INFO -- : YJIT_RUSTC_ARGS = --crate-name=yjit --crate-type=staticlib --edition=2021 -g -C lto=thin -C opt-level=3 -C overflow-checks=on '--out-dir=/home/opc/ruby/build/master/yjit/target/release/' /home/opc/ruby/src/master/yjit/src/lib.rs I, [2024-05-07T08:06:02.463224 #1604567] INFO -- : gcc (GCC) 8.5.0 20210514 (Red Hat 8.5.0-10.1.0.1) I, [2024-05-07T08:06:02.463260 #1604567] INFO -- : Copyright (C) 2018 Free Software Foundation, Inc. I, [2024-05-07T08:06:02.463274 #1604567] INFO -- : This is free software; see the source for copying conditions. There is NO I, [2024-05-07T08:06:02.463284 #1604567] INFO -- : warranty; not even for MERCHANTABILITY or FITNESS FOR A PARTICULAR PURPOSE. I, [2024-05-07T08:06:02.463292 #1604567] INFO -- : I, [2024-05-07T08:06:02.648257 #1604567] INFO -- : builtin_binary.inc updated I, [2024-05-07T08:06:02.651066 #1604567] INFO -- : c5234a9416e4f20f175185e840b25b0f08674d14078ed7083f37e655458e3ca9 builtin_binary.inc I, [2024-05-07T08:06:02.651957 #1604567] INFO -- : compiling /home/opc/ruby/src/master/builtin.c I, [2024-05-07T08:06:02.978448 #1604567] INFO -- : linking static-library libruby-static.a I, [2024-05-07T08:06:06.043878 #1604567] INFO -- : linking ruby I, [2024-05-07T08:06:06.968060 #1604567] INFO -- : $$$[end] "make ruby -j3" exit with 0. I, [2024-05-07T08:06:06.968227 #1604567] INFO -- : $$$[beg] make all -j3 I, [2024-05-07T08:06:07.056409 #1604567] INFO -- : BASERUBY = /usr/local/bin/ruby --disable=gems I, [2024-05-07T08:06:07.056473 #1604567] INFO -- : CC = gcc I, [2024-05-07T08:06:07.056484 #1604567] INFO -- : LD = ld I, [2024-05-07T08:06:07.056539 #1604567] INFO -- : LDSHARED = gcc -shared I, [2024-05-07T08:06:07.056552 #1604567] INFO -- : CFLAGS = -O3 -fno-fast-math -ggdb3 -Wall -Wextra -Wdeprecated-declarations -Wdiv-by-zero -Wduplicated-cond -Wimplicit-function-declaration -Wimplicit-int -Wpointer-arith -Wwrite-strings -Wold-style-definition -Wimplicit-fallthrough=0 -Wmissing-noreturn -Wno-cast-function-type -Wno-constant-logical-operand -Wno-long-long -Wno-missing-field-initializers -Wno-overlength-strings -Wno-packed-bitfield-compat -Wno-parentheses-equality -Wno-self-assign -Wno-tautological-compare -Wno-unused-parameter -Wno-unused-value -Wsuggest-attribute=format -Wsuggest-attribute=noreturn -Wunused-variable -Wmisleading-indentation -Wundef I, [2024-05-07T08:06:07.056561 #1604567] INFO -- : XCFLAGS = -U_FORTIFY_SOURCE -D_FORTIFY_SOURCE=2 -fstack-protector-strong -msign-return-address=all -fno-strict-overflow -fvisibility=hidden -fexcess-precision=standard -DRUBY_EXPORT -fPIE -I. -I.ext/include/aarch64-linux -I/home/opc/ruby/src/master/include -I/home/opc/ruby/src/master -I/home/opc/ruby/src/master/prism -I/home/opc/ruby/src/master/enc/unicode/15.0.0 I, [2024-05-07T08:06:07.056570 #1604567] INFO -- : CPPFLAGS = I, [2024-05-07T08:06:07.056578 #1604567] INFO -- : DLDFLAGS = -Wl,--compress-debug-sections=zlib -fstack-protector-strong -pie I, [2024-05-07T08:06:07.056586 #1604567] INFO -- : SOLIBS = -lz -lrt -lrt -ldl -lcrypt -lm -lpthread I, [2024-05-07T08:06:07.056594 #1604567] INFO -- : LANG = en_US.UTF-8 I, [2024-05-07T08:06:07.056602 #1604567] INFO -- : LC_ALL = I, [2024-05-07T08:06:07.056610 #1604567] INFO -- : LC_CTYPE = I, [2024-05-07T08:06:07.056618 #1604567] INFO -- : MFLAGS = -j3 --jobserver-auth=4,5 I, [2024-05-07T08:06:07.056625 #1604567] INFO -- : RUSTC = rustc I, [2024-05-07T08:06:07.056634 #1604567] INFO -- : YJIT_RUSTC_ARGS = --crate-name=yjit --crate-type=staticlib --edition=2021 -g -C lto=thin -C opt-level=3 -C overflow-checks=on '--out-dir=/home/opc/ruby/build/master/yjit/target/release/' /home/opc/ruby/src/master/yjit/src/lib.rs I, [2024-05-07T08:06:07.057418 #1604567] INFO -- : gcc (GCC) 8.5.0 20210514 (Red Hat 8.5.0-10.1.0.1) I, [2024-05-07T08:06:07.057454 #1604567] INFO -- : Copyright (C) 2018 Free Software Foundation, Inc. I, [2024-05-07T08:06:07.057465 #1604567] INFO -- : This is free software; see the source for copying conditions. There is NO I, [2024-05-07T08:06:07.057474 #1604567] INFO -- : warranty; not even for MERCHANTABILITY or FITNESS FOR A PARTICULAR PURPOSE. I, [2024-05-07T08:06:07.057482 #1604567] INFO -- : I, [2024-05-07T08:06:07.091669 #1604567] INFO -- : generating enc.mk I, [2024-05-07T08:06:07.328626 #1604567] INFO -- : making srcs under enc I, [2024-05-07T08:06:07.328788 #1604567] INFO -- : making enc I, [2024-05-07T08:06:07.356019 #1604567] INFO -- : make[1]: Entering directory '/home/opc/ruby/build/master' I, [2024-05-07T08:06:07.356091 #1604567] INFO -- : make[1]: Nothing to be done for 'enc'. I, [2024-05-07T08:06:07.356102 #1604567] INFO -- : make[1]: Leaving directory '/home/opc/ruby/build/master' I, [2024-05-07T08:06:07.370760 #1604567] INFO -- : make[1]: Entering directory '/home/opc/ruby/build/master' I, [2024-05-07T08:06:07.370805 #1604567] INFO -- : make[1]: Nothing to be done for 'srcs'. I, [2024-05-07T08:06:07.370816 #1604567] INFO -- : make[1]: Leaving directory '/home/opc/ruby/build/master' I, [2024-05-07T08:06:07.371582 #1604567] INFO -- : generating transdb.h I, [2024-05-07T08:06:07.516938 #1604567] INFO -- : transdb.h unchanged I, [2024-05-07T08:06:07.518343 #1604567] INFO -- : generating makefiles ext/configure-ext.mk I, [2024-05-07T08:06:07.518526 #1604567] INFO -- : making trans I, [2024-05-07T08:06:07.559159 #1604567] INFO -- : ext/configure-ext.mk updated I, [2024-05-07T08:06:07.562533 #1604567] INFO -- : make[1]: Entering directory '/home/opc/ruby/build/master' I, [2024-05-07T08:06:07.567378 #1604567] INFO -- : make[1]: Entering directory '/home/opc/ruby/build/master' I, [2024-05-07T08:06:07.567443 #1604567] INFO -- : make[1]: Nothing to be done for 'trans'. I, [2024-05-07T08:06:07.567455 #1604567] INFO -- : make[1]: Leaving directory '/home/opc/ruby/build/master' I, [2024-05-07T08:06:08.255068 #1604567] INFO -- : making encs I, [2024-05-07T08:06:08.289614 #1604567] INFO -- : make[1]: Leaving directory '/home/opc/ruby/build/master' I, [2024-05-07T08:06:08.290364 #1604567] INFO -- : generating makefile exts.mk I, [2024-05-07T08:06:08.308794 #1604567] INFO -- : make[1]: Entering directory '/home/opc/ruby/build/master' I, [2024-05-07T08:06:08.308861 #1604567] INFO -- : make[1]: Nothing to be done for 'encs'. I, [2024-05-07T08:06:08.308872 #1604567] INFO -- : make[1]: Leaving directory '/home/opc/ruby/build/master' I, [2024-05-07T08:06:08.348582 #1604567] INFO -- : exts.mk unchanged I, [2024-05-07T08:06:08.353472 #1604567] INFO -- : make[1]: Entering directory '/home/opc/ruby/build/master' I, [2024-05-07T08:06:08.460884 #1604567] INFO -- : make[2]: Entering directory '/home/opc/ruby/build/master/ext/coverage' I, [2024-05-07T08:06:08.462646 #1604567] INFO -- : make[2]: Entering directory '/home/opc/ruby/build/master/ext/date' I, [2024-05-07T08:06:08.463281 #1604567] INFO -- : make[2]: Entering directory '/home/opc/ruby/build/master/ext/digest' I, [2024-05-07T08:06:08.466489 #1604567] INFO -- : make[2]: Leaving directory '/home/opc/ruby/build/master/ext/coverage' I, [2024-05-07T08:06:08.468452 #1604567] INFO -- : make[2]: Leaving directory '/home/opc/ruby/build/master/ext/date' I, [2024-05-07T08:06:08.478344 #1604567] INFO -- : make[2]: Leaving directory '/home/opc/ruby/build/master/ext/digest' I, [2024-05-07T08:06:08.479733 #1604567] INFO -- : make[2]: Entering directory '/home/opc/ruby/build/master/ext/io/console' I, [2024-05-07T08:06:08.480290 #1604567] INFO -- : make[2]: Entering directory '/home/opc/ruby/build/master/ext/fiddle' I, [2024-05-07T08:06:08.485054 #1604567] INFO -- : make[2]: Leaving directory '/home/opc/ruby/build/master/ext/io/console' I, [2024-05-07T08:06:08.487174 #1604567] INFO -- : make[2]: Entering directory '/home/opc/ruby/build/master/ext/json' I, [2024-05-07T08:06:08.489535 #1604567] INFO -- : make[2]: Leaving directory '/home/opc/ruby/build/master/ext/fiddle' I, [2024-05-07T08:06:08.491534 #1604567] INFO -- : make[2]: Entering directory '/home/opc/ruby/build/master/ext/monitor' I, [2024-05-07T08:06:08.494303 #1604567] INFO -- : make[2]: Leaving directory '/home/opc/ruby/build/master/ext/json' I, [2024-05-07T08:06:08.497714 #1604567] INFO -- : make[2]: Leaving directory '/home/opc/ruby/build/master/ext/monitor' I, [2024-05-07T08:06:08.498353 #1604567] INFO -- : make[2]: Entering directory '/home/opc/ruby/build/master/ext/objspace' I, [2024-05-07T08:06:08.501759 #1604567] INFO -- : make[2]: Entering directory '/home/opc/ruby/build/master/ext/pathname' I, [2024-05-07T08:06:08.505090 #1604567] INFO -- : make[2]: Leaving directory '/home/opc/ruby/build/master/ext/objspace' I, [2024-05-07T08:06:08.505829 #1604567] INFO -- : make[2]: Leaving directory '/home/opc/ruby/build/master/ext/pathname' I, [2024-05-07T08:06:08.509939 #1604567] INFO -- : make[2]: Entering directory '/home/opc/ruby/build/master/ext/pty' I, [2024-05-07T08:06:08.511553 #1604567] INFO -- : make[2]: Entering directory '/home/opc/ruby/build/master/ext/psych' I, [2024-05-07T08:06:08.513642 #1604567] INFO -- : make[2]: Entering directory '/home/opc/ruby/build/master/ext/openssl' I, [2024-05-07T08:06:08.515336 #1604567] INFO -- : make[2]: Leaving directory '/home/opc/ruby/build/master/ext/pty' I, [2024-05-07T08:06:08.528118 #1604567] INFO -- : make[2]: Leaving directory '/home/opc/ruby/build/master/ext/psych' I, [2024-05-07T08:06:08.529998 #1604567] INFO -- : make[2]: Entering directory '/home/opc/ruby/build/master/ext/ripper' I, [2024-05-07T08:06:08.530071 #1604567] INFO -- : make[2]: Entering directory '/home/opc/ruby/build/master/ext/rubyvm' I, [2024-05-07T08:06:08.534784 #1604567] INFO -- : make[2]: Leaving directory '/home/opc/ruby/build/master/ext/rubyvm' I, [2024-05-07T08:06:08.536873 #1604567] INFO -- : make[2]: Leaving directory '/home/opc/ruby/build/master/ext/ripper' I, [2024-05-07T08:06:08.541071 #1604567] INFO -- : make[2]: Leaving directory '/home/opc/ruby/build/master/ext/openssl' I, [2024-05-07T08:06:08.547289 #1604567] INFO -- : make[2]: Entering directory '/home/opc/ruby/build/master/ext/socket' I, [2024-05-07T08:06:08.547984 #1604567] INFO -- : make[2]: Entering directory '/home/opc/ruby/build/master/.bundle/gems/bigdecimal-3.1.7/ext/bigdecimal' I, [2024-05-07T08:06:08.550237 #1604567] INFO -- : make[2]: Entering directory '/home/opc/ruby/build/master/.bundle/gems/bigdecimal-3.1.8/ext/bigdecimal' I, [2024-05-07T08:06:08.558122 #1604567] INFO -- : make[2]: Leaving directory '/home/opc/ruby/build/master/ext/socket' I, [2024-05-07T08:06:08.560693 #1604567] INFO -- : make[2]: Entering directory '/home/opc/ruby/build/master/.bundle/gems/debug-1.9.2/ext/debug' I, [2024-05-07T08:06:08.579753 #1604567] INFO -- : make[2]: Leaving directory '/home/opc/ruby/build/master/.bundle/gems/bigdecimal-3.1.7/ext/bigdecimal' I, [2024-05-07T08:06:08.580679 #1604567] INFO -- : make[2]: Leaving directory '/home/opc/ruby/build/master/.bundle/gems/bigdecimal-3.1.8/ext/bigdecimal' I, [2024-05-07T08:06:08.582264 #1604567] INFO -- : make[2]: Entering directory '/home/opc/ruby/build/master/.bundle/gems/nkf-0.2.0/ext/nkf' I, [2024-05-07T08:06:08.585206 #1604567] INFO -- : make[2]: Entering directory '/home/opc/ruby/build/master/.bundle/gems/racc-1.7.3/ext/racc/cparse' I, [2024-05-07T08:06:08.597026 #1604567] INFO -- : make[2]: Leaving directory '/home/opc/ruby/build/master/.bundle/gems/debug-1.9.2/ext/debug' I, [2024-05-07T08:06:08.599999 #1604567] INFO -- : make[2]: Entering directory '/home/opc/ruby/build/master/.bundle/gems/rbs-3.4.4/ext/rbs_extension' I, [2024-05-07T08:06:08.614398 #1604567] INFO -- : make[2]: Leaving directory '/home/opc/ruby/build/master/.bundle/gems/nkf-0.2.0/ext/nkf' I, [2024-05-07T08:06:08.616333 #1604567] INFO -- : make[2]: Leaving directory '/home/opc/ruby/build/master/.bundle/gems/racc-1.7.3/ext/racc/cparse' I, [2024-05-07T08:06:08.618179 #1604567] INFO -- : make[2]: Entering directory '/home/opc/ruby/build/master/.bundle/gems/syslog-0.1.2/ext/syslog' I, [2024-05-07T08:06:08.634565 #1604567] INFO -- : make[2]: Leaving directory '/home/opc/ruby/build/master/.bundle/gems/rbs-3.4.4/ext/rbs_extension' I, [2024-05-07T08:06:08.639727 #1604567] INFO -- : make[2]: Entering directory '/home/opc/ruby/build/master/ext/digest/sha2' I, [2024-05-07T08:06:08.644509 #1604567] INFO -- : make[2]: Leaving directory '/home/opc/ruby/build/master/ext/digest/sha2' I, [2024-05-07T08:06:08.648471 #1604567] INFO -- : make[2]: Leaving directory '/home/opc/ruby/build/master/.bundle/gems/syslog-0.1.2/ext/syslog' I, [2024-05-07T08:06:08.687108 #1604567] INFO -- : make[2]: Entering directory '/home/opc/ruby/build/master' I, [2024-05-07T08:06:08.770150 #1604567] INFO -- : make[2]: 'ruby' is up to date. I, [2024-05-07T08:06:08.770241 #1604567] INFO -- : make[2]: Leaving directory '/home/opc/ruby/build/master' I, [2024-05-07T08:06:08.770350 #1604567] INFO -- : make[1]: Leaving directory '/home/opc/ruby/build/master' I, [2024-05-07T08:06:08.774727 #1604567] INFO -- : make[1]: Entering directory '/home/opc/ruby/build/master' I, [2024-05-07T08:06:08.774781 #1604567] INFO -- : make[1]: Nothing to be done for 'note'. I, [2024-05-07T08:06:08.774792 #1604567] INFO -- : make[1]: Leaving directory '/home/opc/ruby/build/master' I, [2024-05-07T08:06:08.775050 #1604567] INFO -- : $$$[end] "make all -j3" exit with 0. I, [2024-05-07T08:06:08.775186 #1604567] INFO -- : $$$[beg] make install -j3 I, [2024-05-07T08:06:08.869172 #1604567] INFO -- : Update minitest to ea9caafc0754b1d6236a490d59e624b53209734a I, [2024-05-07T08:06:08.869261 #1604567] INFO -- : Update power_assert to 84e85124c5014a139af39161d484156cfe87a9ed I, [2024-05-07T08:06:08.869861 #1604567] INFO -- : Update rbs to ba7872795d5de04adb8ff500c0e6afdc81a041dd I, [2024-05-07T08:06:08.872633 #1604567] INFO -- : echo ea9caafc0754b1d6236a490d59e624b53209734a | /bin/sh /home/opc/ruby/src/master/tool/ifchange /home/opc/ruby/src/master/.bundle/.timestamp/minitest.revision - I, [2024-05-07T08:06:08.872768 #1604567] INFO -- : echo 84e85124c5014a139af39161d484156cfe87a9ed | /bin/sh /home/opc/ruby/src/master/tool/ifchange /home/opc/ruby/src/master/.bundle/.timestamp/power_assert.revision - I, [2024-05-07T08:06:08.872962 #1604567] INFO -- : echo ba7872795d5de04adb8ff500c0e6afdc81a041dd | /bin/sh /home/opc/ruby/src/master/tool/ifchange /home/opc/ruby/src/master/.bundle/.timestamp/rbs.revision - I, [2024-05-07T08:06:08.878455 #1604567] INFO -- : /home/opc/ruby/src/master/.bundle/.timestamp/minitest.revision unchanged I, [2024-05-07T08:06:08.878508 #1604567] INFO -- : /home/opc/ruby/src/master/.bundle/.timestamp/power_assert.revision unchanged I, [2024-05-07T08:06:08.879055 #1604567] INFO -- : /home/opc/ruby/src/master/.bundle/.timestamp/rbs.revision unchanged I, [2024-05-07T08:06:08.880702 #1604567] INFO -- : Update typeprof to b19a6416da3a05d57fadd6ffdadb382b6d236ca5 I, [2024-05-07T08:06:08.883050 #1604567] INFO -- : BASERUBY = /usr/local/bin/ruby --disable=gems I, [2024-05-07T08:06:08.883104 #1604567] INFO -- : CC = gcc I, [2024-05-07T08:06:08.883116 #1604567] INFO -- : LD = ld I, [2024-05-07T08:06:08.883124 #1604567] INFO -- : LDSHARED = gcc -shared I, [2024-05-07T08:06:08.883133 #1604567] INFO -- : CFLAGS = -O3 -fno-fast-math -ggdb3 -Wall -Wextra -Wdeprecated-declarations -Wdiv-by-zero -Wduplicated-cond -Wimplicit-function-declaration -Wimplicit-int -Wpointer-arith -Wwrite-strings -Wold-style-definition -Wimplicit-fallthrough=0 -Wmissing-noreturn -Wno-cast-function-type -Wno-constant-logical-operand -Wno-long-long -Wno-missing-field-initializers -Wno-overlength-strings -Wno-packed-bitfield-compat -Wno-parentheses-equality -Wno-self-assign -Wno-tautological-compare -Wno-unused-parameter -Wno-unused-value -Wsuggest-attribute=format -Wsuggest-attribute=noreturn -Wunused-variable -Wmisleading-indentation -Wundef I, [2024-05-07T08:06:08.883142 #1604567] INFO -- : XCFLAGS = -U_FORTIFY_SOURCE -D_FORTIFY_SOURCE=2 -fstack-protector-strong -msign-return-address=all -fno-strict-overflow -fvisibility=hidden -fexcess-precision=standard -DRUBY_EXPORT -fPIE -I. -I.ext/include/aarch64-linux -I/home/opc/ruby/src/master/include -I/home/opc/ruby/src/master -I/home/opc/ruby/src/master/prism -I/home/opc/ruby/src/master/enc/unicode/15.0.0 I, [2024-05-07T08:06:08.883152 #1604567] INFO -- : CPPFLAGS = I, [2024-05-07T08:06:08.883160 #1604567] INFO -- : DLDFLAGS = -Wl,--compress-debug-sections=zlib -fstack-protector-strong -pie I, [2024-05-07T08:06:08.883169 #1604567] INFO -- : SOLIBS = -lz -lrt -lrt -ldl -lcrypt -lm -lpthread I, [2024-05-07T08:06:08.883176 #1604567] INFO -- : LANG = en_US.UTF-8 I, [2024-05-07T08:06:08.883184 #1604567] INFO -- : LC_ALL = I, [2024-05-07T08:06:08.883192 #1604567] INFO -- : LC_CTYPE = I, [2024-05-07T08:06:08.883203 #1604567] INFO -- : MFLAGS = -j3 --jobserver-auth=4,5 I, [2024-05-07T08:06:08.883211 #1604567] INFO -- : RUSTC = rustc I, [2024-05-07T08:06:08.883219 #1604567] INFO -- : YJIT_RUSTC_ARGS = --crate-name=yjit --crate-type=staticlib --edition=2021 -g -C lto=thin -C opt-level=3 -C overflow-checks=on '--out-dir=/home/opc/ruby/build/master/yjit/target/release/' /home/opc/ruby/src/master/yjit/src/lib.rs I, [2024-05-07T08:06:08.914438 #1604567] INFO -- : echo b19a6416da3a05d57fadd6ffdadb382b6d236ca5 | /bin/sh /home/opc/ruby/src/master/tool/ifchange /home/opc/ruby/src/master/.bundle/.timestamp/typeprof.revision - I, [2024-05-07T08:06:08.915366 #1604567] INFO -- : gcc (GCC) 8.5.0 20210514 (Red Hat 8.5.0-10.1.0.1) I, [2024-05-07T08:06:08.915405 #1604567] INFO -- : Copyright (C) 2018 Free Software Foundation, Inc. I, [2024-05-07T08:06:08.915415 #1604567] INFO -- : This is free software; see the source for copying conditions. There is NO I, [2024-05-07T08:06:08.915424 #1604567] INFO -- : warranty; not even for MERCHANTABILITY or FITNESS FOR A PARTICULAR PURPOSE. I, [2024-05-07T08:06:08.915433 #1604567] INFO -- : I, [2024-05-07T08:06:08.917411 #1604567] INFO -- : generating enc.mk I, [2024-05-07T08:06:08.919876 #1604567] INFO -- : /home/opc/ruby/src/master/.bundle/.timestamp/typeprof.revision unchanged I, [2024-05-07T08:06:09.017687 #1604567] INFO -- : Building power_assert@84e85124c5014a139af39161d484156cfe87a9ed to /home/opc/ruby/src/master/gems/power_assert-2.0.3.gem I, [2024-05-07T08:06:09.132127 #1604567] INFO -- : Successfully built RubyGem I, [2024-05-07T08:06:09.132189 #1604567] INFO -- : Name: power_assert I, [2024-05-07T08:06:09.132199 #1604567] INFO -- : Version: 2.0.4dev I, [2024-05-07T08:06:09.132208 #1604567] INFO -- : File: power_assert-2.0.4dev.gem I, [2024-05-07T08:06:09.134591 #1604567] INFO -- : Extracting bundle gem power_assert-2.0.3... I, [2024-05-07T08:06:09.154475 #1604567] INFO -- : making srcs under enc I, [2024-05-07T08:06:09.154660 #1604567] INFO -- : making enc I, [2024-05-07T08:06:09.183088 #1604567] INFO -- : make[1]: Entering directory '/home/opc/ruby/build/master' I, [2024-05-07T08:06:09.183169 #1604567] INFO -- : make[1]: Nothing to be done for 'enc'. I, [2024-05-07T08:06:09.183204 #1604567] INFO -- : make[1]: Leaving directory '/home/opc/ruby/build/master' I, [2024-05-07T08:06:09.197282 #1604567] INFO -- : make[1]: Entering directory '/home/opc/ruby/build/master' I, [2024-05-07T08:06:09.197338 #1604567] INFO -- : make[1]: Nothing to be done for 'srcs'. I, [2024-05-07T08:06:09.197349 #1604567] INFO -- : make[1]: Leaving directory '/home/opc/ruby/build/master' I, [2024-05-07T08:06:09.198157 #1604567] INFO -- : generating transdb.h I, [2024-05-07T08:06:09.233531 #1604567] INFO -- : Try with hash version of bundled gems instead of gems/power_assert-2.0.3.gem. We don't use this gem with release version of Ruby. I, [2024-05-07T08:06:09.243595 #1604567] INFO -- : Unpacked gems/power_assert-2.0.4dev.gem I, [2024-05-07T08:06:09.343460 #1604567] INFO -- : transdb.h unchanged I, [2024-05-07T08:06:09.344823 #1604567] INFO -- : generating makefiles ext/configure-ext.mk I, [2024-05-07T08:06:09.344966 #1604567] INFO -- : making trans I, [2024-05-07T08:06:09.386376 #1604567] INFO -- : ext/configure-ext.mk unchanged I, [2024-05-07T08:06:09.389309 #1604567] INFO -- : make[1]: Entering directory '/home/opc/ruby/build/master' I, [2024-05-07T08:06:09.393185 #1604567] INFO -- : make[1]: Entering directory '/home/opc/ruby/build/master' I, [2024-05-07T08:06:09.393227 #1604567] INFO -- : make[1]: Nothing to be done for 'trans'. I, [2024-05-07T08:06:09.393239 #1604567] INFO -- : make[1]: Leaving directory '/home/opc/ruby/build/master' I, [2024-05-07T08:06:09.393903 #1604567] INFO -- : making encs I, [2024-05-07T08:06:09.446217 #1604567] INFO -- : make[1]: Entering directory '/home/opc/ruby/build/master' I, [2024-05-07T08:06:09.446291 #1604567] INFO -- : make[1]: Nothing to be done for 'encs'. I, [2024-05-07T08:06:09.446305 #1604567] INFO -- : make[1]: Leaving directory '/home/opc/ruby/build/master' I, [2024-05-07T08:06:10.124553 #1604567] INFO -- : make[1]: Leaving directory '/home/opc/ruby/build/master' I, [2024-05-07T08:06:10.125336 #1604567] INFO -- : generating makefile exts.mk I, [2024-05-07T08:06:10.185186 #1604567] INFO -- : exts.mk unchanged I, [2024-05-07T08:06:10.190379 #1604567] INFO -- : make[1]: Entering directory '/home/opc/ruby/build/master' I, [2024-05-07T08:06:10.296062 #1604567] INFO -- : make[2]: Entering directory '/home/opc/ruby/build/master/ext/coverage' I, [2024-05-07T08:06:10.298358 #1604567] INFO -- : make[2]: Entering directory '/home/opc/ruby/build/master/ext/digest' I, [2024-05-07T08:06:10.300168 #1604567] INFO -- : make[2]: Entering directory '/home/opc/ruby/build/master/ext/date' I, [2024-05-07T08:06:10.301217 #1604567] INFO -- : make[2]: Leaving directory '/home/opc/ruby/build/master/ext/coverage' I, [2024-05-07T08:06:10.305781 #1604567] INFO -- : make[2]: Leaving directory '/home/opc/ruby/build/master/ext/date' I, [2024-05-07T08:06:10.308191 #1604567] INFO -- : make[2]: Leaving directory '/home/opc/ruby/build/master/ext/digest' I, [2024-05-07T08:06:10.314180 #1604567] INFO -- : make[2]: Entering directory '/home/opc/ruby/build/master/ext/io/console' I, [2024-05-07T08:06:10.315340 #1604567] INFO -- : make[2]: Entering directory '/home/opc/ruby/build/master/ext/fiddle' I, [2024-05-07T08:06:10.319628 #1604567] INFO -- : make[2]: Leaving directory '/home/opc/ruby/build/master/ext/io/console' I, [2024-05-07T08:06:10.323359 #1604567] INFO -- : make[2]: Entering directory '/home/opc/ruby/build/master/ext/json' I, [2024-05-07T08:06:10.326371 #1604567] INFO -- : make[2]: Leaving directory '/home/opc/ruby/build/master/ext/fiddle' I, [2024-05-07T08:06:10.327066 #1604567] INFO -- : make[2]: Entering directory '/home/opc/ruby/build/master/ext/monitor' I, [2024-05-07T08:06:10.331033 #1604567] INFO -- : make[2]: Leaving directory '/home/opc/ruby/build/master/ext/monitor' I, [2024-05-07T08:06:10.332479 #1604567] INFO -- : make[2]: Leaving directory '/home/opc/ruby/build/master/ext/json' I, [2024-05-07T08:06:10.333760 #1604567] INFO -- : make[2]: Entering directory '/home/opc/ruby/build/master/ext/objspace' I, [2024-05-07T08:06:10.336792 #1604567] INFO -- : make[2]: Entering directory '/home/opc/ruby/build/master/ext/pathname' I, [2024-05-07T08:06:10.339429 #1604567] INFO -- : make[2]: Leaving directory '/home/opc/ruby/build/master/ext/objspace' I, [2024-05-07T08:06:10.340942 #1604567] INFO -- : make[2]: Leaving directory '/home/opc/ruby/build/master/ext/pathname' I, [2024-05-07T08:06:10.345359 #1604567] INFO -- : make[2]: Entering directory '/home/opc/ruby/build/master/ext/pty' I, [2024-05-07T08:06:10.345720 #1604567] INFO -- : make[2]: Entering directory '/home/opc/ruby/build/master/ext/psych' I, [2024-05-07T08:06:10.350133 #1604567] INFO -- : make[2]: Entering directory '/home/opc/ruby/build/master/ext/openssl' I, [2024-05-07T08:06:10.352576 #1604567] INFO -- : make[2]: Leaving directory '/home/opc/ruby/build/master/ext/pty' I, [2024-05-07T08:06:10.363825 #1604567] INFO -- : make[2]: Leaving directory '/home/opc/ruby/build/master/ext/psych' I, [2024-05-07T08:06:10.365769 #1604567] INFO -- : make[2]: Entering directory '/home/opc/ruby/build/master/ext/rubyvm' I, [2024-05-07T08:06:10.366019 #1604567] INFO -- : make[2]: Entering directory '/home/opc/ruby/build/master/ext/ripper' I, [2024-05-07T08:06:10.368997 #1604567] INFO -- : make[2]: Leaving directory '/home/opc/ruby/build/master/ext/rubyvm' I, [2024-05-07T08:06:10.373825 #1604567] INFO -- : make[2]: Leaving directory '/home/opc/ruby/build/master/ext/ripper' I, [2024-05-07T08:06:10.374538 #1604567] INFO -- : make[2]: Leaving directory '/home/opc/ruby/build/master/ext/openssl' I, [2024-05-07T08:06:10.381091 #1604567] INFO -- : make[2]: Entering directory '/home/opc/ruby/build/master/.bundle/gems/bigdecimal-3.1.7/ext/bigdecimal' I, [2024-05-07T08:06:10.382294 #1604567] INFO -- : make[2]: Entering directory '/home/opc/ruby/build/master/ext/socket' I, [2024-05-07T08:06:10.386038 #1604567] INFO -- : make[2]: Entering directory '/home/opc/ruby/build/master/.bundle/gems/bigdecimal-3.1.8/ext/bigdecimal' I, [2024-05-07T08:06:10.394933 #1604567] INFO -- : make[2]: Leaving directory '/home/opc/ruby/build/master/ext/socket' I, [2024-05-07T08:06:10.397470 #1604567] INFO -- : make[2]: Entering directory '/home/opc/ruby/build/master/.bundle/gems/debug-1.9.2/ext/debug' I, [2024-05-07T08:06:10.412779 #1604567] INFO -- : make[2]: Leaving directory '/home/opc/ruby/build/master/.bundle/gems/bigdecimal-3.1.7/ext/bigdecimal' I, [2024-05-07T08:06:10.415358 #1604567] INFO -- : make[2]: Entering directory '/home/opc/ruby/build/master/.bundle/gems/nkf-0.2.0/ext/nkf' I, [2024-05-07T08:06:10.416703 #1604567] INFO -- : make[2]: Leaving directory '/home/opc/ruby/build/master/.bundle/gems/bigdecimal-3.1.8/ext/bigdecimal' I, [2024-05-07T08:06:10.418982 #1604567] INFO -- : make[2]: Entering directory '/home/opc/ruby/build/master/.bundle/gems/racc-1.7.3/ext/racc/cparse' I, [2024-05-07T08:06:10.430820 #1604567] INFO -- : make[2]: Leaving directory '/home/opc/ruby/build/master/.bundle/gems/debug-1.9.2/ext/debug' I, [2024-05-07T08:06:10.433763 #1604567] INFO -- : make[2]: Entering directory '/home/opc/ruby/build/master/.bundle/gems/rbs-3.4.4/ext/rbs_extension' I, [2024-05-07T08:06:10.447514 #1604567] INFO -- : make[2]: Leaving directory '/home/opc/ruby/build/master/.bundle/gems/nkf-0.2.0/ext/nkf' I, [2024-05-07T08:06:10.450002 #1604567] INFO -- : make[2]: Leaving directory '/home/opc/ruby/build/master/.bundle/gems/racc-1.7.3/ext/racc/cparse' I, [2024-05-07T08:06:10.450825 #1604567] INFO -- : make[2]: Entering directory '/home/opc/ruby/build/master/.bundle/gems/syslog-0.1.2/ext/syslog' I, [2024-05-07T08:06:10.469605 #1604567] INFO -- : make[2]: Leaving directory '/home/opc/ruby/build/master/.bundle/gems/rbs-3.4.4/ext/rbs_extension' I, [2024-05-07T08:06:10.472336 #1604567] INFO -- : make[2]: Entering directory '/home/opc/ruby/build/master/ext/digest/sha2' I, [2024-05-07T08:06:10.477865 #1604567] INFO -- : make[2]: Leaving directory '/home/opc/ruby/build/master/ext/digest/sha2' I, [2024-05-07T08:06:10.485482 #1604567] INFO -- : make[2]: Leaving directory '/home/opc/ruby/build/master/.bundle/gems/syslog-0.1.2/ext/syslog' I, [2024-05-07T08:06:10.523878 #1604567] INFO -- : make[2]: Entering directory '/home/opc/ruby/build/master' I, [2024-05-07T08:06:10.607925 #1604567] INFO -- : make[2]: 'ruby' is up to date. I, [2024-05-07T08:06:10.607995 #1604567] INFO -- : make[2]: Leaving directory '/home/opc/ruby/build/master' I, [2024-05-07T08:06:10.608115 #1604567] INFO -- : make[1]: Leaving directory '/home/opc/ruby/build/master' I, [2024-05-07T08:06:10.612395 #1604567] INFO -- : make[1]: Entering directory '/home/opc/ruby/build/master' I, [2024-05-07T08:06:10.612443 #1604567] INFO -- : make[1]: Nothing to be done for 'note'. I, [2024-05-07T08:06:10.612454 #1604567] INFO -- : make[1]: Leaving directory '/home/opc/ruby/build/master' I, [2024-05-07T08:06:10.612626 #1604567] INFO -- : ./miniruby -I/home/opc/ruby/src/master/lib -I. -I.ext/common /home/opc/ruby/src/master/tool/runruby.rb --extout=.ext -- --disable-gems -r./aarch64-linux-fake /home/opc/ruby/src/master/tool/rbinstall.rb --make="make" --dest-dir="" --extout=".ext" --ext-build-dir="./ext" --mflags="-j3 --jobserver-auth=4,5" --make-flags=" -j3 --jobserver-auth=4,5" --data-mode=0644 --prog-mode=0755 --installed-list .installed.list --mantype="doc" --gnumake --install=all --exclude=doc I, [2024-05-07T08:06:10.761572 #1604567] INFO -- : Installing to I, [2024-05-07T08:06:10.761639 #1604567] INFO -- : installing binary commands: /home/opc/ruby/install/master/bin I, [2024-05-07T08:06:10.773752 #1604567] INFO -- : installing base libraries: /home/opc/ruby/install/master/lib I, [2024-05-07T08:06:10.774258 #1604567] INFO -- : installing arch files: /home/opc/ruby/install/master/lib/ruby/3.4.0+0/aarch64-linux I, [2024-05-07T08:06:10.774376 #1604567] INFO -- : installing pkgconfig data: /home/opc/ruby/install/master/lib/pkgconfig I, [2024-05-07T08:06:10.774464 #1604567] INFO -- : installing extension objects: /home/opc/ruby/install/master/lib/ruby/3.4.0+0/aarch64-linux I, [2024-05-07T08:06:10.787472 #1604567] INFO -- : installing extension objects: /home/opc/ruby/install/master/lib/ruby/site_ruby/3.4.0+0/aarch64-linux I, [2024-05-07T08:06:10.787494 #1604567] INFO -- : installing extension objects: /home/opc/ruby/install/master/lib/ruby/vendor_ruby/3.4.0+0/aarch64-linux I, [2024-05-07T08:06:10.787619 #1604567] INFO -- : installing extension headers: /home/opc/ruby/install/master/include/ruby-3.4.0+0/aarch64-linux I, [2024-05-07T08:06:10.787903 #1604567] INFO -- : installing extension scripts: /home/opc/ruby/install/master/lib/ruby/3.4.0+0 I, [2024-05-07T08:06:10.796441 #1604567] INFO -- : installing extension scripts: /home/opc/ruby/install/master/lib/ruby/site_ruby/3.4.0+0 I, [2024-05-07T08:06:10.796482 #1604567] INFO -- : installing extension scripts: /home/opc/ruby/install/master/lib/ruby/vendor_ruby/3.4.0+0 I, [2024-05-07T08:06:10.796520 #1604567] INFO -- : installing extension headers: /home/opc/ruby/install/master/include/ruby-3.4.0+0/ruby I, [2024-05-07T08:06:10.796629 #1604567] INFO -- : installing command scripts: /home/opc/ruby/install/master/bin I, [2024-05-07T08:06:10.796754 #1604567] INFO -- : installing library scripts: /home/opc/ruby/install/master/lib/ruby/3.4.0+0 I, [2024-05-07T08:06:10.882909 #1604567] INFO -- : installing common headers: /home/opc/ruby/install/master/include/ruby-3.4.0+0 I, [2024-05-07T08:06:10.897274 #1604567] INFO -- : installing manpages: /home/opc/ruby/install/master/share/man/man1 I, [2024-05-07T08:06:10.897559 #1604567] INFO -- : installing default gems from lib: /home/opc/ruby/install/master/lib/ruby/gems/3.4.0+0 I, [2024-05-07T08:06:10.937256 #1604567] INFO -- : benchmark 0.3.0 I, [2024-05-07T08:06:10.950408 #1604567] INFO -- : bundler 2.6.0.dev I, [2024-05-07T08:06:10.955172 #1604567] INFO -- : cgi 0.4.1 I, [2024-05-07T08:06:10.956295 #1604567] INFO -- : delegate 0.3.1 I, [2024-05-07T08:06:10.957486 #1604567] INFO -- : did_you_mean 1.6.3 I, [2024-05-07T08:06:10.958572 #1604567] INFO -- : english 0.8.0 I, [2024-05-07T08:06:10.959940 #1604567] INFO -- : erb 4.0.4 I, [2024-05-07T08:06:10.962616 #1604567] INFO -- : error_highlight 0.6.0 I, [2024-05-07T08:06:10.963780 #1604567] INFO -- : fileutils 1.7.2 I, [2024-05-07T08:06:10.965264 #1604567] INFO -- : find 0.2.0 I, [2024-05-07T08:06:10.966392 #1604567] INFO -- : forwardable 1.3.3 I, [2024-05-07T08:06:10.967485 #1604567] INFO -- : ipaddr 1.2.6 I, [2024-05-07T08:06:10.968614 #1604567] INFO -- : irb 1.13.1 I, [2024-05-07T08:06:10.971518 #1604567] INFO -- : logger 1.6.0 I, [2024-05-07T08:06:10.972639 #1604567] INFO -- : net-http 0.4.1 I, [2024-05-07T08:06:10.975337 #1604567] INFO -- : net-protocol 0.2.2 I, [2024-05-07T08:06:10.976550 #1604567] INFO -- : open-uri 0.4.1 I, [2024-05-07T08:06:10.977808 #1604567] INFO -- : open3 0.2.1 I, [2024-05-07T08:06:10.978896 #1604567] INFO -- : optparse 0.5.0 I, [2024-05-07T08:06:10.980040 #1604567] INFO -- : ostruct 0.6.0 I, [2024-05-07T08:06:10.981139 #1604567] INFO -- : pp 0.5.0 I, [2024-05-07T08:06:10.982328 #1604567] INFO -- : prettyprint 0.2.0 I, [2024-05-07T08:06:10.983506 #1604567] INFO -- : prism 0.27.0 I, [2024-05-07T08:06:10.984727 #1604567] INFO -- : pstore 0.1.3 I, [2024-05-07T08:06:10.985935 #1604567] INFO -- : rdoc 6.6.3.1 I, [2024-05-07T08:06:10.989914 #1604567] INFO -- : readline 0.0.4 I, [2024-05-07T08:06:10.991034 #1604567] INFO -- : reline 0.5.5 I, [2024-05-07T08:06:10.992243 #1604567] INFO -- : resolv 0.4.0 I, [2024-05-07T08:06:10.993503 #1604567] INFO -- : ruby2_keywords 0.0.5 I, [2024-05-07T08:06:10.994633 #1604567] INFO -- : securerandom 0.3.1 I, [2024-05-07T08:06:10.995744 #1604567] INFO -- : set 1.1.0 I, [2024-05-07T08:06:10.996872 #1604567] INFO -- : shellwords 0.2.0 I, [2024-05-07T08:06:10.998071 #1604567] INFO -- : singleton 0.2.0 I, [2024-05-07T08:06:10.999140 #1604567] INFO -- : syntax_suggest 2.0.0 I, [2024-05-07T08:06:11.003265 #1604567] INFO -- : tempfile 0.2.1 I, [2024-05-07T08:06:11.004378 #1604567] INFO -- : time 0.3.0 I, [2024-05-07T08:06:11.005568 #1604567] INFO -- : timeout 0.4.1 I, [2024-05-07T08:06:11.006653 #1604567] INFO -- : tmpdir 0.2.0 I, [2024-05-07T08:06:11.007821 #1604567] INFO -- : tsort 0.2.0 I, [2024-05-07T08:06:11.009057 #1604567] INFO -- : un 0.3.0 I, [2024-05-07T08:06:11.010148 #1604567] INFO -- : uri 0.13.0 I, [2024-05-07T08:06:11.011312 #1604567] INFO -- : weakref 0.1.3 I, [2024-05-07T08:06:11.012461 #1604567] INFO -- : yaml 0.3.0 I, [2024-05-07T08:06:11.013459 #1604567] INFO -- : installing default gems from ext: /home/opc/ruby/install/master/lib/ruby/gems/3.4.0+0 I, [2024-05-07T08:06:11.023202 #1604567] INFO -- : date 3.3.4 I, [2024-05-07T08:06:11.025917 #1604567] INFO -- : digest 3.1.1 I, [2024-05-07T08:06:11.027065 #1604567] INFO -- : etc 1.4.3 I, [2024-05-07T08:06:11.028289 #1604567] INFO -- : fcntl 1.1.0 I, [2024-05-07T08:06:11.029669 #1604567] INFO -- : fiddle 1.1.3 I, [2024-05-07T08:06:11.030809 #1604567] INFO -- : io-console 0.7.2 I, [2024-05-07T08:06:11.031922 #1604567] INFO -- : io-nonblock 0.3.0 I, [2024-05-07T08:06:11.033218 #1604567] INFO -- : io-wait 0.3.1 I, [2024-05-07T08:06:11.034350 #1604567] INFO -- : json 2.7.2 I, [2024-05-07T08:06:11.035636 #1604567] INFO -- : openssl 3.2.0 I, [2024-05-07T08:06:11.037051 #1604567] INFO -- : pathname 0.3.0 I, [2024-05-07T08:06:11.038629 #1604567] INFO -- : psych 5.1.2 I, [2024-05-07T08:06:11.039847 #1604567] INFO -- : stringio 3.1.1 I, [2024-05-07T08:06:11.041052 #1604567] INFO -- : strscan 3.1.1 I, [2024-05-07T08:06:11.042182 #1604567] INFO -- : zlib 3.1.0 I, [2024-05-07T08:06:11.043097 #1604567] INFO -- : installing bundled gems: /home/opc/ruby/install/master/lib/ruby/gems/3.4.0+0 I, [2024-05-07T08:06:11.043719 #1604567] INFO -- : minitest 5.22.3 I, [2024-05-07T08:06:11.057541 #1604567] INFO -- : rake 13.2.1 I, [2024-05-07T08:06:11.075274 #1604567] INFO -- : test-unit 3.6.2 I, [2024-05-07T08:06:11.093840 #1604567] INFO -- : rexml 3.2.6 I, [2024-05-07T08:06:11.110384 #1604567] INFO -- : rss 0.3.0 I, [2024-05-07T08:06:11.122299 #1604567] INFO -- : net-ftp 0.3.4 I, [2024-05-07T08:06:11.125915 #1604567] INFO -- : net-imap 0.4.10 I, [2024-05-07T08:06:11.138799 #1604567] INFO -- : net-pop 0.1.2 I, [2024-05-07T08:06:11.142972 #1604567] INFO -- : net-smtp 0.5.0 I, [2024-05-07T08:06:11.146120 #1604567] INFO -- : matrix 0.4.2 I, [2024-05-07T08:06:11.151786 #1604567] INFO -- : prime 0.1.2 I, [2024-05-07T08:06:11.162187 #1604567] INFO -- : rbs 3.4.4 I, [2024-05-07T08:06:11.263440 #1604567] INFO -- : typeprof 0.21.11 I, [2024-05-07T08:06:11.276850 #1604567] INFO -- : debug 1.9.2 I, [2024-05-07T08:06:11.287906 #1604567] INFO -- : racc 1.7.3 I, [2024-05-07T08:06:11.297818 #1604567] INFO -- : mutex_m 0.2.0 I, [2024-05-07T08:06:11.300679 #1604567] INFO -- : getoptlong 0.2.1 I, [2024-05-07T08:06:11.306311 #1604567] INFO -- : base64 0.2.0 I, [2024-05-07T08:06:11.308711 #1604567] INFO -- : bigdecimal 3.1.8 I, [2024-05-07T08:06:11.315088 #1604567] INFO -- : observer 0.1.2 I, [2024-05-07T08:06:11.317967 #1604567] INFO -- : abbrev 0.1.2 I, [2024-05-07T08:06:11.320803 #1604567] INFO -- : resolv-replace 0.1.1 I, [2024-05-07T08:06:11.323771 #1604567] INFO -- : rinda 0.2.0 I, [2024-05-07T08:06:11.327119 #1604567] INFO -- : drb 2.2.1 I, [2024-05-07T08:06:11.331639 #1604567] INFO -- : nkf 0.2.0 I, [2024-05-07T08:06:11.339269 #1604567] INFO -- : syslog 0.1.2 I, [2024-05-07T08:06:11.343673 #1604567] INFO -- : csv 3.3.0 I, [2024-05-07T08:06:11.356202 #1604567] INFO -- : installing bundled gem cache: /home/opc/ruby/install/master/lib/ruby/gems/3.4.0+0/cache I, [2024-05-07T08:06:11.358119 #1604567] INFO -- : skipped bundled gems: I, [2024-05-07T08:06:11.358152 #1604567] INFO -- : power_assert-2.0.4dev.gem not found in bundled_gems I, [2024-05-07T08:06:11.360959 #1604567] INFO -- : $$$[end] "make install -j3" exit with 0. I, [2024-05-07T08:06:11.361126 #1604567] INFO -- : $$$[beg] make yes-btest TESTOPTS='-q -j3' I, [2024-05-07T08:06:33.176133 #1604567] INFO -- : PASS all 1936 tests E, [2024-05-07T08:06:33.178031 #1604567] ERROR -- : I, [2024-05-07T08:06:33.178159 #1604567] INFO -- : $$$[end] "make yes-btest TESTOPTS='-q -j3'" exit with 0. I, [2024-05-07T08:06:33.178316 #1604567] INFO -- : $$$[beg] make yes-test-basic TESTS='-j3' I, [2024-05-07T08:06:33.271736 #1604567] INFO -- : BASERUBY = /usr/local/bin/ruby --disable=gems I, [2024-05-07T08:06:33.271804 #1604567] INFO -- : CC = gcc I, [2024-05-07T08:06:33.271814 #1604567] INFO -- : LD = ld I, [2024-05-07T08:06:33.271823 #1604567] INFO -- : LDSHARED = gcc -shared I, [2024-05-07T08:06:33.271833 #1604567] INFO -- : CFLAGS = -O3 -fno-fast-math -ggdb3 -Wall -Wextra -Wdeprecated-declarations -Wdiv-by-zero -Wduplicated-cond -Wimplicit-function-declaration -Wimplicit-int -Wpointer-arith -Wwrite-strings -Wold-style-definition -Wimplicit-fallthrough=0 -Wmissing-noreturn -Wno-cast-function-type -Wno-constant-logical-operand -Wno-long-long -Wno-missing-field-initializers -Wno-overlength-strings -Wno-packed-bitfield-compat -Wno-parentheses-equality -Wno-self-assign -Wno-tautological-compare -Wno-unused-parameter -Wno-unused-value -Wsuggest-attribute=format -Wsuggest-attribute=noreturn -Wunused-variable -Wmisleading-indentation -Wundef I, [2024-05-07T08:06:33.273334 #1604567] INFO -- : XCFLAGS = -U_FORTIFY_SOURCE -D_FORTIFY_SOURCE=2 -fstack-protector-strong -msign-return-address=all -fno-strict-overflow -fvisibility=hidden -fexcess-precision=standard -DRUBY_EXPORT -fPIE -I. -I.ext/include/aarch64-linux -I/home/opc/ruby/src/master/include -I/home/opc/ruby/src/master -I/home/opc/ruby/src/master/prism -I/home/opc/ruby/src/master/enc/unicode/15.0.0 I, [2024-05-07T08:06:33.273349 #1604567] INFO -- : CPPFLAGS = I, [2024-05-07T08:06:33.273359 #1604567] INFO -- : DLDFLAGS = -Wl,--compress-debug-sections=zlib -fstack-protector-strong -pie I, [2024-05-07T08:06:33.273368 #1604567] INFO -- : SOLIBS = -lz -lrt -lrt -ldl -lcrypt -lm -lpthread I, [2024-05-07T08:06:33.273376 #1604567] INFO -- : LANG = en_US.UTF-8 I, [2024-05-07T08:06:33.273383 #1604567] INFO -- : LC_ALL = I, [2024-05-07T08:06:33.273391 #1604567] INFO -- : LC_CTYPE = I, [2024-05-07T08:06:33.273398 #1604567] INFO -- : MFLAGS = I, [2024-05-07T08:06:33.273406 #1604567] INFO -- : RUSTC = rustc I, [2024-05-07T08:06:33.273414 #1604567] INFO -- : YJIT_RUSTC_ARGS = --crate-name=yjit --crate-type=staticlib --edition=2021 -g -C lto=thin -C opt-level=3 -C overflow-checks=on '--out-dir=/home/opc/ruby/build/master/yjit/target/release/' /home/opc/ruby/src/master/yjit/src/lib.rs I, [2024-05-07T08:06:33.273425 #1604567] INFO -- : gcc (GCC) 8.5.0 20210514 (Red Hat 8.5.0-10.1.0.1) I, [2024-05-07T08:06:33.273433 #1604567] INFO -- : Copyright (C) 2018 Free Software Foundation, Inc. I, [2024-05-07T08:06:33.273441 #1604567] INFO -- : This is free software; see the source for copying conditions. There is NO I, [2024-05-07T08:06:33.273449 #1604567] INFO -- : warranty; not even for MERCHANTABILITY or FITNESS FOR A PARTICULAR PURPOSE. I, [2024-05-07T08:06:33.273456 #1604567] INFO -- : I, [2024-05-07T08:06:33.429157 #1604567] INFO -- : Checking leaked global symbols...none I, [2024-05-07T08:06:33.480664 #1604567] INFO -- : /home/opc/ruby/src/master/basictest/test.rb:assignment ....................................................................................................................................................................................................................................................................................................................................................................................OK 372 I, [2024-05-07T08:06:33.480739 #1604567] INFO -- : /home/opc/ruby/src/master/basictest/test.rb:condition ..OK 2 I, [2024-05-07T08:06:33.480753 #1604567] INFO -- : /home/opc/ruby/src/master/basictest/test.rb:if/unless ...OK 3 I, [2024-05-07T08:06:33.480805 #1604567] INFO -- : /home/opc/ruby/src/master/basictest/test.rb:case .....OK 5 I, [2024-05-07T08:06:33.481395 #1604567] INFO -- : /home/opc/ruby/src/master/basictest/test.rb:while/until ........OK 8 I, [2024-05-07T08:06:33.481525 #1604567] INFO -- : /home/opc/ruby/src/master/basictest/test.rb:exception ..........OK 10 I, [2024-05-07T08:06:33.482160 #1604567] INFO -- : /home/opc/ruby/src/master/basictest/test.rb:array .......................................OK 39 I, [2024-05-07T08:06:33.482419 #1604567] INFO -- : /home/opc/ruby/src/master/basictest/test.rb:hash ...........................OK 27 I, [2024-05-07T08:06:33.484075 #1604567] INFO -- : /home/opc/ruby/src/master/basictest/test.rb:iterator ...........................................................................................................OK 107 I, [2024-05-07T08:06:33.484802 #1604567] INFO -- : /home/opc/ruby/src/master/basictest/test.rb:float ................................................................................OK 80 I, [2024-05-07T08:06:33.488391 #1604567] INFO -- : /home/opc/ruby/src/master/basictest/test.rb:bignum ...............................OK 31 I, [2024-05-07T08:06:33.490002 #1604567] INFO -- : /home/opc/ruby/src/master/basictest/test.rb:string & char ..............................................................OK 62 I, [2024-05-07T08:06:33.490072 #1604567] INFO -- : /home/opc/ruby/src/master/basictest/test.rb:assignment ..........OK 10 I, [2024-05-07T08:06:33.490161 #1604567] INFO -- : /home/opc/ruby/src/master/basictest/test.rb:call ......OK 6 I, [2024-05-07T08:06:33.490295 #1604567] INFO -- : /home/opc/ruby/src/master/basictest/test.rb:proc .........OK 9 I, [2024-05-07T08:06:33.590541 #1604567] INFO -- : /home/opc/ruby/src/master/basictest/test.rb:signal ..OK 2 I, [2024-05-07T08:06:33.591951 #1604567] INFO -- : /home/opc/ruby/src/master/basictest/test.rb:eval ...........................OK 27 I, [2024-05-07T08:06:33.723227 #1604567] INFO -- : /home/opc/ruby/src/master/basictest/test.rb:system ........OK 8 I, [2024-05-07T08:06:33.723301 #1604567] INFO -- : /home/opc/ruby/src/master/basictest/test.rb:const .....OK 5 I, [2024-05-07T08:06:33.723406 #1604567] INFO -- : /home/opc/ruby/src/master/basictest/test.rb:clone .....OK 5 I, [2024-05-07T08:06:33.723591 #1604567] INFO -- : /home/opc/ruby/src/master/basictest/test.rb:marshal ....OK 4 I, [2024-05-07T08:06:33.723667 #1604567] INFO -- : /home/opc/ruby/src/master/basictest/test.rb:pack ....OK 4 I, [2024-05-07T08:06:33.723698 #1604567] INFO -- : /home/opc/ruby/src/master/basictest/test.rb:math ..OK 2 I, [2024-05-07T08:06:33.723787 #1604567] INFO -- : /home/opc/ruby/src/master/basictest/test.rb:struct ......OK 6 I, [2024-05-07T08:06:33.723956 #1604567] INFO -- : /home/opc/ruby/src/master/basictest/test.rb:variable ............OK 12 I, [2024-05-07T08:06:33.723997 #1604567] INFO -- : /home/opc/ruby/src/master/basictest/test.rb:trace ...OK 3 I, [2024-05-07T08:06:33.724118 #1604567] INFO -- : /home/opc/ruby/src/master/basictest/test.rb:defined? ............OK 12 I, [2024-05-07T08:06:33.724208 #1604567] INFO -- : /home/opc/ruby/src/master/basictest/test.rb:alias ......OK 6 I, [2024-05-07T08:06:33.724725 #1604567] INFO -- : /home/opc/ruby/src/master/basictest/test.rb:path .......................OK 23 I, [2024-05-07T08:06:33.793524 #1604567] INFO -- : /home/opc/ruby/src/master/basictest/test.rb:gc ....OK 4 I, [2024-05-07T08:06:33.795431 #1604567] INFO -- : I, [2024-05-07T08:06:33.795454 #1604567] INFO -- : test succeeded I, [2024-05-07T08:06:33.796024 #1604567] INFO -- : $$$[end] "make yes-test-basic TESTS='-j3'" exit with 0. I, [2024-05-07T08:06:33.796197 #1604567] INFO -- : $$$[beg] make yes-test-all TESTOPTS='--stderr-on-failure' TESTS='-j3' I, [2024-05-07T08:06:33.919844 #1604567] INFO -- : BASERUBY = /usr/local/bin/ruby --disable=gems I, [2024-05-07T08:06:33.919918 #1604567] INFO -- : CC = gcc I, [2024-05-07T08:06:33.919930 #1604567] INFO -- : LD = ld I, [2024-05-07T08:06:33.919939 #1604567] INFO -- : LDSHARED = gcc -shared I, [2024-05-07T08:06:33.919951 #1604567] INFO -- : CFLAGS = -O3 -fno-fast-math -ggdb3 -Wall -Wextra -Wdeprecated-declarations -Wdiv-by-zero -Wduplicated-cond -Wimplicit-function-declaration -Wimplicit-int -Wpointer-arith -Wwrite-strings -Wold-style-definition -Wimplicit-fallthrough=0 -Wmissing-noreturn -Wno-cast-function-type -Wno-constant-logical-operand -Wno-long-long -Wno-missing-field-initializers -Wno-overlength-strings -Wno-packed-bitfield-compat -Wno-parentheses-equality -Wno-self-assign -Wno-tautological-compare -Wno-unused-parameter -Wno-unused-value -Wsuggest-attribute=format -Wsuggest-attribute=noreturn -Wunused-variable -Wmisleading-indentation -Wundef I, [2024-05-07T08:06:33.919961 #1604567] INFO -- : XCFLAGS = -U_FORTIFY_SOURCE -D_FORTIFY_SOURCE=2 -fstack-protector-strong -msign-return-address=all -fno-strict-overflow -fvisibility=hidden -fexcess-precision=standard -DRUBY_EXPORT -fPIE -I. -I.ext/include/aarch64-linux -I/home/opc/ruby/src/master/include -I/home/opc/ruby/src/master -I/home/opc/ruby/src/master/prism -I/home/opc/ruby/src/master/enc/unicode/15.0.0 I, [2024-05-07T08:06:33.919970 #1604567] INFO -- : CPPFLAGS = I, [2024-05-07T08:06:33.919979 #1604567] INFO -- : DLDFLAGS = -Wl,--compress-debug-sections=zlib -fstack-protector-strong -pie I, [2024-05-07T08:06:33.919988 #1604567] INFO -- : SOLIBS = -lz -lrt -lrt -ldl -lcrypt -lm -lpthread I, [2024-05-07T08:06:33.919996 #1604567] INFO -- : LANG = en_US.UTF-8 I, [2024-05-07T08:06:33.920004 #1604567] INFO -- : LC_ALL = I, [2024-05-07T08:06:33.920012 #1604567] INFO -- : LC_CTYPE = I, [2024-05-07T08:06:33.920020 #1604567] INFO -- : MFLAGS = I, [2024-05-07T08:06:33.920028 #1604567] INFO -- : RUSTC = rustc I, [2024-05-07T08:06:33.920037 #1604567] INFO -- : YJIT_RUSTC_ARGS = --crate-name=yjit --crate-type=staticlib --edition=2021 -g -C lto=thin -C opt-level=3 -C overflow-checks=on '--out-dir=/home/opc/ruby/build/master/yjit/target/release/' /home/opc/ruby/src/master/yjit/src/lib.rs I, [2024-05-07T08:06:33.920760 #1604567] INFO -- : gcc (GCC) 8.5.0 20210514 (Red Hat 8.5.0-10.1.0.1) I, [2024-05-07T08:06:33.920781 #1604567] INFO -- : Copyright (C) 2018 Free Software Foundation, Inc. I, [2024-05-07T08:06:33.920791 #1604567] INFO -- : This is free software; see the source for copying conditions. There is NO I, [2024-05-07T08:06:33.920800 #1604567] INFO -- : warranty; not even for MERCHANTABILITY or FITNESS FOR A PARTICULAR PURPOSE. I, [2024-05-07T08:06:33.920808 #1604567] INFO -- : I, [2024-05-07T08:06:33.922842 #1604567] INFO -- : generating enc.mk I, [2024-05-07T08:06:34.173514 #1604567] INFO -- : making enc I, [2024-05-07T08:06:34.201383 #1604567] INFO -- : make[1]: Entering directory '/home/opc/ruby/build/master' I, [2024-05-07T08:06:34.201452 #1604567] INFO -- : make[1]: Nothing to be done for 'enc'. I, [2024-05-07T08:06:34.201462 #1604567] INFO -- : make[1]: Leaving directory '/home/opc/ruby/build/master' I, [2024-05-07T08:06:34.202177 #1604567] INFO -- : making srcs under enc I, [2024-05-07T08:06:34.243795 #1604567] INFO -- : make[1]: Entering directory '/home/opc/ruby/build/master' I, [2024-05-07T08:06:34.243876 #1604567] INFO -- : make[1]: Nothing to be done for 'srcs'. I, [2024-05-07T08:06:34.243887 #1604567] INFO -- : make[1]: Leaving directory '/home/opc/ruby/build/master' I, [2024-05-07T08:06:34.244981 #1604567] INFO -- : generating transdb.h I, [2024-05-07T08:06:34.388513 #1604567] INFO -- : transdb.h unchanged I, [2024-05-07T08:06:34.389906 #1604567] INFO -- : making trans I, [2024-05-07T08:06:34.438102 #1604567] INFO -- : make[1]: Entering directory '/home/opc/ruby/build/master' I, [2024-05-07T08:06:34.438183 #1604567] INFO -- : make[1]: Nothing to be done for 'trans'. I, [2024-05-07T08:06:34.438194 #1604567] INFO -- : make[1]: Leaving directory '/home/opc/ruby/build/master' I, [2024-05-07T08:06:34.438929 #1604567] INFO -- : making encs I, [2024-05-07T08:06:34.491548 #1604567] INFO -- : make[1]: Entering directory '/home/opc/ruby/build/master' I, [2024-05-07T08:06:34.491627 #1604567] INFO -- : make[1]: Nothing to be done for 'encs'. I, [2024-05-07T08:06:34.491638 #1604567] INFO -- : make[1]: Leaving directory '/home/opc/ruby/build/master' I, [2024-05-07T08:06:34.493643 #1604567] INFO -- : generating makefiles ext/configure-ext.mk I, [2024-05-07T08:06:34.534431 #1604567] INFO -- : ext/configure-ext.mk updated I, [2024-05-07T08:06:34.537922 #1604567] INFO -- : make[1]: Entering directory '/home/opc/ruby/build/master' I, [2024-05-07T08:06:36.635561 #1604567] INFO -- : make[1]: Leaving directory '/home/opc/ruby/build/master' I, [2024-05-07T08:06:36.636299 #1604567] INFO -- : generating makefile exts.mk I, [2024-05-07T08:06:36.695841 #1604567] INFO -- : exts.mk unchanged I, [2024-05-07T08:06:36.700687 #1604567] INFO -- : make[1]: Entering directory '/home/opc/ruby/build/master' I, [2024-05-07T08:06:36.997400 #1604567] INFO -- : make[2]: Entering directory '/home/opc/ruby/build/master/ext/coverage' I, [2024-05-07T08:06:37.002006 #1604567] INFO -- : make[2]: Leaving directory '/home/opc/ruby/build/master/ext/coverage' I, [2024-05-07T08:06:37.007571 #1604567] INFO -- : make[2]: Entering directory '/home/opc/ruby/build/master/ext/date' I, [2024-05-07T08:06:37.012825 #1604567] INFO -- : make[2]: Leaving directory '/home/opc/ruby/build/master/ext/date' I, [2024-05-07T08:06:37.016284 #1604567] INFO -- : make[2]: Entering directory '/home/opc/ruby/build/master/ext/digest' I, [2024-05-07T08:06:37.025011 #1604567] INFO -- : make[2]: Leaving directory '/home/opc/ruby/build/master/ext/digest' I, [2024-05-07T08:06:37.047652 #1604567] INFO -- : make[2]: Entering directory '/home/opc/ruby/build/master/ext/digest/sha2' I, [2024-05-07T08:06:37.052516 #1604567] INFO -- : make[2]: Leaving directory '/home/opc/ruby/build/master/ext/digest/sha2' I, [2024-05-07T08:06:37.070851 #1604567] INFO -- : make[2]: Entering directory '/home/opc/ruby/build/master/ext/fiddle' I, [2024-05-07T08:06:37.081019 #1604567] INFO -- : make[2]: Leaving directory '/home/opc/ruby/build/master/ext/fiddle' I, [2024-05-07T08:06:37.085328 #1604567] INFO -- : make[2]: Entering directory '/home/opc/ruby/build/master/ext/io/console' I, [2024-05-07T08:06:37.089549 #1604567] INFO -- : make[2]: Leaving directory '/home/opc/ruby/build/master/ext/io/console' I, [2024-05-07T08:06:37.100248 #1604567] INFO -- : make[2]: Entering directory '/home/opc/ruby/build/master/ext/json' I, [2024-05-07T08:06:37.109619 #1604567] INFO -- : make[2]: Leaving directory '/home/opc/ruby/build/master/ext/json' I, [2024-05-07T08:06:37.122691 #1604567] INFO -- : make[2]: Entering directory '/home/opc/ruby/build/master/ext/monitor' I, [2024-05-07T08:06:37.126808 #1604567] INFO -- : make[2]: Leaving directory '/home/opc/ruby/build/master/ext/monitor' I, [2024-05-07T08:06:37.132858 #1604567] INFO -- : make[2]: Entering directory '/home/opc/ruby/build/master/ext/objspace' I, [2024-05-07T08:06:37.138736 #1604567] INFO -- : make[2]: Leaving directory '/home/opc/ruby/build/master/ext/objspace' I, [2024-05-07T08:06:37.158537 #1604567] INFO -- : make[2]: Entering directory '/home/opc/ruby/build/master/ext/openssl' I, [2024-05-07T08:06:37.180366 #1604567] INFO -- : make[2]: Leaving directory '/home/opc/ruby/build/master/ext/openssl' I, [2024-05-07T08:06:37.184655 #1604567] INFO -- : make[2]: Entering directory '/home/opc/ruby/build/master/ext/pathname' I, [2024-05-07T08:06:37.188729 #1604567] INFO -- : make[2]: Leaving directory '/home/opc/ruby/build/master/ext/pathname' I, [2024-05-07T08:06:37.195186 #1604567] INFO -- : make[2]: Entering directory '/home/opc/ruby/build/master/ext/psych' I, [2024-05-07T08:06:37.216911 #1604567] INFO -- : make[2]: Leaving directory '/home/opc/ruby/build/master/ext/psych' I, [2024-05-07T08:06:37.221302 #1604567] INFO -- : make[2]: Entering directory '/home/opc/ruby/build/master/ext/pty' I, [2024-05-07T08:06:37.225632 #1604567] INFO -- : make[2]: Leaving directory '/home/opc/ruby/build/master/ext/pty' I, [2024-05-07T08:06:37.238939 #1604567] INFO -- : make[2]: Entering directory '/home/opc/ruby/build/master/ext/ripper' I, [2024-05-07T08:06:37.246669 #1604567] INFO -- : make[2]: Leaving directory '/home/opc/ruby/build/master/ext/ripper' I, [2024-05-07T08:06:37.248959 #1604567] INFO -- : make[2]: Entering directory '/home/opc/ruby/build/master/ext/rubyvm' I, [2024-05-07T08:06:37.252407 #1604567] INFO -- : make[2]: Leaving directory '/home/opc/ruby/build/master/ext/rubyvm' I, [2024-05-07T08:06:37.264773 #1604567] INFO -- : make[2]: Entering directory '/home/opc/ruby/build/master/ext/socket' I, [2024-05-07T08:06:37.275395 #1604567] INFO -- : make[2]: Leaving directory '/home/opc/ruby/build/master/ext/socket' I, [2024-05-07T08:06:37.291220 #1604567] INFO -- : make[2]: Entering directory '/home/opc/ruby/build/master/.bundle/gems/bigdecimal-3.1.7/ext/bigdecimal' I, [2024-05-07T08:06:37.322483 #1604567] INFO -- : make[2]: Leaving directory '/home/opc/ruby/build/master/.bundle/gems/bigdecimal-3.1.7/ext/bigdecimal' I, [2024-05-07T08:06:37.325191 #1604567] INFO -- : make[2]: Entering directory '/home/opc/ruby/build/master/.bundle/gems/bigdecimal-3.1.8/ext/bigdecimal' I, [2024-05-07T08:06:37.355401 #1604567] INFO -- : make[2]: Leaving directory '/home/opc/ruby/build/master/.bundle/gems/bigdecimal-3.1.8/ext/bigdecimal' I, [2024-05-07T08:06:37.358780 #1604567] INFO -- : make[2]: Entering directory '/home/opc/ruby/build/master/.bundle/gems/debug-1.9.2/ext/debug' I, [2024-05-07T08:06:37.390377 #1604567] INFO -- : make[2]: Leaving directory '/home/opc/ruby/build/master/.bundle/gems/debug-1.9.2/ext/debug' I, [2024-05-07T08:06:37.392991 #1604567] INFO -- : make[2]: Entering directory '/home/opc/ruby/build/master/.bundle/gems/nkf-0.2.0/ext/nkf' I, [2024-05-07T08:06:37.423724 #1604567] INFO -- : make[2]: Leaving directory '/home/opc/ruby/build/master/.bundle/gems/nkf-0.2.0/ext/nkf' I, [2024-05-07T08:06:37.426188 #1604567] INFO -- : make[2]: Entering directory '/home/opc/ruby/build/master/.bundle/gems/racc-1.7.3/ext/racc/cparse' I, [2024-05-07T08:06:37.456223 #1604567] INFO -- : make[2]: Leaving directory '/home/opc/ruby/build/master/.bundle/gems/racc-1.7.3/ext/racc/cparse' I, [2024-05-07T08:06:37.459293 #1604567] INFO -- : make[2]: Entering directory '/home/opc/ruby/build/master/.bundle/gems/rbs-3.4.4/ext/rbs_extension' I, [2024-05-07T08:06:37.489890 #1604567] INFO -- : make[2]: Leaving directory '/home/opc/ruby/build/master/.bundle/gems/rbs-3.4.4/ext/rbs_extension' I, [2024-05-07T08:06:37.492379 #1604567] INFO -- : make[2]: Entering directory '/home/opc/ruby/build/master/.bundle/gems/syslog-0.1.2/ext/syslog' I, [2024-05-07T08:06:37.523462 #1604567] INFO -- : make[2]: Leaving directory '/home/opc/ruby/build/master/.bundle/gems/syslog-0.1.2/ext/syslog' I, [2024-05-07T08:06:37.562410 #1604567] INFO -- : make[2]: Entering directory '/home/opc/ruby/build/master' I, [2024-05-07T08:06:37.646804 #1604567] INFO -- : make[2]: 'ruby' is up to date. I, [2024-05-07T08:06:37.646906 #1604567] INFO -- : make[2]: Leaving directory '/home/opc/ruby/build/master' I, [2024-05-07T08:06:37.647011 #1604567] INFO -- : make[1]: Leaving directory '/home/opc/ruby/build/master' I, [2024-05-07T08:06:37.651415 #1604567] INFO -- : make[1]: Entering directory '/home/opc/ruby/build/master' I, [2024-05-07T08:06:37.651440 #1604567] INFO -- : make[1]: Nothing to be done for 'note'. I, [2024-05-07T08:06:37.651450 #1604567] INFO -- : make[1]: Leaving directory '/home/opc/ruby/build/master' I, [2024-05-07T08:06:37.764942 #1604567] INFO -- : Run options: I, [2024-05-07T08:06:37.765023 #1604567] INFO -- : --seed=44744 I, [2024-05-07T08:06:37.765034 #1604567] INFO -- : "--ruby=./miniruby -I/home/opc/ruby/src/master/lib -I. -I.ext/common /home/opc/ruby/src/master/tool/runruby.rb --extout=.ext -- --disable-gems" I, [2024-05-07T08:06:37.765043 #1604567] INFO -- : --excludes-dir=/home/opc/ruby/src/master/test/.excludes I, [2024-05-07T08:06:37.765052 #1604567] INFO -- : --name=!/memory_leak/ I, [2024-05-07T08:06:37.765060 #1604567] INFO -- : --stderr-on-failure I, [2024-05-07T08:06:37.765068 #1604567] INFO -- : -j3 I, [2024-05-07T08:06:37.765076 #1604567] INFO -- : I, [2024-05-07T08:06:37.765085 #1604567] INFO -- : # Running tests: I, [2024-05-07T08:06:37.765109 #1604567] INFO -- : I, [2024-05-07T08:06:37.894686 #1604567] INFO -- : [ 1/885] 1645441=test_dryrun I, [2024-05-07T08:06:37.904831 #1604567] INFO -- : [ 2/885] 1645442=test_rdoc_i18n_locale I, [2024-05-07T08:06:37.905157 #1604567] INFO -- : [ 3/885] 1645443=test_gc_compact I, [2024-05-07T08:06:37.938973 #1604567] INFO -- : [ 4/885] 1645441=test_queue I, [2024-05-07T08:06:37.964671 #1604567] INFO -- : [ 5/885] 1645441=test_boolean I, [2024-05-07T08:06:38.021061 #1604567] INFO -- : [ 6/885] 1645441=test_gem_resolver_lock_specification I, [2024-05-07T08:06:38.122785 #1604567] INFO -- : [ 7/885] 1645442=test_clone I, [2024-05-07T08:06:38.182433 #1604567] INFO -- : [ 8/885] 1645441=test_enc_raise I, [2024-05-07T08:06:38.192054 #1604567] INFO -- : [ 9/885] 1645441=test_prettyprint I, [2024-05-07T08:06:38.192598 #1604567] INFO -- : [ 10/885] 1645442=test_gem_uri_formatter I, [2024-05-07T08:06:38.234166 #1604567] INFO -- : [ 11/885] 1645441=test_cgi_util I, [2024-05-07T08:06:38.420075 #1604567] INFO -- : [ 12/885] 1645441=test_ole_methods I, [2024-05-07T08:06:38.422746 #1604567] INFO -- : [ 13/885] 1645442=test_rdoc_store I, [2024-05-07T08:06:38.425860 #1604567] INFO -- : [ 14/885] 1645441=test_shift_jis I, [2024-05-07T08:06:38.440873 #1604567] INFO -- : [ 15/885] 1645441=test_rubyoptions I, [2024-05-07T08:06:39.119204 #1604567] INFO -- : [ 16/885] 1645442=test_data_error I, [2024-05-07T08:06:39.190611 #1604567] INFO -- : [ 17/885] 1645442=test_files_sample I, [2024-05-07T08:06:39.268105 #1604567] INFO -- : [ 18/885] 1645442=test_rdoc_stats I, [2024-05-07T08:06:39.306550 #1604567] INFO -- : [ 19/885] 1645442=test_optimization I, [2024-05-07T08:06:40.133702 #1604567] INFO -- : [ 20/885] 1645443=test_force_exit I, [2024-05-07T08:06:40.190886 #1604567] INFO -- : [ 21/885] 1645443=regexp_test I, [2024-05-07T08:06:40.283559 #1604567] INFO -- : [ 22/885] 1645443=test_remote_fetch_error I, [2024-05-07T08:06:40.405323 #1604567] INFO -- : [ 23/885] 1645443=test_show_source I, [2024-05-07T08:06:40.427104 #1604567] INFO -- : [ 24/885] 1645443=test_yield I, [2024-05-07T08:06:42.954219 #1604567] INFO -- : [ 25/885] 1645443=test_gem_resolver_api_specification I, [2024-05-07T08:06:43.167314 #1604567] INFO -- : [ 26/885] 1645443=test_rdoc_rubygems_hook I, [2024-05-07T08:06:43.283496 #1604567] INFO -- : [ 27/885] 1645443=test_ractor I, [2024-05-07T08:06:43.302705 #1604567] INFO -- : [ 28/885] 1645443=test_webauthn_listener I, [2024-05-07T08:06:43.379626 #1604567] INFO -- : [ 29/885] 1645443=test_gem_ext_cargo_builder_unit I, [2024-05-07T08:06:43.407919 #1604567] INFO -- : [ 30/885] 1645443=test_case_mapping I, [2024-05-07T08:06:43.424402 #1604567] INFO -- : [ 31/885] 1645443=test_rational I, [2024-05-07T08:06:43.440994 #1604567] INFO -- : [ 32/885] 1645443=test_thread I, [2024-05-07T08:06:43.448017 #1604567] INFO -- : [ 33/885] 1645443=test_arity I, [2024-05-07T08:06:43.466424 #1604567] INFO -- : [ 34/885] 1645443=test_pkey_ec I, [2024-05-07T08:06:43.473761 #1604567] INFO -- : Leaked file descriptor: TestRubyOptions#test_script_from_stdin: 10 # I, [2024-05-07T08:06:43.495464 #1604567] INFO -- : [ 35/885] 1645443=test_svcb_https I, [2024-05-07T08:06:43.496504 #1604567] INFO -- : COMMAND PID USER FD TYPE DEVICE SIZE/OFF NODE NAME I, [2024-05-07T08:06:43.496549 #1604567] INFO -- : ruby 1645441 opc 10r REG 252,0 6940392 13705429 /var/lib/sss/mc/group I, [2024-05-07T08:06:43.507078 #1604567] INFO -- : [ 36/885] 1645443=test_buffering I, [2024-05-07T08:06:43.512278 #1604567] INFO -- : [ 37/885] 1645443=test_key_event_record I, [2024-05-07T08:06:43.525847 #1604567] INFO -- : [ 38/885] 1645443=test_date_parse I, [2024-05-07T08:06:43.644251 #1604567] INFO -- : [ 39/885] 1645443=test_mdns I, [2024-05-07T08:06:43.722345 #1604567] INFO -- : [ 40/885] 1645443=test_open3 I, [2024-05-07T08:06:44.690131 #1604567] INFO -- : [ 41/885] 1645441=test_gbk I, [2024-05-07T08:06:44.698964 #1604567] INFO -- : [ 42/885] 1645441=test_backtrace I, [2024-05-07T08:06:44.720221 #1604567] INFO -- : [ 43/885] 1645441=test_gem_commands_dependency_command I, [2024-05-07T08:06:44.832344 #1604567] INFO -- : [ 44/885] 1645441=test_gem_spec_fetcher I, [2024-05-07T08:06:45.014793 #1604567] INFO -- : [ 45/885] 1645441=test_yamldbm I, [2024-05-07T08:06:45.113365 #1604567] INFO -- : [ 46/885] 1645441=test_default_gems I, [2024-05-07T08:06:45.125351 #1604567] INFO -- : [ 47/885] 1645441=test_switch_hitter I, [2024-05-07T08:06:45.142181 #1604567] INFO -- : [ 48/885] 1645441=test_unicode_escape I, [2024-05-07T08:06:45.246696 #1604567] INFO -- : [ 49/885] 1645441=test_grapheme_breaks I, [2024-05-07T08:06:45.257136 #1604567] INFO -- : [ 50/885] 1645441=test_hash_create I, [2024-05-07T08:06:45.271796 #1604567] INFO -- : [ 51/885] 1645441=test_set I, [2024-05-07T08:06:45.344642 #1604567] INFO -- : [ 52/885] 1645441=test_rdoc_method_attr I, [2024-05-07T08:06:45.597851 #1604567] INFO -- : [ 53/885] 1645441=test_enumerable I, [2024-05-07T08:06:45.629763 #1604567] INFO -- : [ 54/885] 1645441=static_literals_test I, [2024-05-07T08:06:45.677962 #1604567] INFO -- : [ 55/885] 1645441=test_tree_spell_checker I, [2024-05-07T08:06:45.694251 #1604567] INFO -- : [ 56/885] 1645441=test_method_name_check I, [2024-05-07T08:06:45.716980 #1604567] INFO -- : [ 57/885] 1645441=test_err_in_callback I, [2024-05-07T08:06:45.728834 #1604567] INFO -- : [ 58/885] 1645441=test_storage I, [2024-05-07T08:06:45.741362 #1604567] INFO -- : [ 59/885] 1645441=test_merge_keys I, [2024-05-07T08:06:45.769611 #1604567] INFO -- : [ 60/885] 1645441=test_shapes I, [2024-05-07T08:06:45.795615 #1604567] INFO -- : [ 61/885] 1645441=test_did_you_mean I, [2024-05-07T08:06:46.008848 #1604567] INFO -- : [ 62/885] 1645441=test_rdoc_extend I, [2024-05-07T08:06:46.028725 #1604567] INFO -- : [ 63/885] 1645441=test_cesu8 I, [2024-05-07T08:06:46.046945 #1604567] INFO -- : [ 64/885] 1645441=test_kernel I, [2024-05-07T08:06:46.142001 #1604567] INFO -- : [ 65/885] 1645442=test_rendering I, [2024-05-07T08:06:46.235924 #1604567] INFO -- : [ 66/885] 1645443=test_gem_rdoc I, [2024-05-07T08:06:46.237238 #1604567] INFO -- : [ 67/885] 1645442=test_dot_dot I, [2024-05-07T08:06:46.253872 #1604567] INFO -- : [ 68/885] 1645442=pattern_test I, [2024-05-07T08:06:46.368663 #1604567] INFO -- : [ 69/885] 1645442=test_string I, [2024-05-07T08:06:46.368870 #1604567] INFO -- : [ 70/885] 1645442=test_iterator I, [2024-05-07T08:06:46.414921 #1604567] INFO -- : [ 71/885] 1645443=test_gem_commands_install_command I, [2024-05-07T08:06:46.449238 #1604567] INFO -- : [ 72/885] 1645442=test_process I, [2024-05-07T08:06:46.488856 #1604567] INFO -- : [ 73/885] 1645442=test_forwardable I, [2024-05-07T08:06:46.506010 #1604567] INFO -- : [ 74/885] 1645442=test_fd_setsize I, [2024-05-07T08:06:46.511835 #1604567] INFO -- : [ 75/885] 1645442=!Nothing_to_test I, [2024-05-07T08:06:46.518379 #1604567] INFO -- : [ 76/885] 1645442=test_dir_m17n I, [2024-05-07T08:06:46.595410 #1604567] INFO -- : [ 77/885] 1645441=test_memory_view I, [2024-05-07T08:06:46.755062 #1604567] INFO -- : [ 78/885] 1645441=test_array_create I, [2024-05-07T08:06:46.756112 #1604567] INFO -- : [ 79/885] 1645441=test_complex I, [2024-05-07T08:06:46.870689 #1604567] INFO -- : [ 80/885] 1645441=test_threadgroup I, [2024-05-07T08:06:47.719757 #1604567] INFO -- : [ 81/885] 1645442=test_gem_command I, [2024-05-07T08:06:47.838421 #1604567] INFO -- : [ 82/885] 1645442=test_asn1 I, [2024-05-07T08:06:47.864025 #1604567] INFO -- : [ 83/885] 1645442=test_rdoc_generator_darkfish I, [2024-05-07T08:06:47.887044 #1604567] INFO -- : [ 84/885] 1645441=test_gem_resolver_lock_set I, [2024-05-07T08:06:47.904130 #1604567] INFO -- : [ 85/885] 1645441=test_random I, [2024-05-07T08:06:47.919432 #1604567] INFO -- : [ 86/885] 1645441=test_undef I, [2024-05-07T08:06:47.922346 #1604567] INFO -- : [ 87/885] 1645441=test_normalize I, [2024-05-07T08:06:47.926390 #1604567] INFO -- : [ 88/885] 1645441=test_emoji_breaks I, [2024-05-07T08:06:47.935981 #1604567] INFO -- : [ 89/885] 1645441=test_gem_commands_open_command I, [2024-05-07T08:06:48.052932 #1604567] INFO -- : [ 90/885] 1645441=test_verbose I, [2024-05-07T08:06:48.067079 #1604567] INFO -- : [ 91/885] 1645441=test_assignment I, [2024-05-07T08:06:48.067539 #1604567] INFO -- : [ 92/885] 1645443=test_gem_update_suggestion I, [2024-05-07T08:06:48.081656 #1604567] INFO -- : [ 93/885] 1645443=test_hash I, [2024-05-07T08:06:48.110719 #1604567] INFO -- : [ 94/885] 1645443=test_variable I, [2024-05-07T08:06:48.200097 #1604567] INFO -- : [ 95/885] 1645443=test_optarg I, [2024-05-07T08:06:48.249267 #1604567] INFO -- : [ 96/885] 1645442=test_gem_commands_pristine_command I, [2024-05-07T08:06:48.349784 #1604567] INFO -- : [ 97/885] 1645443=test_rdoc_tom_doc I, [2024-05-07T08:06:48.370707 #1604567] INFO -- : [ 98/885] 1645443=test_utf32 I, [2024-05-07T08:06:48.383375 #1604567] INFO -- : [ 99/885] 1645443=test_gem_resolver_git_specification I, [2024-05-07T08:06:48.709590 #1604567] INFO -- : [100/885] 1645443=test_basicinstructions I, [2024-05-07T08:06:48.798595 #1604567] INFO -- : [101/885] 1645443=test_date_ractor I, [2024-05-07T08:06:48.990543 #1604567] INFO -- : [102/885] 1645443=test_erb I, [2024-05-07T08:06:49.062669 #1604567] INFO -- : [103/885] 1645443=test_gem_security I, [2024-05-07T08:06:49.340928 #1604567] INFO -- : [104/885] 1645441=test_key_actor_emacs I, [2024-05-07T08:06:49.460239 #1604567] INFO -- : [105/885] 1645441=test_pp I, [2024-05-07T08:06:49.482267 #1604567] INFO -- : .Leaked file descriptor: PPTestModule::PPFileStatTest#test_nothing_raised: 8 # I, [2024-05-07T08:06:49.510307 #1604567] INFO -- : COMMAND PID USER FD TYPE DEVICE SIZE/OFF NODE NAME I, [2024-05-07T08:06:49.510373 #1604567] INFO -- : ruby 1645441 opc 8r REG 252,0 9253600 13705411 /var/lib/sss/mc/passwd I, [2024-05-07T08:06:49.549937 #1604567] INFO -- : [106/885] 1645441=test_gem_impossible_dependencies_error I, [2024-05-07T08:06:49.558598 #1604567] INFO -- : [107/885] 1645441=test_exception I, [2024-05-07T08:06:49.634304 #1604567] INFO -- : [108/885] 1645441=test_raise_exception I, [2024-05-07T08:06:49.739590 #1604567] INFO -- : [109/885] 1645442=test_arith_seq_beg_len_step I, [2024-05-07T08:06:49.749648 #1604567] INFO -- : [110/885] 1645442=test_noarg I, [2024-05-07T08:06:49.922368 #1604567] INFO -- : [111/885] 1645442=test_gem_resolver_requirement_list I, [2024-05-07T08:06:49.925860 #1604567] INFO -- : [112/885] 1645442=memsize_test I, [2024-05-07T08:06:49.930333 #1604567] INFO -- : [113/885] 1645442=test_windows_1252 I, [2024-05-07T08:06:50.011223 #1604567] INFO -- : [114/885] 1645442=test_stack I, [2024-05-07T08:06:50.126270 #1604567] INFO -- : [115/885] 1645441=test_sorted_set I, [2024-05-07T08:06:50.336017 #1604567] INFO -- : [116/885] 1645441=test_emoji I, [2024-05-07T08:06:50.364362 #1604567] INFO -- : [117/885] 1645441=test_gem_resolver_vendor_set I, [2024-05-07T08:06:50.386715 #1604567] INFO -- : [118/885] 1645441=test_condition I, [2024-05-07T08:06:50.391260 #1604567] INFO -- : [119/885] 1645441=test_cp949 I, [2024-05-07T08:06:50.394558 #1604567] INFO -- : [120/885] 1645441=test_jaro_winkler I, [2024-05-07T08:06:50.401459 #1604567] INFO -- : [121/885] 1645441=test_sleep I, [2024-05-07T08:06:50.747334 #1604567] INFO -- : [122/885] 1645442=test_mixed_unicode_escapes I, [2024-05-07T08:06:50.770809 #1604567] INFO -- : [123/885] 1645442=test_fileutils I, [2024-05-07T08:06:51.203748 #1604567] INFO -- : Leaked file descriptor: TestFileUtils#test_chown_error: 9 # I, [2024-05-07T08:06:51.229054 #1604567] INFO -- : COMMAND PID USER FD TYPE DEVICE SIZE/OFF NODE NAME I, [2024-05-07T08:06:51.229134 #1604567] INFO -- : ruby 1645442 opc 9r REG 252,0 9253600 13705411 /var/lib/sss/mc/passwd I, [2024-05-07T08:06:51.274897 #1604567] INFO -- : [124/885] 1645442=test_gem_dependency_resolution_error I, [2024-05-07T08:06:51.284913 #1604567] INFO -- : [125/885] 1645442=test_econv I, [2024-05-07T08:06:52.116886 #1604567] INFO -- : [126/885] 1645442=test_gem_install_update_options I, [2024-05-07T08:06:52.443787 #1604567] INFO -- : [127/885] 1645442=test_sizeof I, [2024-05-07T08:06:52.452232 #1604567] INFO -- : [128/885] 1645441=test_date_attr I, [2024-05-07T08:06:52.468595 #1604567] INFO -- : [129/885] 1645441=test_gem_request_set_lockfile_parser I, [2024-05-07T08:06:52.595990 #1604567] INFO -- : [130/885] 1645441=test_face I, [2024-05-07T08:06:52.614583 #1604567] INFO -- : [131/885] 1645441=warnings_test I, [2024-05-07T08:06:52.683807 #1604567] INFO -- : [132/885] 1645441=test_stringchar I, [2024-05-07T08:06:52.698664 #1604567] INFO -- : [133/885] 1645441=test_pkey_rsa I, [2024-05-07T08:06:52.969212 #1604567] INFO -- : [134/885] 1645441=test_flush I, [2024-05-07T08:06:52.974578 #1604567] INFO -- : [135/885] 1645441=test_numhash I, [2024-05-07T08:06:52.981741 #1604567] INFO -- : [136/885] 1645441=test_system I, [2024-05-07T08:06:53.846719 #1604567] INFO -- : [137/885] 1645441=test_gem_specification I, [2024-05-07T08:06:54.645522 #1604567] INFO -- : [138/885] 1645442=test_rdoc_cross_reference I, [2024-05-07T08:06:55.072285 #1604567] INFO -- : [139/885] 1645442=test_parse I, [2024-05-07T08:06:55.561892 #1604567] INFO -- : [140/885] 1645442=test_rdoc_class_module I, [2024-05-07T08:06:56.111477 #1604567] INFO -- : [141/885] 1645441=test_method_cache I, [2024-05-07T08:06:56.114871 #1604567] INFO -- : [142/885] 1645441=test_win32ole_variable I, [2024-05-07T08:06:56.116126 #1604567] INFO -- : [143/885] 1645442=test_rdoc_context I, [2024-05-07T08:06:56.132379 #1604567] INFO -- : [144/885] 1645441=test_gem_command_manager I, [2024-05-07T08:06:56.320844 #1604567] INFO -- : [145/885] 1645441=test_array I, [2024-05-07T08:06:56.329828 #1604567] INFO -- : [146/885] 1645441=test_open-uri I, [2024-05-07T08:06:56.755133 #1604567] INFO -- : [147/885] 1645443=test_case I, [2024-05-07T08:06:56.773615 #1604567] INFO -- : [148/885] 1645443=test_enumerator I, [2024-05-07T08:06:56.813434 #1604567] INFO -- : [149/885] 1645441=test_enc_associate I, [2024-05-07T08:06:56.869852 #1604567] INFO -- : [150/885] 1645442=test_sprintf I, [2024-05-07T08:06:57.075448 #1604567] INFO -- : [151/885] 1645442=test_recorder I, [2024-05-07T08:06:57.092399 #1604567] INFO -- : [152/885] 1645442=test_yaml_special_cases I, [2024-05-07T08:06:57.118532 #1604567] INFO -- : [153/885] 1645442=test_gem_commands_sources_command I, [2024-05-07T08:06:57.277506 #1604567] INFO -- : [154/885] 1645441=test_name_error I, [2024-05-07T08:06:57.336480 #1604567] INFO -- : [155/885] 1645442=json_addition_test I, [2024-05-07T08:06:57.347200 #1604567] INFO -- : [156/885] 1645442=test_gem_source_list I, [2024-05-07T08:06:57.359834 #1604567] INFO -- : [157/885] 1645441=index_write_test I, [2024-05-07T08:06:57.370076 #1604567] INFO -- : [158/885] 1645441=test_rdoc_parser_rd I, [2024-05-07T08:06:57.392803 #1604567] INFO -- : [159/885] 1645441=test_const I, [2024-05-07T08:06:57.397574 #1604567] INFO -- : [160/885] 1645441=test_exit I, [2024-05-07T08:06:57.422697 #1604567] INFO -- : [161/885] 1645442=test_class I, [2024-05-07T08:06:57.477586 #1604567] INFO -- : [162/885] 1645441=test_gc I, [2024-05-07T08:06:57.484195 #1604567] INFO -- : [163/885] 1645441=test_qsort I, [2024-05-07T08:06:57.489956 #1604567] INFO -- : [164/885] 1645441=comments_test I, [2024-05-07T08:06:57.499967 #1604567] INFO -- : [165/885] 1645441=test_math I, [2024-05-07T08:06:57.512663 #1604567] INFO -- : [166/885] 1645441=test_iso_8859 I, [2024-05-07T08:06:57.572540 #1604567] INFO -- : [167/885] 1645441=ripper_test I, [2024-05-07T08:06:58.125703 #1604567] INFO -- : [168/885] 1645441=test_libs I, [2024-05-07T08:06:58.138248 #1604567] INFO -- : [169/885] 1645441=test_safe_load I, [2024-05-07T08:06:58.177969 #1604567] INFO -- : [170/885] 1645441=test_pack I, [2024-05-07T08:06:58.189904 #1604567] INFO -- : [171/885] 1645441=test_cgi_tag_helper I, [2024-05-07T08:06:58.227600 #1604567] INFO -- : [172/885] 1645441=test_pinned I, [2024-05-07T08:06:58.264398 #1604567] INFO -- : [173/885] 1645441=test_framework I, [2024-05-07T08:06:58.276923 #1604567] INFO -- : [174/885] 1645441=test_inadvertent_creation I, [2024-05-07T08:06:58.368133 #1604567] INFO -- : [175/885] 1645441=test_ansi_with_terminfo I, [2024-05-07T08:06:58.409393 #1604567] INFO -- : [176/885] 1645441=test_weakmap I, [2024-05-07T08:07:01.669887 #1604567] INFO -- : [177/885] 1645442=test_coderange I, [2024-05-07T08:07:01.675035 #1604567] INFO -- : [178/885] 1645442=test_nil2vtempty I, [2024-05-07T08:07:01.683939 #1604567] INFO -- : [179/885] 1645442=test_date_time I, [2024-05-07T08:07:01.701398 #1604567] INFO -- : [180/885] 1645442=test_rdoc_generator_json_index I, [2024-05-07T08:07:01.783902 #1604567] INFO -- : [181/885] 1645442=test_too_many_dummy_encodings I, [2024-05-07T08:07:01.788859 #1604567] INFO -- : [182/885] 1645442=test_method_cache I, [2024-05-07T08:07:01.802445 #1604567] INFO -- : [183/885] 1645442=test_sprintf_comb I, [2024-05-07T08:07:02.007841 #1604567] INFO -- : [184/885] 1645442=test_gem_commands_push_command I, [2024-05-07T08:07:02.634485 #1604567] INFO -- : [185/885] 1645442=locals_test I, [2024-05-07T08:07:03.066007 #1604567] INFO -- : [186/885] 1645442=test_rdoc_task I, [2024-05-07T08:07:03.088957 #1604567] INFO -- : [187/885] 1645442=test_backtrace I, [2024-05-07T08:07:04.439271 #1604567] INFO -- : [188/885] 1645442=test_tracepoint I, [2024-05-07T08:07:04.469840 #1604567] INFO -- : [189/885] 1645441=test_settracefunc I, [2024-05-07T08:07:04.697063 #1604567] INFO -- : [190/885] 1645442=test_gem_text I, [2024-05-07T08:07:04.759354 #1604567] INFO -- : [191/885] 1645442=test_rendering I, [2024-05-07T08:07:04.771140 #1604567] INFO -- : [192/885] 1645442=desugar_compiler_test I, [2024-05-07T08:07:04.776380 #1604567] INFO -- : [193/885] 1645442=test_gem_source_local I, [2024-05-07T08:07:05.024922 #1604567] INFO -- : [194/885] 1645442=test_win32ole I, [2024-05-07T08:07:05.036547 #1604567] INFO -- : [195/885] 1645442=test_internal_ivar I, [2024-05-07T08:07:05.053898 #1604567] INFO -- : [196/885] 1645442=test_gem_gemcutter_utilities I, [2024-05-07T08:07:05.349828 #1604567] INFO -- : [197/885] 1645441=test_http I, [2024-05-07T08:07:05.363512 #1604567] INFO -- : [198/885] 1645441=test_hash I, [2024-05-07T08:07:05.541950 #1604567] INFO -- : [199/885] 1645442=parser_test I, [2024-05-07T08:07:05.552351 #1604567] INFO -- : [200/885] 1645442=test_pty I, [2024-05-07T08:07:06.070354 #1604567] INFO -- : [201/885] 1645442=test_gem_dependency_installer I, [2024-05-07T08:07:08.635901 #1604567] INFO -- : [202/885] 1645442=test_gem_request I, [2024-05-07T08:07:08.920890 #1604567] INFO -- : [203/885] 1645442=test_gem_commands_which_command I, [2024-05-07T08:07:08.962884 #1604567] INFO -- : [204/885] 1645442=test_gem_package_old I, [2024-05-07T08:07:09.026894 #1604567] INFO -- : [205/885] 1645442=encoding_test I, [2024-05-07T08:07:09.104696 #1604567] INFO -- : [206/885] 1645442=test_scan_args I, [2024-05-07T08:07:09.122229 #1604567] INFO -- : [207/885] 1645442=test_gem_commands_specification_command I, [2024-05-07T08:07:09.271396 #1604567] INFO -- : [208/885] 1645442=test_yjit I, [2024-05-07T08:07:09.280655 #1604567] INFO -- : [209/885] 1645442=test_cclass I, [2024-05-07T08:07:09.371381 #1604567] INFO -- : [210/885] 1645442=test_gem_uninstaller I, [2024-05-07T08:07:09.473457 #1604567] INFO -- : [211/885] 1645441=test_gem_dependency I, [2024-05-07T08:07:09.682775 #1604567] INFO -- : [212/885] 1645441=test_m17n I, [2024-05-07T08:07:09.751129 #1604567] INFO -- : [213/885] 1645441=test_method I, [2024-05-07T08:07:10.105935 #1604567] INFO -- : [214/885] 1645443=test_argf I, [2024-05-07T08:07:10.626845 #1604567] INFO -- : [215/885] 1645442=test_x509name I, [2024-05-07T08:07:10.643551 #1604567] INFO -- : [216/885] 1645442=test_yaml I, [2024-05-07T08:07:10.782746 #1604567] INFO -- : [217/885] 1645442=test_pkcs12 I, [2024-05-07T08:07:11.474189 #1604567] INFO -- : [218/885] 1645442=test_gem_remote_fetcher I, [2024-05-07T08:07:13.470926 #1604567] INFO -- : [219/885] 1645442=test_json_tree I, [2024-05-07T08:07:13.480108 #1604567] INFO -- : [220/885] 1645442=test_koi8 I, [2024-05-07T08:07:13.491679 #1604567] INFO -- : [221/885] 1645442=test_filter I, [2024-05-07T08:07:13.527730 #1604567] INFO -- : [222/885] 1645442=test_parser_events I, [2024-05-07T08:07:13.599285 #1604567] INFO -- : [223/885] 1645442=test_set I, [2024-05-07T08:07:13.612777 #1604567] INFO -- : [224/885] 1645442=test_utf16 I, [2024-05-07T08:07:13.666281 #1604567] INFO -- : [225/885] 1645442=test_http I, [2024-05-07T08:07:13.733718 #1604567] INFO -- : [226/885] 1645443=attribute_write_test I, [2024-05-07T08:07:13.741449 #1604567] INFO -- : [227/885] 1645443=test_severity I, [2024-05-07T08:07:13.757721 #1604567] INFO -- : [228/885] 1645443=test_ractor I, [2024-05-07T08:07:13.758187 #1604567] INFO -- : [229/885] 1645443=test_case I, [2024-05-07T08:07:13.772635 #1604567] INFO -- : [230/885] 1645443=test_gem_package_tar_writer I, [2024-05-07T08:07:13.924574 #1604567] INFO -- : [231/885] 1645443=test_str2big I, [2024-05-07T08:07:13.931848 #1604567] INFO -- : [232/885] 1645443=test_rdoc_markup_to_rdoc I, [2024-05-07T08:07:13.977315 #1604567] INFO -- : [233/885] 1645443=test_nil I, [2024-05-07T08:07:13.984097 #1604567] INFO -- : [234/885] 1645443=test_psych I, [2024-05-07T08:07:14.016899 #1604567] INFO -- : [235/885] 1645443=test_import I, [2024-05-07T08:07:15.287977 #1604567] INFO -- : [236/885] 1645443=test_human_typo I, [2024-05-07T08:07:15.348624 #1604567] INFO -- : [237/885] 1645443=test_wait I, [2024-05-07T08:07:15.358392 #1604567] INFO -- : [238/885] 1645443=test_gem_resolver_specification I, [2024-05-07T08:07:15.383761 #1604567] INFO -- : [239/885] 1645443=test_big2str I, [2024-05-07T08:07:15.398397 #1604567] INFO -- : [240/885] 1645443=test_logger I, [2024-05-07T08:07:15.415006 #1604567] INFO -- : [241/885] 1645443=test_pkey_dsa I, [2024-05-07T08:07:17.029455 #1604567] INFO -- : [242/885] 1645441=test_yaml_tree I, [2024-05-07T08:07:17.156186 #1604567] INFO -- : [243/885] 1645441=test_gem_commands_yank_command I, [2024-05-07T08:07:17.684484 #1604567] INFO -- : [244/885] 1645441=test_command I, [2024-05-07T08:07:17.915844 #1604567] INFO -- : [245/885] 1645441=test_euc_tw I, [2024-05-07T08:07:17.924224 #1604567] INFO -- : [246/885] 1645441=test_gem_resolver_dependency_request I, [2024-05-07T08:07:17.997573 #1604567] INFO -- : [247/885] 1645441=test_cstr I, [2024-05-07T08:07:18.687829 #1604567] INFO -- : [248/885] 1645443=test_yjit_exit_locations I, [2024-05-07T08:07:18.694690 #1604567] INFO -- : [249/885] 1645443=test_rdoc_rdoc I, [2024-05-07T08:07:18.786873 #1604567] INFO -- : [250/885] 1645443=test_rdoc_normal_module I, [2024-05-07T08:07:18.818979 #1604567] INFO -- : [251/885] 1645443=test_type_completor I, [2024-05-07T08:07:18.824734 #1604567] INFO -- : [252/885] 1645443=test_io_timeout I, [2024-05-07T08:07:18.837669 #1604567] INFO -- : [253/885] 1645443=test_rdoc_markdown_test I, [2024-05-07T08:07:19.482635 #1604567] INFO -- : [254/885] 1645441=test_gem_config_file I, [2024-05-07T08:07:19.690480 #1604567] INFO -- : [255/885] 1645441=json_string_matching_test I, [2024-05-07T08:07:19.703137 #1604567] INFO -- : [256/885] 1645441=test_comparable I, [2024-05-07T08:07:19.713185 #1604567] INFO -- : [257/885] 1645441=test_kdf I, [2024-05-07T08:07:19.775688 #1604567] INFO -- : [258/885] 1645441=test_ldap I, [2024-05-07T08:07:19.783027 #1604567] INFO -- : [259/885] 1645441=test_passing_block I, [2024-05-07T08:07:19.793889 #1604567] INFO -- : [260/885] 1645441=test_defined I, [2024-05-07T08:07:19.826916 #1604567] INFO -- : [261/885] 1645443=test_nowrite I, [2024-05-07T08:07:19.849000 #1604567] INFO -- : [262/885] 1645443=test_thread_queue I, [2024-05-07T08:07:19.860922 #1604567] INFO -- : [263/885] 1645441=test_io_buffer I, [2024-05-07T08:07:19.932608 #1604567] INFO -- : [264/885] 1645441=test_pathname I, [2024-05-07T08:07:20.137420 #1604567] INFO -- : [265/885] 1645441=test_fnmatch I, [2024-05-07T08:07:20.188182 #1604567] INFO -- : [266/885] 1645441=test_coverage I, [2024-05-07T08:07:20.772900 #1604567] INFO -- : [267/885] 1645441=test_tempfile I, [2024-05-07T08:07:20.989727 #1604567] INFO -- : [268/885] 1645441=test_http_request I, [2024-05-07T08:07:21.002040 #1604567] INFO -- : [269/885] 1645441=test_store I, [2024-05-07T08:07:21.250838 #1604567] INFO -- : [270/885] 1645441=test_rdoc_markup_pre_process I, [2024-05-07T08:07:21.341996 #1604567] INFO -- : [271/885] 1645441=test_tree_builder I, [2024-05-07T08:07:21.347454 #1604567] INFO -- : [272/885] 1645441=test_date I, [2024-05-07T08:07:21.352939 #1604567] INFO -- : [273/885] 1645441=test_big5 I, [2024-05-07T08:07:21.387611 #1604567] INFO -- : [274/885] 1645441=test_gem_commands_update_command I, [2024-05-07T08:07:22.327948 #1604567] INFO -- : [275/885] 1645442=test_protect I, [2024-05-07T08:07:22.335575 #1604567] INFO -- : [276/885] 1645442=test_date_conv I, [2024-05-07T08:07:22.339735 #1604567] INFO -- : [277/885] 1645442=test_rdoc_markup_verbatim I, [2024-05-07T08:07:22.350325 #1604567] INFO -- : [278/885] 1645442=test_webauthn_poller I, [2024-05-07T08:07:22.508956 #1604567] INFO -- : [279/885] 1645442=test_egrep_cpp I, [2024-05-07T08:07:22.595724 #1604567] INFO -- : [280/885] 1645442=test_frozen I, [2024-05-07T08:07:22.600580 #1604567] INFO -- : [281/885] 1645442=test_serialize_subclasses I, [2024-05-07T08:07:22.605463 #1604567] INFO -- : [282/885] 1645442=test_gem_resolver_index_specification I, [2024-05-07T08:07:22.664587 #1604567] INFO -- : [283/885] 1645442=test_rdoc_generator_pot_po_entry I, [2024-05-07T08:07:22.681287 #1604567] INFO -- : [284/885] 1645442=test_erb_m17n I, [2024-05-07T08:07:22.688989 #1604567] INFO -- : [285/885] 1645442=test_timeout I, [2024-05-07T08:07:22.694191 #1604567] INFO -- : [286/885] 1645442=test_enumerator_kw I, [2024-05-07T08:07:22.703094 #1604567] INFO -- : [287/885] 1645442=test_line_editor I, [2024-05-07T08:07:22.709962 #1604567] INFO -- : [288/885] 1645442=test_marshalable I, [2024-05-07T08:07:22.716631 #1604567] INFO -- : [289/885] 1645442=reflection_test I, [2024-05-07T08:07:22.718510 #1604567] INFO -- : [290/885] 1645442=test_files_lib I, [2024-05-07T08:07:22.729021 #1604567] INFO -- : [291/885] 1645442=test_help I, [2024-05-07T08:07:22.751452 #1604567] INFO -- : [292/885] 1645442=test_string_memory I, [2024-05-07T08:07:22.812433 #1604567] INFO -- : [293/885] 1645441=test_raise I, [2024-05-07T08:07:22.817505 #1604567] INFO -- : [294/885] 1645441=test_complexrational I, [2024-05-07T08:07:22.824017 #1604567] INFO -- : [295/885] 1645441=version_test I, [2024-05-07T08:07:22.836729 #1604567] INFO -- : [296/885] 1645441=json_common_interface_test I, [2024-05-07T08:07:22.844862 #1604567] INFO -- : [297/885] 1645441=test_string I, [2024-05-07T08:07:22.855148 #1604567] INFO -- : [298/885] 1645441=test_function_entry I, [2024-05-07T08:07:22.860656 #1604567] INFO -- : [299/885] 1645441=test_error_highlight I, [2024-05-07T08:07:22.872125 #1604567] INFO -- : [300/885] 1645442=test_rdoc_any_method I, [2024-05-07T08:07:23.246705 #1604567] INFO -- : [301/885] 1645442=test_file I, [2024-05-07T08:07:23.254449 #1604567] INFO -- : [302/885] 1645442=test_time I, [2024-05-07T08:07:23.366706 #1604567] INFO -- : [303/885] 1645442=test_gem_commands_owner_command I, [2024-05-07T08:07:23.438560 #1604567] INFO -- : [304/885] 1645441=test_nextafter I, [2024-05-07T08:07:23.537070 #1604567] INFO -- : [305/885] 1645441=test_capacity I, [2024-05-07T08:07:23.548010 #1604567] INFO -- : [306/885] 1645441=test_gem_request_connection_pools I, [2024-05-07T08:07:24.014339 #1604567] INFO -- : [307/885] 1645442=test_init I, [2024-05-07T08:07:24.285810 #1604567] INFO -- : [308/885] 1645442=test_rat I, [2024-05-07T08:07:24.294365 #1604567] INFO -- : [309/885] 1645442=test_numeric I, [2024-05-07T08:07:24.346844 #1604567] INFO -- : [310/885] 1645443=test_bug-3571 I, [2024-05-07T08:07:24.350896 #1604567] INFO -- : [311/885] 1645442=test_yamlstore I, [2024-05-07T08:07:24.357843 #1604567] INFO -- : [312/885] 1645443=test_flags I, [2024-05-07T08:07:24.373640 #1604567] INFO -- : [313/885] 1645442=test_rdoc_generator_markup I, [2024-05-07T08:07:24.388587 #1604567] INFO -- : [314/885] 1645442=test_find I, [2024-05-07T08:07:24.559588 #1604567] INFO -- : [315/885] 1645442=test_constant I, [2024-05-07T08:07:24.648475 #1604567] INFO -- : [316/885] 1645441=test_encoding I, [2024-05-07T08:07:24.779122 #1604567] INFO -- : [317/885] 1645441=test_hmac I, [2024-05-07T08:07:24.789963 #1604567] INFO -- : [318/885] 1645441=test_gem_commands_server_command I, [2024-05-07T08:07:24.801340 #1604567] INFO -- : [319/885] 1645441=test_gem_resolver_activation_request I, [2024-05-07T08:07:24.821599 #1604567] INFO -- : [320/885] 1645441=test_function I, [2024-05-07T08:07:24.944596 #1604567] INFO -- : [321/885] 1645443=test_pipe I, [2024-05-07T08:07:25.052847 #1604567] INFO -- : [322/885] 1645441=test_string I, [2024-05-07T08:07:25.059324 #1604567] INFO -- : [323/885] 1645443=test_macro I, [2024-05-07T08:07:25.068760 #1604567] INFO -- : [324/885] 1645443=test_gem_requirement I, [2024-05-07T08:07:25.233222 #1604567] INFO -- : [325/885] 1645443=parse_comments_test I, [2024-05-07T08:07:25.239245 #1604567] INFO -- : [326/885] 1645443=test_win32ole_method_event I, [2024-05-07T08:07:25.247373 #1604567] INFO -- : [327/885] 1645443=test_tcp I, [2024-05-07T08:07:25.418057 #1604567] INFO -- : [328/885] 1645443=test_integer I, [2024-05-07T08:07:25.433074 #1604567] INFO -- : [329/885] 1645443=test_gem_name_tuple I, [2024-05-07T08:07:25.455552 #1604567] INFO -- : [330/885] 1645443=test_rdoc_markup_to_table_of_contents I, [2024-05-07T08:07:25.489540 #1604567] INFO -- : [331/885] 1645443=test_reqarg I, [2024-05-07T08:07:25.800916 #1604567] INFO -- : [332/885] 1645443=test_gem_version I, [2024-05-07T08:07:25.917822 #1604567] INFO -- : [333/885] 1645443=test_spell_checker I, [2024-05-07T08:07:25.928105 #1604567] INFO -- : [334/885] 1645443=test_gem_ext_ext_conf_builder I, [2024-05-07T08:07:26.227722 #1604567] INFO -- : [335/885] 1645442=test_frozen_error I, [2024-05-07T08:07:26.232270 #1604567] INFO -- : [336/885] 1645442=test_path_to_class I, [2024-05-07T08:07:26.236644 #1604567] INFO -- : [337/885] 1645442=test_enumerator I, [2024-05-07T08:07:26.241147 #1604567] INFO -- : [338/885] 1645442=test_yield_block I, [2024-05-07T08:07:26.248201 #1604567] INFO -- : [339/885] 1645442=test_bug-5832 I, [2024-05-07T08:07:26.294405 #1604567] INFO -- : [340/885] 1645442=test_c_struct_builder I, [2024-05-07T08:07:26.485406 #1604567] INFO -- : [341/885] 1645442=test_resource I, [2024-05-07T08:07:26.503603 #1604567] INFO -- : [342/885] 1645442=test_gem_package_tar_reader_entry I, [2024-05-07T08:07:26.764707 #1604567] INFO -- : [343/885] 1645442=test_gem_uri I, [2024-05-07T08:07:26.800809 #1604567] INFO -- : [344/885] 1645442=test_gem_version_option I, [2024-05-07T08:07:26.857829 #1604567] INFO -- : [345/885] 1645442=test_win32ole_record I, [2024-05-07T08:07:26.873785 #1604567] INFO -- : [346/885] 1645442=test_rdoc_include I, [2024-05-07T08:07:26.896930 #1604567] INFO -- : [347/885] 1645442=test_date_compat I, [2024-05-07T08:07:26.908667 #1604567] INFO -- : [348/885] 1645442=test_pstore I, [2024-05-07T08:07:27.047857 #1604567] INFO -- : [349/885] 1645443=test_ubf_async_safe I, [2024-05-07T08:07:27.063910 #1604567] INFO -- : [350/885] 1645443=test_rdoc_options I, [2024-05-07T08:07:27.127502 #1604567] INFO -- : [351/885] 1645442=test_zlib I, [2024-05-07T08:07:27.301142 #1604567] INFO -- : [352/885] 1645443=test_console_attr I, [2024-05-07T08:07:27.324920 #1604567] INFO -- : [353/885] 1645443=test_proc I, [2024-05-07T08:07:28.211134 #1604567] INFO -- : [354/885] 1645443=test_gem_ext_cargo_builder I, [2024-05-07T08:07:28.233905 #1604567] INFO -- : [355/885] 1645443=test_gem_commands_unpack_command I, [2024-05-07T08:07:28.656983 #1604567] INFO -- : [356/885] 1645443=test_postponed_job I, [2024-05-07T08:07:28.939146 #1604567] INFO -- : [357/885] 1645443=test_key_actor_vi I, [2024-05-07T08:07:29.039294 #1604567] INFO -- : [358/885] 1645443=test_rdoc_markdown I, [2024-05-07T08:07:29.368762 #1604567] INFO -- : [359/885] 1645443=test_gem_request_set_lockfile I, [2024-05-07T08:07:29.827762 #1604567] INFO -- : [360/885] 1645443=test_rdoc_encoding I, [2024-05-07T08:07:29.861433 #1604567] INFO -- : [361/885] 1645443=test_win32ole_variant_outarg I, [2024-05-07T08:07:29.889227 #1604567] INFO -- : [362/885] 1645443=test_generic I, [2024-05-07T08:07:29.923447 #1604567] INFO -- : [363/885] 1645443=test_rdoc_markup_to_html_snippet I, [2024-05-07T08:07:30.041494 #1604567] INFO -- : [364/885] 1645443=test_common I, [2024-05-07T08:07:30.228381 #1604567] INFO -- : [365/885] 1645443=test_httpresponses I, [2024-05-07T08:07:30.245074 #1604567] INFO -- : [366/885] 1645443=test_rdoc_constant I, [2024-05-07T08:07:30.355376 #1604567] INFO -- : [367/885] 1645443=test_deprecate I, [2024-05-07T08:07:30.408842 #1604567] INFO -- : [368/885] 1645443=test_rdoc_text I, [2024-05-07T08:07:30.442738 #1604567] INFO -- : [369/885] 1645443=library_symbols_test I, [2024-05-07T08:07:30.446181 #1604567] INFO -- : [370/885] 1645443=test_require I, [2024-05-07T08:07:30.456497 #1604567] INFO -- : [371/885] 1645443=test_stringify_symbols I, [2024-05-07T08:07:30.619424 #1604567] INFO -- : [372/885] 1645443=test_objspace I, [2024-05-07T08:07:34.236663 #1604567] INFO -- : [373/885] 1645442=test_have_library I, [2024-05-07T08:07:34.887125 #1604567] INFO -- : [374/885] 1645442=test_stream I, [2024-05-07T08:07:34.893700 #1604567] INFO -- : [375/885] 1645442=test_ns_spki I, [2024-05-07T08:07:34.902574 #1604567] INFO -- : [376/885] 1645442=test_iseq_load I, [2024-05-07T08:07:36.064245 #1604567] INFO -- : [377/885] 1645442=test_rdoc_markup_parser I, [2024-05-07T08:07:36.138504 #1604567] INFO -- : [378/885] 1645442=test_rdoc_markup_indented_paragraph I, [2024-05-07T08:07:36.148789 #1604567] INFO -- : [379/885] 1645442=test_pack I, [2024-05-07T08:07:36.508033 #1604567] INFO -- : [380/885] 1645442=test_io_wait I, [2024-05-07T08:07:36.743911 #1604567] INFO -- : [381/885] 1645442=test_kwargs I, [2024-05-07T08:07:36.757504 #1604567] INFO -- : [382/885] 1645442=test_rdoc_parser_c I, [2024-05-07T08:07:37.062545 #1604567] INFO -- : [383/885] 1645442=parse_test I, [2024-05-07T08:07:40.337690 #1604567] INFO -- : [384/885] 1645442=json_fixtures_test I, [2024-05-07T08:07:40.348714 #1604567] INFO -- : [385/885] 1645442=test_gem_doctor I, [2024-05-07T08:07:40.414888 #1604567] INFO -- : [386/885] 1645442=test_len I, [2024-05-07T08:07:40.426402 #1604567] INFO -- : [387/885] 1645442=test_gem_dependency_list I, [2024-05-07T08:07:40.528510 #1604567] INFO -- : [388/885] 1645442=test_gem_commands_outdated_command I, [2024-05-07T08:07:40.594002 #1604567] INFO -- : [389/885] 1645442=test_rdoc_parser_changelog I, [2024-05-07T08:07:40.664272 #1604567] INFO -- : [390/885] 1645442=parameters_signature_test I, [2024-05-07T08:07:40.675084 #1604567] INFO -- : [391/885] 1645442=test_typeddata I, [2024-05-07T08:07:40.922511 #1604567] INFO -- : [392/885] 1645442=test_gem_commands_fetch_command I, [2024-05-07T08:07:41.108789 #1604567] INFO -- : [393/885] 1645442=test_tsort I, [2024-05-07T08:07:41.120169 #1604567] INFO -- : [394/885] 1645442=test_securerandom I, [2024-05-07T08:07:41.148475 #1604567] INFO -- : [395/885] 1645442=test_rdoc_markup_attributes I, [2024-05-07T08:07:41.157062 #1604567] INFO -- : [396/885] 1645442=redundant_return_test I, [2024-05-07T08:07:41.164036 #1604567] INFO -- : [397/885] 1645442=test_string_processing I, [2024-05-07T08:07:41.164568 #1604567] INFO -- : [398/885] 1645442=test_random_formatter I, [2024-05-07T08:07:41.220771 #1604567] INFO -- : [399/885] 1645442=test_rand I, [2024-05-07T08:07:41.567271 #1604567] INFO -- : [400/885] 1645442=test_gem_source_specific_file I, [2024-05-07T08:07:41.645871 #1604567] INFO -- : [401/885] 1645442=test_provider I, [2024-05-07T08:07:41.656643 #1604567] INFO -- : [402/885] 1645442=test_euc_kr I, [2024-05-07T08:07:41.666238 #1604567] INFO -- : [403/885] 1645442=test_bmethod I, [2024-05-07T08:07:41.681876 #1604567] INFO -- : [404/885] 1645442=test_rdoc_code_object I, [2024-05-07T08:07:42.163123 #1604567] INFO -- : [405/885] 1645442=test_process I, [2024-05-07T08:07:54.695832 #1604567] INFO -- : [406/885] 1645441=test_pkey_dh I, [2024-05-07T08:07:56.012695 #1604567] INFO -- : [407/885] 1645441=test_multi_irb_commands I, [2024-05-07T08:07:56.052835 #1604567] INFO -- : [408/885] 1645441=test_m17n_comb I, [2024-05-07T08:07:58.893146 #1604567] INFO -- : [409/885] 1645441=test_null I, [2024-05-07T08:07:58.902051 #1604567] INFO -- : [410/885] 1645441=test_ractor I, [2024-05-07T08:07:58.962026 #1604567] INFO -- : [411/885] 1645441=test_memory_view I, [2024-05-07T08:07:58.990754 #1604567] INFO -- : [412/885] 1645441=test_data I, [2024-05-07T08:07:59.000920 #1604567] INFO -- : [413/885] 1645441=test_bigzero I, [2024-05-07T08:07:59.012372 #1604567] INFO -- : [414/885] 1645441=test_gem_platform I, [2024-05-07T08:07:59.151575 #1604567] INFO -- : [415/885] 1645441=test_gem_commands_query_command I, [2024-05-07T08:07:59.509757 #1604567] INFO -- : [416/885] 1645443=test_win32ole_typelib I, [2024-05-07T08:07:59.522937 #1604567] INFO -- : [417/885] 1645443=test_external_new I, [2024-05-07T08:07:59.529816 #1604567] INFO -- : [418/885] 1645443=test_pkey I, [2024-05-07T08:07:59.537577 #1604567] INFO -- : [419/885] 1645443=test_thread I, [2024-05-07T08:07:59.772670 #1604567] INFO -- : [420/885] 1645443=test_gem_util I, [2024-05-07T08:07:59.813302 #1604567] INFO -- : [421/885] 1645441=test_config I, [2024-05-07T08:07:59.860896 #1604567] INFO -- : [422/885] 1645441=test_complex2 I, [2024-05-07T08:07:59.885450 #1604567] INFO -- : [423/885] 1645441=test_gem_security_signer I, [2024-05-07T08:07:59.936182 #1604567] INFO -- : [424/885] 1645443=test_literal I, [2024-05-07T08:08:00.002919 #1604567] INFO -- : [425/885] 1645441=test_gem_unsatisfiable_dependency_error I, [2024-05-07T08:08:00.024060 #1604567] INFO -- : [426/885] 1645441=test_io I, [2024-05-07T08:08:00.221563 #1604567] INFO -- : [427/885] 1645441=test_rdoc_i18n_text I, [2024-05-07T08:08:00.227501 #1604567] INFO -- : [428/885] 1645441=test_input_method I, [2024-05-07T08:08:00.266007 #1604567] INFO -- : [429/885] 1645442=test_bash_completion I, [2024-05-07T08:08:00.280654 #1604567] INFO -- : [430/885] 1645441=test_exception I, [2024-05-07T08:08:00.286096 #1604567] INFO -- : [431/885] 1645442=test_files_test_2 I, [2024-05-07T08:08:00.290763 #1604567] INFO -- : [432/885] 1645442=test_div I, [2024-05-07T08:08:00.305155 #1604567] INFO -- : [433/885] 1645442=test_rdoc_markup_to_html_crossref I, [2024-05-07T08:08:00.489511 #1604567] INFO -- : [434/885] 1645443=test_deprecated I, [2024-05-07T08:08:00.507951 #1604567] INFO -- : [435/885] 1645443=test_rdoc_context_section I, [2024-05-07T08:08:00.518963 #1604567] INFO -- : [436/885] 1645443=test_io_buffer I, [2024-05-07T08:08:00.589201 #1604567] INFO -- : [437/885] 1645442=test_optparse I, [2024-05-07T08:08:00.593497 #1604567] INFO -- : [438/885] 1645442=test_gem_commands_environment_command I, [2024-05-07T08:08:00.637766 #1604567] INFO -- : [439/885] 1645443=test_pkcs7 I, [2024-05-07T08:08:00.658304 #1604567] INFO -- : [440/885] 1645442=test_pack I, [2024-05-07T08:08:00.800083 #1604567] INFO -- : [441/885] 1645443=test_scalar I, [2024-05-07T08:08:00.835659 #1604567] INFO -- : [442/885] 1645443=test_syntax I, [2024-05-07T08:08:00.860844 #1604567] INFO -- : [443/885] 1645442=test_class_name_check I, [2024-05-07T08:08:00.968656 #1604567] INFO -- : [444/885] 1645442=test_basicsocket I, [2024-05-07T08:08:01.014439 #1604567] INFO -- : [445/885] 1645442=test_zsh_completion I, [2024-05-07T08:08:01.019958 #1604567] INFO -- : [446/885] 1645442=test_gem_commands_cert_command I, [2024-05-07T08:08:04.129056 #1604567] INFO -- : [447/885] 1645441=ruby_parser_test I, [2024-05-07T08:08:04.142908 #1604567] INFO -- : [448/885] 1645441=test_gem_commands_stale_command I, [2024-05-07T08:08:04.257946 #1604567] INFO -- : [449/885] 1645441=test_date_strftime I, [2024-05-07T08:08:04.482797 #1604567] INFO -- : [450/885] 1645442=json_parser_test I, [2024-05-07T08:08:04.505784 #1604567] INFO -- : [451/885] 1645442=test_ws I, [2024-05-07T08:08:04.515059 #1604567] INFO -- : [452/885] 1645442=test_rdoc_markup_to_tt_only I, [2024-05-07T08:08:04.552580 #1604567] INFO -- : [453/885] 1645442=test_key_name_check I, [2024-05-07T08:08:04.560809 #1604567] INFO -- : [454/885] 1645442=test_rdoc_markup_to_bs I, [2024-05-07T08:08:04.566762 #1604567] INFO -- : [455/885] 1645441=test_rdoc_markup_raw I, [2024-05-07T08:08:04.584504 #1604567] INFO -- : [456/885] 1645441=test_timeout I, [2024-05-07T08:08:04.627683 #1604567] INFO -- : [457/885] 1645442=test_rdoc_alias I, [2024-05-07T08:08:04.677027 #1604567] INFO -- : [458/885] 1645442=test_instrumentation_api I, [2024-05-07T08:08:05.511354 #1604567] INFO -- : [459/885] 1645441=test_weakref I, [2024-05-07T08:08:05.858941 #1604567] INFO -- : [460/885] 1645441=test_fstring I, [2024-05-07T08:08:05.936694 #1604567] INFO -- : [461/885] 1645441=test_numeric I, [2024-05-07T08:08:05.944318 #1604567] INFO -- : [462/885] 1645441=test_singleton I, [2024-05-07T08:08:05.947767 #1604567] INFO -- : [463/885] 1645441=test_word I, [2024-05-07T08:08:05.962047 #1604567] INFO -- : [464/885] 1645441=test_rdoc_require I, [2024-05-07T08:08:06.096527 #1604567] INFO -- : [465/885] 1645441=test_gem_ext_rake_builder I, [2024-05-07T08:08:06.639553 #1604567] INFO -- : [466/885] 1645441=test_ansi_without_terminfo I, [2024-05-07T08:08:06.653622 #1604567] INFO -- : [467/885] 1645441=json_generator_test I, [2024-05-07T08:08:06.762933 #1604567] INFO -- : [468/885] 1645441=test_ractor I, [2024-05-07T08:08:06.782402 #1604567] INFO -- : [469/885] 1645441=test_gem I, [2024-05-07T08:08:07.650290 #1604567] INFO -- : [470/885] 1645442=test_registry I, [2024-05-07T08:08:07.659516 #1604567] INFO -- : [471/885] 1645442=test_gem_resolver_best_set I, [2024-05-07T08:08:07.662860 #1604567] INFO -- : [472/885] 1645443=test_cgi_core I, [2024-05-07T08:08:07.686677 #1604567] INFO -- : [473/885] 1645443=test_parser I, [2024-05-07T08:08:07.696589 #1604567] INFO -- : [474/885] 1645443=test_rdoc_markup_to_label I, [2024-05-07T08:08:07.736916 #1604567] INFO -- : [475/885] 1645443=test_rdoc_markup_hard_break I, [2024-05-07T08:08:07.737929 #1604567] INFO -- : [476/885] 1645442=test_nesting_parser I, [2024-05-07T08:08:07.745460 #1604567] INFO -- : [477/885] 1645443=test_marshal I, [2024-05-07T08:08:07.811554 #1604567] INFO -- : [478/885] 1645442=test_ancdata I, [2024-05-07T08:08:07.830304 #1604567] INFO -- : [479/885] 1645442=ractor_test I, [2024-05-07T08:08:07.876528 #1604567] INFO -- : [480/885] 1645442=test_enc_str_buf_cat I, [2024-05-07T08:08:07.891270 #1604567] INFO -- : [481/885] 1645442=test_bignum I, [2024-05-07T08:08:08.659566 #1604567] INFO -- : [482/885] 1645443=newline_test I, [2024-05-07T08:08:08.766547 #1604567] INFO -- : [483/885] 1645443=test_ssl I, [2024-05-07T08:08:08.914339 #1604567] INFO -- : [484/885] 1645443=test_gem_commands_help_command I, [2024-05-07T08:08:09.020625 #1604567] INFO -- : [485/885] 1645443=test_scheduler I, [2024-05-07T08:08:09.138996 #1604567] INFO -- : [486/885] 1645441=test_gem_resolver_conflict I, [2024-05-07T08:08:09.182923 #1604567] INFO -- : [487/885] 1645441=test_ractor I, [2024-05-07T08:08:09.232838 #1604567] INFO -- : [488/885] 1645443=test_gem_commands_list_command I, [2024-05-07T08:08:09.241644 #1604567] INFO -- : [489/885] 1645443=test_date_new I, [2024-05-07T08:08:09.255851 #1604567] INFO -- : [490/885] 1645443=test_configuration I, [2024-05-07T08:08:09.350347 #1604567] INFO -- : [491/885] 1645443=test_gem_resolver_local_specification I, [2024-05-07T08:08:09.395354 #1604567] INFO -- : [492/885] 1645443=test_have_func I, [2024-05-07T08:08:09.477135 #1604567] INFO -- : [493/885] 1645441=test_date_marshal I, [2024-05-07T08:08:09.494628 #1604567] INFO -- : [494/885] 1645441=test_unix I, [2024-05-07T08:08:09.619945 #1604567] INFO -- : [495/885] 1645441=test_integer I, [2024-05-07T08:08:10.752049 #1604567] INFO -- : [496/885] 1645443=test_rdoc_servlet I, [2024-05-07T08:08:10.899952 #1604567] INFO -- : [497/885] 1645443=test_coder I, [2024-05-07T08:08:11.393303 #1604567] INFO -- : [498/885] 1645443=test_symbol I, [2024-05-07T08:08:11.483896 #1604567] INFO -- : [499/885] 1645442=test_gem_commands_search_command I, [2024-05-07T08:08:11.498439 #1604567] INFO -- : [500/885] 1645442=test_context I, [2024-05-07T08:08:11.645039 #1604567] INFO -- : [501/885] 1645442=test_udp I, [2024-05-07T08:08:11.665447 #1604567] INFO -- : [502/885] 1645442=test_gem_commands_contents_command I, [2024-05-07T08:08:11.798706 #1604567] INFO -- : [503/885] 1645442=test_formatter I, [2024-05-07T08:08:11.815020 #1604567] INFO -- : [504/885] 1645442=test_gem_commands_signin_command I, [2024-05-07T08:08:11.972754 #1604567] INFO -- : [505/885] 1645442=test_range I, [2024-05-07T08:08:11.984831 #1604567] INFO -- : [506/885] 1645441=test_iter_break I, [2024-05-07T08:08:11.987620 #1604567] INFO -- : [507/885] 1645441=test_extlibs I, [2024-05-07T08:08:12.837783 #1604567] INFO -- : [508/885] 1645442=test_enum I, [2024-05-07T08:08:13.603755 #1604567] INFO -- : [509/885] 1645441=test_rdoc_markup_include I, [2024-05-07T08:08:13.610005 #1604567] INFO -- : [510/885] 1645441=test_recursion I, [2024-05-07T08:08:13.632970 #1604567] INFO -- : [511/885] 1645441=test_require I, [2024-05-07T08:08:13.787629 #1604567] INFO -- : [512/885] 1645442=test_rbconfig I, [2024-05-07T08:08:13.798776 #1604567] INFO -- : [513/885] 1645442=test_num2int I, [2024-05-07T08:08:13.813007 #1604567] INFO -- : [514/885] 1645442=test_locale I, [2024-05-07T08:08:13.827203 #1604567] INFO -- : [515/885] 1645442=test_ts I, [2024-05-07T08:08:14.126565 #1604567] INFO -- : [516/885] 1645442=test_trick I, [2024-05-07T08:08:15.022864 #1604567] INFO -- : [517/885] 1645441=test_ractor I, [2024-05-07T08:08:15.032044 #1604567] INFO -- : [518/885] 1645443=test_stream I, [2024-05-07T08:08:15.041990 #1604567] INFO -- : [519/885] 1645443=test_address_resolve I, [2024-05-07T08:08:15.058027 #1604567] INFO -- : [520/885] 1645441=test_rdoc_attr I, [2024-05-07T08:08:15.065475 #1604567] INFO -- : [521/885] 1645441=location_test I, [2024-05-07T08:08:15.111984 #1604567] INFO -- : [522/885] 1645441=test_delegate I, [2024-05-07T08:08:15.117185 #1604567] INFO -- : [523/885] 1645443=test_chilled I, [2024-05-07T08:08:15.128433 #1604567] INFO -- : [524/885] 1645443=test_symbol I, [2024-05-07T08:08:15.134910 #1604567] INFO -- : [525/885] 1645443=test_project_sanity I, [2024-05-07T08:08:15.149673 #1604567] INFO -- : [526/885] 1645441=test_alias_and_anchor I, [2024-05-07T08:08:15.186490 #1604567] INFO -- : [527/885] 1645441=test_popen_deadlock I, [2024-05-07T08:08:15.224975 #1604567] INFO -- : [528/885] 1645443=test_time I, [2024-05-07T08:08:15.437995 #1604567] INFO -- : [529/885] 1645443=test_ensured I, [2024-05-07T08:08:15.464139 #1604567] INFO -- : [530/885] 1645443=test_key_stroke I, [2024-05-07T08:08:15.472222 #1604567] INFO -- : [531/885] 1645443=test_rdoc_markup I, [2024-05-07T08:08:15.477280 #1604567] INFO -- : [532/885] 1645443=test_euc_jp I, [2024-05-07T08:08:15.492674 #1604567] INFO -- : [533/885] 1645443=test_webauthn_listener_response I, [2024-05-07T08:08:15.550466 #1604567] INFO -- : [534/885] 1645443=test_sleep I, [2024-05-07T08:08:15.721565 #1604567] INFO -- : [535/885] 1645441=ruby_api_test I, [2024-05-07T08:08:15.869258 #1604567] INFO -- : [536/885] 1645441=test_gem_resolver_index_set I, [2024-05-07T08:08:15.928627 #1604567] INFO -- : [537/885] 1645441=test_gc I, [2024-05-07T08:08:16.424338 #1604567] INFO -- : [538/885] 1645442=test_gem_request_set I, [2024-05-07T08:08:17.006762 #1604567] INFO -- : [539/885] 1645442=test_gem_bundler_version_finder I, [2024-05-07T08:08:17.044884 #1604567] INFO -- : [540/885] 1645442=test_folderitem2_invokeverb I, [2024-05-07T08:08:17.050750 #1604567] INFO -- : [541/885] 1645442=test_set_len I, [2024-05-07T08:08:17.057542 #1604567] INFO -- : [542/885] 1645442=constant_path_node_test I, [2024-05-07T08:08:17.061980 #1604567] INFO -- : [543/885] 1645442=test_interned_str I, [2024-05-07T08:08:17.077022 #1604567] INFO -- : [544/885] 1645442=test_pattern_matching I, [2024-05-07T08:08:17.094393 #1604567] INFO -- : [545/885] 1645442=test_socket I, [2024-05-07T08:08:18.002391 #1604567] INFO -- : [546/885] 1645442=test_terminfo I, [2024-05-07T08:08:18.010010 #1604567] INFO -- : [547/885] 1645442=test_inlinecache I, [2024-05-07T08:08:18.070859 #1604567] INFO -- : [548/885] 1645442=test_thread I, [2024-05-07T08:08:20.515586 #1604567] INFO -- : [549/885] 1645443=test_data I, [2024-05-07T08:08:20.584047 #1604567] INFO -- : [550/885] 1645443=test_bug-14834 I, [2024-05-07T08:08:20.592559 #1604567] INFO -- : [551/885] 1645443=test_addrinfo I, [2024-05-07T08:08:20.641416 #1604567] INFO -- : .Leaked file descriptor: TestSocketAddrinfo#test_addrinfo_timeout: 10 # I, [2024-05-07T08:08:20.669529 #1604567] INFO -- : COMMAND PID USER FD TYPE DEVICE SIZE/OFF NODE NAME I, [2024-05-07T08:08:20.669604 #1604567] INFO -- : ruby 1645443 opc 10u unix 0x0000000000000000 0t0 2877104319 type=STREAM I, [2024-05-07T08:08:20.736018 #1604567] INFO -- : [552/885] 1645443=test_to_ruby I, [2024-05-07T08:08:20.760387 #1604567] INFO -- : [553/885] 1645443=test_time_tz I, [2024-05-07T08:08:20.819352 #1604567] INFO -- : [554/885] 1645443=test_gem_ext_builder I, [2024-05-07T08:08:21.845662 #1604567] INFO -- : [555/885] 1645443=test_history I, [2024-05-07T08:08:23.589973 #1604567] INFO -- : [556/885] 1645443=test_to_ary_concat I, [2024-05-07T08:08:24.724989 #1604567] INFO -- : [557/885] 1645443=test_windows_1251 I, [2024-05-07T08:08:24.742257 #1604567] INFO -- : [558/885] 1645443=test_gem_commands_build_command I, [2024-05-07T08:08:25.068987 #1604567] INFO -- : [559/885] 1645443=test_ellipsize I, [2024-05-07T08:08:25.094178 #1604567] INFO -- : [560/885] 1645443=test_call I, [2024-05-07T08:08:25.367807 #1604567] INFO -- : [561/885] 1645443=test_reline I, [2024-05-07T08:08:25.383780 #1604567] INFO -- : [562/885] 1645441=test_helper I, [2024-05-07T08:08:25.397571 #1604567] INFO -- : [563/885] 1645441=test_gem_resolver_api_set I, [2024-05-07T08:08:25.484556 #1604567] INFO -- : [564/885] 1645441=test_duplicate I, [2024-05-07T08:08:25.485185 #1604567] INFO -- : [565/885] 1645441=test_cgi_header I, [2024-05-07T08:08:25.488963 #1604567] INFO -- : [566/885] 1645443=format_errors_test I, [2024-05-07T08:08:25.491159 #1604567] INFO -- : [567/885] 1645441=test_case_options I, [2024-05-07T08:08:25.497957 #1604567] INFO -- : [568/885] 1645443=test_kill_ring I, [2024-05-07T08:08:25.499169 #1604567] INFO -- : [569/885] 1645441=test_addr I, [2024-05-07T08:08:25.507448 #1604567] INFO -- : [570/885] 1645443=test_mailto I, [2024-05-07T08:08:25.508953 #1604567] INFO -- : [571/885] 1645443=test_object I, [2024-05-07T08:08:25.513942 #1604567] INFO -- : [572/885] 1645441=test_member I, [2024-05-07T08:08:25.518260 #1604567] INFO -- : [573/885] 1645443=test_nofree I, [2024-05-07T08:08:25.520697 #1604567] INFO -- : [574/885] 1645443=test_regexp I, [2024-05-07T08:08:25.527240 #1604567] INFO -- : [575/885] 1645441=test_whileuntil I, [2024-05-07T08:08:25.538911 #1604567] INFO -- : [576/885] 1645441=test_rdoc_normal_class I, [2024-05-07T08:08:25.596292 #1604567] INFO -- : [577/885] 1645441=test_within_pipe I, [2024-05-07T08:08:25.629741 #1604567] INFO -- : [578/885] 1645441=test_pointer I, [2024-05-07T08:08:26.960075 #1604567] INFO -- : [579/885] 1645442=test_monitor I, [2024-05-07T08:08:27.240652 #1604567] INFO -- : [580/885] 1645442=test_beginendblock I, [2024-05-07T08:08:27.496800 #1604567] INFO -- : [581/885] 1645441=test_eval I, [2024-05-07T08:08:27.566820 #1604567] INFO -- : [582/885] 1645442=compiler_test I, [2024-05-07T08:08:27.567921 #1604567] INFO -- : [583/885] 1645442=test_arith_seq_extract I, [2024-05-07T08:08:27.576270 #1604567] INFO -- : [584/885] 1645442=test_ruby_lex I, [2024-05-07T08:08:27.704640 #1604567] INFO -- : [585/885] 1645442=test_object_references I, [2024-05-07T08:08:27.733776 #1604567] INFO -- : [586/885] 1645442=test_gem_source_subpath_problem I, [2024-05-07T08:08:27.750379 #1604567] INFO -- : [587/885] 1645441=test_gem_installer I, [2024-05-07T08:08:27.850484 #1604567] INFO -- : [588/885] 1645442=test_bug_reporter I, [2024-05-07T08:08:28.055627 #1604567] INFO -- : [589/885] 1645442=test_ossl I, [2024-05-07T08:08:32.898616 #1604567] INFO -- : [590/885] 1645441=test_buffered_io I, [2024-05-07T08:08:32.914050 #1604567] INFO -- : [591/885] 1645441=test_gem_path_support I, [2024-05-07T08:08:32.962378 #1604567] INFO -- : [592/885] 1645441=test_arity I, [2024-05-07T08:08:32.967547 #1604567] INFO -- : [593/885] 1645441=test_win32ole_type_event I, [2024-05-07T08:08:33.015142 #1604567] INFO -- : [594/885] 1645441=test_keyword I, [2024-05-07T08:08:33.563810 #1604567] INFO -- : [595/885] 1645441=test_trace I, [2024-05-07T08:08:33.573245 #1604567] INFO -- : [596/885] 1645441=test_scalar_scanner I, [2024-05-07T08:08:33.588916 #1604567] INFO -- : [597/885] 1645441=test_rb_str_dup I, [2024-05-07T08:08:33.599874 #1604567] INFO -- : [598/885] 1645441=test_lambda I, [2024-05-07T08:08:33.663712 #1604567] INFO -- : [599/885] 1645441=test_summary I, [2024-05-07T08:08:33.722121 #1604567] INFO -- : [600/885] 1645441=test_helper_method I, [2024-05-07T08:08:33.821867 #1604567] INFO -- : [601/885] 1645441=test_config I, [2024-05-07T08:08:34.146287 #1604567] INFO -- : [602/885] 1645441=test_file I, [2024-05-07T08:08:35.272634 #1604567] INFO -- : [603/885] 1645442=bom_test I, [2024-05-07T08:08:35.280435 #1604567] INFO -- : [604/885] 1645442=test_x509ext I, [2024-05-07T08:08:35.287197 #1604567] INFO -- : [605/885] 1645442=test_emitter I, [2024-05-07T08:08:35.294925 #1604567] INFO -- : [606/885] 1645442=test_foreach I, [2024-05-07T08:08:35.307166 #1604567] INFO -- : [607/885] 1645442=test_rdoc_markup_to_html I, [2024-05-07T08:08:35.404032 #1604567] INFO -- : [608/885] 1645442=test_gem_resolver_installer_set I, [2024-05-07T08:08:35.684836 #1604567] INFO -- : [609/885] 1645442=test_append I, [2024-05-07T08:08:35.713761 #1604567] INFO -- : [610/885] 1645442=test_transcode I, [2024-05-07T08:08:35.964093 #1604567] INFO -- : [611/885] 1645442=test_refinement I, [2024-05-07T08:08:39.416903 #1604567] INFO -- : [612/885] 1645442=test_debug I, [2024-05-07T08:08:39.459019 #1604567] INFO -- : [613/885] 1645442=test_gem_commands_cleanup_command I, [2024-05-07T08:08:40.037265 #1604567] INFO -- : [614/885] 1645442=test_class2name I, [2024-05-07T08:08:40.041632 #1604567] INFO -- : [615/885] 1645442=test_pattern_key_name_check I, [2024-05-07T08:08:40.047288 #1604567] INFO -- : [616/885] 1645442=test_profile_frames I, [2024-05-07T08:08:40.216507 #1604567] INFO -- : [617/885] 1645442=test_rdoc_markup_heading I, [2024-05-07T08:08:40.290999 #1604567] INFO -- : [618/885] 1645442=test_io_console I, [2024-05-07T08:08:40.358892 #1604567] INFO -- : [619/885] 1645441=test_flip I, [2024-05-07T08:08:40.387221 #1604567] INFO -- : [620/885] 1645441=test_notimplement I, [2024-05-07T08:08:40.467376 #1604567] INFO -- : [621/885] 1645441=test_cgi_session I, [2024-05-07T08:08:40.540822 #1604567] INFO -- : [622/885] 1645441=test_c_union_entity I, [2024-05-07T08:08:40.674593 #1604567] INFO -- : [623/885] 1645441=test_dns I, [2024-05-07T08:08:41.132954 #1604567] INFO -- : [624/885] 1645441=test_x509crl I, [2024-05-07T08:08:41.224427 #1604567] INFO -- : [625/885] 1645441=test_win32ole_event I, [2024-05-07T08:08:41.251654 #1604567] INFO -- : [626/885] 1645441=test_gem_commands_uninstall_command I, [2024-05-07T08:08:42.067973 #1604567] INFO -- : [627/885] 1645441=test_rdoc_markup_formatter I, [2024-05-07T08:08:42.087644 #1604567] INFO -- : [628/885] 1645441=test_compile_prism I, [2024-05-07T08:08:42.408968 #1604567] INFO -- : [629/885] 1645441=test_helper I, [2024-05-07T08:08:42.416695 #1604567] INFO -- : [630/885] 1645441=test_getopts I, [2024-05-07T08:08:42.424843 #1604567] INFO -- : [631/885] 1645441=test_alias I, [2024-05-07T08:08:42.618932 #1604567] INFO -- : [632/885] 1645441=test_fips I, [2024-05-07T08:08:42.799983 #1604567] INFO -- : [633/885] 1645442=test_emitter I, [2024-05-07T08:08:42.812411 #1604567] INFO -- : [634/885] 1645442=test_digest_extend I, [2024-05-07T08:08:42.846378 #1604567] INFO -- : [635/885] 1645442=test_gem_ext_cmake_builder I, [2024-05-07T08:08:42.858962 #1604567] INFO -- : [636/885] 1645441=test_thread_fd_close I, [2024-05-07T08:08:42.859553 #1604567] INFO -- : [637/885] 1645442=test_last_thread I, [2024-05-07T08:08:42.904992 #1604567] INFO -- : [638/885] 1645441=unescape_test I, [2024-05-07T08:08:43.943455 #1604567] INFO -- : [639/885] 1645442=test_gem_commands_exec_command I, [2024-05-07T08:08:44.256457 #1604567] INFO -- : [640/885] 1645441=test_color_printer I, [2024-05-07T08:08:44.274923 #1604567] INFO -- : [641/885] 1645441=test_super I, [2024-05-07T08:08:45.287383 #1604567] INFO -- : [642/885] 1645442=test_gem_source_vendor I, [2024-05-07T08:08:45.308242 #1604567] INFO -- : [643/885] 1645442=test_gem_resolver I, [2024-05-07T08:08:45.699733 #1604567] INFO -- : [644/885] 1645442=test_object I, [2024-05-07T08:08:46.014908 #1604567] INFO -- : [645/885] 1645442=test_dln I, [2024-05-07T08:08:46.080237 #1604567] INFO -- : [646/885] 1645442=test_func I, [2024-05-07T08:08:46.260638 #1604567] INFO -- : [647/885] 1645441=test_config I, [2024-05-07T08:08:46.282191 #1604567] INFO -- : [648/885] 1645441=test_vm_dump I, [2024-05-07T08:08:46.290334 #1604567] INFO -- : [649/885] 1645441=json_encoding_test I, [2024-05-07T08:08:46.301030 #1604567] INFO -- : [650/885] 1645441=test_pkg_config I, [2024-05-07T08:08:46.333830 #1604567] INFO -- : [651/885] 1645441=test_gem_available_set I, [2024-05-07T08:08:46.427773 #1604567] INFO -- : [652/885] 1645441=test_modify_expand I, [2024-05-07T08:08:46.458007 #1604567] INFO -- : [653/885] 1645441=errors_test I, [2024-05-07T08:08:48.415948 #1604567] INFO -- : [654/885] 1645441=test_convertible I, [2024-05-07T08:08:49.621824 #1604567] INFO -- : [655/885] 1645443=test_insns_leaf I, [2024-05-07T08:08:49.789799 #1604567] INFO -- : [656/885] 1645443=test_allocation I, [2024-05-07T08:08:50.351654 #1604567] INFO -- : [657/885] 1645441=test_ifunless I, [2024-05-07T08:08:50.366347 #1604567] INFO -- : [658/885] 1645441=test_gem_console_ui I, [2024-05-07T08:08:50.376168 #1604567] INFO -- : [659/885] 1645441=test_x509req I, [2024-05-07T08:08:50.418772 #1604567] INFO -- : [660/885] 1645441=test_readpartial I, [2024-05-07T08:08:50.826584 #1604567] INFO -- : [661/885] 1645441=test_httpresponse I, [2024-05-07T08:08:50.866832 #1604567] INFO -- : [662/885] 1645441=test_rdoc_parser_ruby I, [2024-05-07T08:08:50.990932 #1604567] INFO -- : [663/885] 1645442=test_cgi_modruby I, [2024-05-07T08:08:50.996713 #1604567] INFO -- : [664/885] 1645442=magic_comment_test I, [2024-05-07T08:08:51.005622 #1604567] INFO -- : [665/885] 1645442=test_win32ole_variant I, [2024-05-07T08:08:51.010880 #1604567] INFO -- : [666/885] 1645442=test_x509attr I, [2024-05-07T08:08:51.024792 #1604567] INFO -- : [667/885] 1645442=test_printf I, [2024-05-07T08:08:51.038603 #1604567] INFO -- : [668/885] 1645442=test_workspace I, [2024-05-07T08:08:51.169343 #1604567] INFO -- : [669/885] 1645442=test_etc I, [2024-05-07T08:08:51.272934 #1604567] INFO -- : [670/885] 1645442=test_gem_commands_rebuild_command I, [2024-05-07T08:08:51.373334 #1604567] INFO -- : [671/885] 1645442=test_nomethod_error I, [2024-05-07T08:08:51.389827 #1604567] INFO -- : [672/885] 1645442=test_stat I, [2024-05-07T08:08:51.393979 #1604567] INFO -- : [673/885] 1645442=test_win32ole_param_event I, [2024-05-07T08:08:51.404872 #1604567] INFO -- : [674/885] 1645442=test_rdoc_parser I, [2024-05-07T08:08:51.430794 #1604567] INFO -- : [675/885] 1645442=test_https_proxy I, [2024-05-07T08:08:51.447016 #1604567] INFO -- : [676/885] 1645442=test_digest I, [2024-05-07T08:08:51.457204 #1604567] INFO -- : [677/885] 1645442=test_path I, [2024-05-07T08:08:51.466614 #1604567] INFO -- : [678/885] 1645442=test_rdoc_rd_inline I, [2024-05-07T08:08:51.477229 #1604567] INFO -- : [679/885] 1645442=test_files_test_1 I, [2024-05-07T08:08:51.481904 #1604567] INFO -- : [680/885] 1645442=test_dir I, [2024-05-07T08:08:51.861622 #1604567] INFO -- : [681/885] 1645442=test_rubygems I, [2024-05-07T08:08:51.940803 #1604567] INFO -- : [682/885] 1645443=test_resolve_symbol I, [2024-05-07T08:08:52.002682 #1604567] INFO -- : [683/885] 1645443=test_closure I, [2024-05-07T08:08:52.046518 #1604567] INFO -- : [684/885] 1645442=test_io I, [2024-05-07T08:08:52.081590 #1604567] INFO -- : [685/885] 1645441=test_uncorrectable_name_check I, [2024-05-07T08:08:52.083960 #1604567] INFO -- : [686/885] 1645441=test_color I, [2024-05-07T08:08:52.210677 #1604567] INFO -- : [687/885] 1645441=test_io_m17n I, [2024-05-07T08:08:53.461543 #1604567] INFO -- : [688/885] 1645441=test_rdoc_top_level I, [2024-05-07T08:08:53.812665 #1604567] INFO -- : [689/885] 1645441=test_float I, [2024-05-07T08:08:54.426515 #1604567] INFO -- : [690/885] 1645443=test_gem_stub_specification I, [2024-05-07T08:08:54.583637 #1604567] INFO -- : [691/885] 1645443=test_cmethod I, [2024-05-07T08:08:54.824899 #1604567] INFO -- : [692/885] 1645443=test_unicode_normalize I, [2024-05-07T08:08:55.910058 #1604567] INFO -- : [693/885] 1645441=test_rdoc_generator_ri I, [2024-05-07T08:08:55.926978 #1604567] INFO -- : [694/885] 1645441=test_gem_stream_ui I, [2024-05-07T08:08:56.053585 #1604567] INFO -- : [695/885] 1645441=test_gb18030 I, [2024-05-07T08:08:56.066953 #1604567] INFO -- : [696/885] 1645441=test_propertyputref I, [2024-05-07T08:08:56.069351 #1604567] INFO -- : [697/885] 1645441=test_reline_key I, [2024-05-07T08:08:56.100290 #1604567] INFO -- : [698/885] 1645441=test_gem_commands_lock_command I, [2024-05-07T08:08:56.136575 #1604567] INFO -- : [699/885] 1645441=test_shellwords I, [2024-05-07T08:08:56.149598 #1604567] INFO -- : [700/885] 1645441=test_mul I, [2024-05-07T08:08:56.158539 #1604567] INFO -- : [701/885] 1645441=test_rdoc_generator_pot_po I, [2024-05-07T08:08:56.168739 #1604567] INFO -- : [702/885] 1645441=test_ipaddr I, [2024-05-07T08:08:56.207638 #1604567] INFO -- : [703/885] 1645441=test_scanner_events I, [2024-05-07T08:08:56.243286 #1604567] INFO -- : [704/885] 1645441=test_ocsp I, [2024-05-07T08:08:56.337477 #1604567] INFO -- : [705/885] 1645441=test_omap I, [2024-05-07T08:08:56.363752 #1604567] INFO -- : [706/885] 1645441=test_date_strptime I, [2024-05-07T08:08:56.471232 #1604567] INFO -- : [707/885] 1645441=test_nonblock I, [2024-05-07T08:08:56.499715 #1604567] INFO -- : [708/885] 1645441=test_rdoc_parser_simple I, [2024-05-07T08:08:56.542419 #1604567] INFO -- : [709/885] 1645441=json_ext_parser_test I, [2024-05-07T08:08:56.576792 #1604567] INFO -- : [710/885] 1645441=test_gem_ext_configure_builder I, [2024-05-07T08:08:56.645973 #1604567] INFO -- : [711/885] 1645441=test_gem_package I, [2024-05-07T08:08:57.507718 #1604567] INFO -- : [712/885] 1645441=test_array I, [2024-05-07T08:08:58.442423 #1604567] INFO -- : [713/885] 1645443=test_autoload I, [2024-05-07T08:09:02.771340 #1604567] INFO -- : [714/885] 1645443=test_have_macro I, [2024-05-07T08:09:02.873484 #1604567] INFO -- : [715/885] 1645442=test_gem_source I, [2024-05-07T08:09:03.024104 #1604567] INFO -- : [716/885] 1645443=test_mkmf I, [2024-05-07T08:09:03.049951 #1604567] INFO -- : [717/885] 1645443=test_class I, [2024-05-07T08:09:03.073616 #1604567] INFO -- : [718/885] 1645443=test_benchmark I, [2024-05-07T08:09:03.341865 #1604567] INFO -- : [719/885] 1645442=test_at_exit I, [2024-05-07T08:09:03.345413 #1604567] INFO -- : [720/885] 1645442=test_assembler I, [2024-05-07T08:09:03.348154 #1604567] INFO -- : [721/885] 1645442=test_stringio I, [2024-05-07T08:09:03.440702 #1604567] INFO -- : [722/885] 1645442=test_thread_cv I, [2024-05-07T08:09:04.086576 #1604567] INFO -- : [723/885] 1645442=test_files_ext I, [2024-05-07T08:09:04.095667 #1604567] INFO -- : [724/885] 1645442=test_random I, [2024-05-07T08:09:04.107666 #1604567] INFO -- : [725/885] 1645442=test_win32ole_method I, [2024-05-07T08:09:04.116601 #1604567] INFO -- : [726/885] 1645442=test_lexer I, [2024-05-07T08:09:04.204014 #1604567] INFO -- : [727/885] 1645442=test_regex_casefold I, [2024-05-07T08:09:04.749511 #1604567] INFO -- : [728/885] 1645442=test_gem_source_git I, [2024-05-07T08:09:04.933403 #1604567] INFO -- : [729/885] 1645443=test_ripper I, [2024-05-07T08:09:05.251787 #1604567] INFO -- : [730/885] 1645443=test_eval_history I, [2024-05-07T08:09:05.280807 #1604567] INFO -- : [731/885] 1645443=dispatcher_test I, [2024-05-07T08:09:05.281042 #1604567] INFO -- : [732/885] 1645443=test_unicode I, [2024-05-07T08:09:05.373959 #1604567] INFO -- : [733/885] 1645443=test_gem_commands_setup_command I, [2024-05-07T08:09:05.713787 #1604567] INFO -- : [734/885] 1645442=test_history I, [2024-05-07T08:09:05.754014 #1604567] INFO -- : [735/885] 1645442=test_eval I, [2024-05-07T08:09:05.761479 #1604567] INFO -- : [736/885] 1645442=test_document I, [2024-05-07T08:09:05.778626 #1604567] INFO -- : [737/885] 1645442=test_gem_safe_yaml I, [2024-05-07T08:09:05.786565 #1604567] INFO -- : [738/885] 1645442=test_singleton_function I, [2024-05-07T08:09:05.796165 #1604567] INFO -- : [739/885] 1645442=command_line_test I, [2024-05-07T08:09:05.812796 #1604567] INFO -- : [740/885] 1645442=test_gem_commands_signout_command I, [2024-05-07T08:09:05.843921 #1604567] INFO -- : [741/885] 1645442=test_gem_package_tar_reader I, [2024-05-07T08:09:05.918049 #1604567] INFO -- : [742/885] 1645442=test_env I, [2024-05-07T08:09:06.256893 #1604567] INFO -- : [743/885] 1645443=test_pair I, [2024-05-07T08:09:08.460865 #1604567] INFO -- : [744/885] 1645442=test_win32ole_variant_m I, [2024-05-07T08:09:08.471964 #1604567] INFO -- : [745/885] 1645442=test_primitive I, [2024-05-07T08:09:08.482722 #1604567] INFO -- : [746/885] 1645442=test_rdoc_ri_paths I, [2024-05-07T08:09:08.532077 #1604567] INFO -- : [747/885] 1645442=test_parser I, [2024-05-07T08:09:08.581417 #1604567] INFO -- : [748/885] 1645442=test_iseq I, [2024-05-07T08:09:09.149893 #1604567] INFO -- : [749/885] 1645442=integer_parse_test I, [2024-05-07T08:09:09.161936 #1604567] INFO -- : [750/885] 1645442=test_autoconf I, [2024-05-07T08:09:09.189984 #1604567] INFO -- : [751/885] 1645442=test_ractor_compatibility I, [2024-05-07T08:09:09.526615 #1604567] INFO -- : [752/885] 1645442=test_arithmetic_sequence I, [2024-05-07T08:09:09.556583 #1604567] INFO -- : [753/885] 1645442=test_find_executable I, [2024-05-07T08:09:09.570372 #1604567] INFO -- : [754/885] 1645442=test_lazy_enumerator I, [2024-05-07T08:09:10.022985 #1604567] INFO -- : [755/885] 1645442=test_cgi_multipart I, [2024-05-07T08:09:10.170991 #1604567] INFO -- : [756/885] 1645442=test_gem_request_set_lockfile_tokenizer I, [2024-05-07T08:09:10.261033 #1604567] INFO -- : [757/885] 1645442=test_gem_source_fetch_problem I, [2024-05-07T08:09:10.278922 #1604567] INFO -- : [758/885] 1645442=test_rdoc_comment I, [2024-05-07T08:09:10.328888 #1604567] INFO -- : [759/885] 1645442=test_encoding I, [2024-05-07T08:09:10.372483 #1604567] INFO -- : [760/885] 1645442=test_install I, [2024-05-07T08:09:10.518438 #1604567] INFO -- : [761/885] 1645442=test_ftp I, [2024-05-07T08:09:10.525609 #1604567] INFO -- : [762/885] 1645442=test_sockopt I, [2024-05-07T08:09:10.540202 #1604567] INFO -- : [763/885] 1645442=test_gem_request_set_gem_dependency_api I, [2024-05-07T08:09:10.928714 #1604567] INFO -- : [764/885] 1645442=test_name_error_extension I, [2024-05-07T08:09:10.939083 #1604567] INFO -- : [765/885] 1645442=test_protocol I, [2024-05-07T08:09:11.248100 #1604567] INFO -- : [766/885] 1645442=test_evaluation I, [2024-05-07T08:09:11.251896 #1604567] INFO -- : [767/885] 1645442=test_files_test I, [2024-05-07T08:09:11.262556 #1604567] INFO -- : [768/885] 1645442=test_weakkeymap I, [2024-05-07T08:09:11.651629 #1604567] INFO -- : [769/885] 1645443=test_rdoc_markup_to_ansi I, [2024-05-07T08:09:11.689941 #1604567] INFO -- : [770/885] 1645443=test_object_create_start I, [2024-05-07T08:09:11.710616 #1604567] INFO -- : [771/885] 1645443=test_https I, [2024-05-07T08:09:11.878464 #1604567] INFO -- : [772/885] 1645443=test_gem_commands_info_command I, [2024-05-07T08:09:11.899883 #1604567] INFO -- : [773/885] 1645443=test_logdevice I, [2024-05-07T08:09:13.055506 #1604567] INFO -- : [774/885] 1645443=test_ast I, [2024-05-07T08:09:13.462133 #1604567] INFO -- : [775/885] 1645441=test_rdoc_markup_paragraph I, [2024-05-07T08:09:13.463917 #1604567] INFO -- : [776/885] 1645441=test_x509cert I, [2024-05-07T08:09:13.555035 #1604567] INFO -- : [777/885] 1645441=test_irb I, [2024-05-07T08:09:13.876094 #1604567] INFO -- : [778/885] 1645441=test_bn I, [2024-05-07T08:09:13.902945 #1604567] INFO -- : [779/885] 1645441=test_variable_name_check I, [2024-05-07T08:09:14.096522 #1604567] INFO -- : [780/885] 1645441=test_require_path_check I, [2024-05-07T08:09:14.614169 #1604567] INFO -- : [781/885] 1645441=test_case_comprehensive I, [2024-05-07T08:09:23.952596 #1604567] INFO -- : [782/885] 1645442=test_logperiod I, [2024-05-07T08:09:23.969990 #1604567] INFO -- : [783/885] 1645442=test_rational2 I, [2024-05-07T08:09:23.984721 #1604567] INFO -- : [784/885] 1645442=test_placearg I, [2024-05-07T08:09:24.032633 #1604567] INFO -- : [785/885] 1645442=test_gem_package_tar_header I, [2024-05-07T08:09:24.121241 #1604567] INFO -- : [786/885] 1645442=test_ssl_session I, [2024-05-07T08:09:24.983315 #1604567] INFO -- : [787/885] 1645442=test_io_wait_uncommon I, [2024-05-07T08:09:24.999260 #1604567] INFO -- : [788/885] 1645442=test_continuation I, [2024-05-07T08:09:25.011702 #1604567] INFO -- : [789/885] 1645442=test_gem_silent_ui I, [2024-05-07T08:09:25.137496 #1604567] INFO -- : [790/885] 1645442=test_signal I, [2024-05-07T08:09:27.152244 #1604567] INFO -- : [791/885] 1645442=test_fixnum I, [2024-05-07T08:09:27.165665 #1604567] INFO -- : [792/885] 1645442=test_gem_ci_detector I, [2024-05-07T08:09:27.167408 #1604567] INFO -- : [793/885] 1645442=test_completion I, [2024-05-07T08:09:27.969158 #1604567] INFO -- : [794/885] 1645442=test_file_exhaustive I, [2024-05-07T08:09:36.109177 #1604567] INFO -- : [795/885] 1645441=test_delete I, [2024-05-07T08:09:36.118294 #1604567] INFO -- : [796/885] 1645441=test_rdoc_markup_document I, [2024-05-07T08:09:36.153795 #1604567] INFO -- : [797/885] 1645441=test_gem_security_policy I, [2024-05-07T08:09:36.621233 #1604567] INFO -- : [798/885] 1645441=parse_stream_test I, [2024-05-07T08:09:36.651317 #1604567] INFO -- : [799/885] 1645441=test_handle I, [2024-05-07T08:09:38.042768 #1604567] INFO -- : [800/885] 1645441=test_gem_ext_cargo_builder_link_flag_converter I, [2024-05-07T08:09:38.138964 #1604567] INFO -- : [801/885] 1645441=test_gem_local_remote_options I, [2024-05-07T08:09:38.238170 #1604567] INFO -- : [802/885] 1645441=test_dup I, [2024-05-07T08:09:38.371742 #1604567] INFO -- : [803/885] 1645441=test_rdoc_single_class I, [2024-05-07T08:09:38.385019 #1604567] INFO -- : [804/885] 1645441=test_acceptable I, [2024-05-07T08:09:38.458875 #1604567] INFO -- : [805/885] 1645441=test_tmpdir I, [2024-05-07T08:09:38.539811 #1604567] INFO -- : [806/885] 1645441=test_struct I, [2024-05-07T08:09:39.113804 #1604567] INFO -- : [807/885] 1645442=test_rdoc_token_stream I, [2024-05-07T08:09:39.122159 #1604567] INFO -- : [808/885] 1645441=test_mutex I, [2024-05-07T08:09:39.130669 #1604567] INFO -- : [809/885] 1645442=test_type I, [2024-05-07T08:09:39.139158 #1604567] INFO -- : [810/885] 1645442=heredoc_dedent_test I, [2024-05-07T08:09:39.148687 #1604567] INFO -- : [811/885] 1645442=json_generic_object_test I, [2024-05-07T08:09:39.152039 #1604567] INFO -- : [812/885] 1645442=test_fiddle I, [2024-05-07T08:09:39.383766 #1604567] INFO -- : [813/885] 1645442=test_gem_resolver_vendor_specification I, [2024-05-07T08:09:39.426056 #1604567] INFO -- : [814/885] 1645442=test_date_arith I, [2024-05-07T08:09:39.443474 #1604567] INFO -- : [815/885] 1645442=test_gem_resolver_installed_specification I, [2024-05-07T08:09:39.524012 #1604567] INFO -- : [816/885] 1645442=test_exception_at_throwing I, [2024-05-07T08:09:39.539931 #1604567] INFO -- : [817/885] 1645442=test_ractor I, [2024-05-07T08:09:39.603770 #1604567] INFO -- : [818/885] 1645442=test_stringscanner I, [2024-05-07T08:09:39.643389 #1604567] INFO -- : [819/885] 1645442=test_signedness I, [2024-05-07T08:09:40.279614 #1604567] INFO -- : [820/885] 1645441=test_gem_resolver_git_set I, [2024-05-07T08:09:41.013353 #1604567] INFO -- : [821/885] 1645441=test_gem_commands_check_command I, [2024-05-07T08:09:41.049011 #1604567] INFO -- : [822/885] 1645441=test_digest I, [2024-05-07T08:09:41.421849 #1604567] INFO -- : [823/885] 1645442=test_gem_safe_marshal I, [2024-05-07T08:09:41.856674 #1604567] INFO -- : [824/885] 1645441=test_ractor I, [2024-05-07T08:09:41.930074 #1604567] INFO -- : [825/885] 1645441=test_sexp I, [2024-05-07T08:09:41.961591 #1604567] INFO -- : [826/885] 1645441=test_httpheader I, [2024-05-07T08:09:41.984430 #1604567] INFO -- : [827/885] 1645441=test_rdoc_ri_driver I, [2024-05-07T08:09:42.520941 #1604567] INFO -- : [828/885] 1645442=test_cparser I, [2024-05-07T08:09:42.541136 #1604567] INFO -- : [829/885] 1645441=test_rubyvm I, [2024-05-07T08:09:42.568673 #1604567] INFO -- : [830/885] 1645441=fuzzer_test I, [2024-05-07T08:09:42.635791 #1604567] INFO -- : [831/885] 1645441=test_c_struct_entry I, [2024-05-07T08:09:43.911997 #1604567] INFO -- : [832/885] 1645441=test_struct I, [2024-05-07T08:09:43.919466 #1604567] INFO -- : [833/885] 1645441=static_inspect_test I, [2024-05-07T08:09:43.945150 #1604567] INFO -- : [834/885] 1645441=test_custom_command I, [2024-05-07T08:09:43.955646 #1604567] INFO -- : [835/885] 1645441=test_rdoc_parser_markdown I, [2024-05-07T08:09:43.984849 #1604567] INFO -- : [836/885] 1645441=test_depth_first I, [2024-05-07T08:09:43.995021 #1604567] INFO -- : [837/885] 1645441=test_change_word I, [2024-05-07T08:09:44.005533 #1604567] INFO -- : [838/885] 1645441=test_config I, [2024-05-07T08:09:44.118298 #1604567] INFO -- : [839/885] 1645441=test_ostruct I, [2024-05-07T08:09:44.252195 #1604567] INFO -- : [840/885] 1645441=test_integer_comb I, [2024-05-07T08:09:44.831932 #1604567] INFO -- : [841/885] 1645442=test_bundled_ca I, [2024-05-07T08:09:45.834383 #1604567] INFO -- : [842/885] 1645442=test_load I, [2024-05-07T08:09:45.856793 #1604567] INFO -- : [843/885] 1645442=test_abi I, [2024-05-07T08:09:46.053875 #1604567] INFO -- : [844/885] 1645442=test_ssl I, [2024-05-07T08:09:46.938167 #1604567] INFO -- : [845/885] 1645441=test_module I, [2024-05-07T08:09:50.748227 #1604567] INFO -- : [846/885] 1645441=test_erb_command I, [2024-05-07T08:09:50.796032 #1604567] INFO -- : [847/885] 1645441=test_gem_security_trust_dir I, [2024-05-07T08:09:50.855967 #1604567] INFO -- : [848/885] 1645441=test_gem_validator I, [2024-05-07T08:09:50.902946 #1604567] INFO -- : [849/885] 1645441=test_gem_source_installed I, [2024-05-07T08:09:50.965257 #1604567] INFO -- : [850/885] 1645441=test_usrmarshal I, [2024-05-07T08:09:51.111178 #1604567] INFO -- : [851/885] 1645441=test_win32ole_param I, [2024-05-07T08:09:51.124462 #1604567] INFO -- : [852/885] 1645441=test_key_error I, [2024-05-07T08:09:51.137776 #1604567] INFO -- : [853/885] 1645441=test_fiber I, [2024-05-07T08:09:56.631931 #1604567] INFO -- : [854/885] 1645442=test_gem_commands_mirror I, [2024-05-07T08:09:56.638636 #1604567] INFO -- : [855/885] 1645442=test_engine I, [2024-05-07T08:09:57.178771 #1604567] INFO -- : [856/885] 1645442=test_lock_native_thread I, [2024-05-07T08:09:57.341832 #1604567] INFO -- : [857/885] 1645441=test_gem_package_task I, [2024-05-07T08:09:57.346964 #1604567] INFO -- : [858/885] 1645441=test_resize I, [2024-05-07T08:09:57.406300 #1604567] INFO -- : [859/885] 1645441=test_gem_gem_runner I, [2024-05-07T08:09:57.428527 #1604567] INFO -- : [860/885] 1645442=test_require_lib I, [2024-05-07T08:09:57.476353 #1604567] INFO -- : [861/885] 1645441=test_metaclass I, [2024-05-07T08:09:57.478363 #1604567] INFO -- : [862/885] 1645441=test_x509store I, [2024-05-07T08:09:58.023806 #1604567] INFO -- : [863/885] 1645441=test_rdoc_rd_block_parser I, [2024-05-07T08:09:58.057712 #1604567] INFO -- : [864/885] 1645441=test_rdoc_markup_to_joined_paragraph I, [2024-05-07T08:09:58.068855 #1604567] INFO -- : [865/885] 1645441=test_rdoc_markup_to_markdown I, [2024-05-07T08:09:58.128354 #1604567] INFO -- : [866/885] 1645441=test_rdoc_generator_pot I, [2024-05-07T08:09:58.138053 #1604567] INFO -- : [867/885] 1645441=test_rdoc_rd I, [2024-05-07T08:09:58.146253 #1604567] INFO -- : [868/885] 1645441=test_not I, [2024-05-07T08:09:58.152793 #1604567] INFO -- : [869/885] 1645441=test_cgi_cookie I, [2024-05-07T08:09:58.167872 #1604567] INFO -- : [870/885] 1645441=test_tracer I, [2024-05-07T08:09:58.179560 #1604567] INFO -- : [871/885] 1645441=test_rdoc_markup_attribute_manager I, [2024-05-07T08:09:58.206500 #1604567] INFO -- : [872/885] 1645441=test_wss I, [2024-05-07T08:09:58.225978 #1604567] INFO -- : [873/885] 1645441=test_option I, [2024-05-07T08:09:58.342271 #1604567] INFO -- : [874/885] 1645441=test_objectspace I, [2024-05-07T08:09:59.370744 #1604567] INFO -- : [875/885] 1645441=test_require I, [2024-05-07T08:10:00.105212 #1604567] INFO -- : [876/885] 1645443=test_my_integer I, [2024-05-07T08:10:00.120198 #1604567] INFO -- : [877/885] 1645443=test_gem_resolver_composed_set I, [2024-05-07T08:10:00.151637 #1604567] INFO -- : [878/885] 1645443=test_debugger_integration I, [2024-05-07T08:10:00.169454 #1604567] INFO -- : [879/885] 1645443=test_update I, [2024-05-07T08:10:00.188890 #1604567] INFO -- : [880/885] 1645443=test_cipher I, [2024-05-07T08:10:00.210019 #1604567] INFO -- : [881/885] 1645443=test_new I, [2024-05-07T08:10:00.224622 #1604567] INFO -- : [882/885] 1645443=test_gem_source_lock I, [2024-05-07T08:10:00.277828 #1604567] INFO -- : [883/885] 1645443=test_load I, [2024-05-07T08:10:00.287422 #1604567] INFO -- : [884/885] 1645443=test_rdoc_rd_inline_parser I, [2024-05-07T08:10:00.346260 #1604567] INFO -- : [885/885] 1645443=test_win32ole_type I, [2024-05-07T08:10:01.824807 #1604567] INFO -- : Finished tests in 204.073488s, 128.5517 tests/s, 45816.9314 assertions/s. E, [2024-05-07T08:10:01.825038 #1604567] ERROR -- : Children under /tmp/rubytest.gwwii8: E, [2024-05-07T08:10:01.825194 #1604567] ERROR -- : * drwx------ 4 28 2024-05-07 08:08:51 +0000 gem_rebuild20240507-1645442-599bc6/ E, [2024-05-07T08:10:01.825235 #1604567] ERROR -- : * drwxrwxr-x 2 40 2024-05-07 08:08:51 +0000 old/ E, [2024-05-07T08:10:01.825271 #1604567] ERROR -- : * -rw-rw-r-- 1 4096 2024-05-07 08:08:51 +0000 rebuild_test_gem-1.0.0.gem E, [2024-05-07T08:10:01.825463 #1604567] ERROR -- : * drwxrwxr-x 2 40 2024-05-07 08:08:51 +0000 new/ E, [2024-05-07T08:10:01.826725 #1604567] ERROR -- : * -rw-rw-r-- 1 4096 2024-05-07 08:08:51 +0000 rebuild_test_gem-1.0.0.gem I, [2024-05-07T08:10:01.832364 #1604567] INFO -- : 26234 tests, 9350021 assertions, 0 failures, 0 errors, 320 skips I, [2024-05-07T08:10:01.832397 #1604567] INFO -- : I, [2024-05-07T08:10:01.832407 #1604567] INFO -- : ruby -v: ruby 3.4.0dev (2024-05-07T06:59:36Z master e1e6b4972f) [aarch64-linux] I, [2024-05-07T08:10:01.833561 #1604567] INFO -- : $$$[end] "make yes-test-all TESTOPTS='--stderr-on-failure' TESTS='-j3'" exit with 0. I, [2024-05-07T08:10:01.833730 #1604567] INFO -- : $$$[beg] make yes-test-rubyspec MSPECOPT='--error-output stderr --debug -j' TESTS='-j3' I, [2024-05-07T08:10:01.961589 #1604567] INFO -- : BASERUBY = /usr/local/bin/ruby --disable=gems I, [2024-05-07T08:10:01.961663 #1604567] INFO -- : CC = gcc I, [2024-05-07T08:10:01.961674 #1604567] INFO -- : LD = ld I, [2024-05-07T08:10:01.961683 #1604567] INFO -- : LDSHARED = gcc -shared I, [2024-05-07T08:10:01.961695 #1604567] INFO -- : CFLAGS = -O3 -fno-fast-math -ggdb3 -Wall -Wextra -Wdeprecated-declarations -Wdiv-by-zero -Wduplicated-cond -Wimplicit-function-declaration -Wimplicit-int -Wpointer-arith -Wwrite-strings -Wold-style-definition -Wimplicit-fallthrough=0 -Wmissing-noreturn -Wno-cast-function-type -Wno-constant-logical-operand -Wno-long-long -Wno-missing-field-initializers -Wno-overlength-strings -Wno-packed-bitfield-compat -Wno-parentheses-equality -Wno-self-assign -Wno-tautological-compare -Wno-unused-parameter -Wno-unused-value -Wsuggest-attribute=format -Wsuggest-attribute=noreturn -Wunused-variable -Wmisleading-indentation -Wundef I, [2024-05-07T08:10:01.961704 #1604567] INFO -- : XCFLAGS = -U_FORTIFY_SOURCE -D_FORTIFY_SOURCE=2 -fstack-protector-strong -msign-return-address=all -fno-strict-overflow -fvisibility=hidden -fexcess-precision=standard -DRUBY_EXPORT -fPIE -I. -I.ext/include/aarch64-linux -I/home/opc/ruby/src/master/include -I/home/opc/ruby/src/master -I/home/opc/ruby/src/master/prism -I/home/opc/ruby/src/master/enc/unicode/15.0.0 I, [2024-05-07T08:10:01.961714 #1604567] INFO -- : CPPFLAGS = I, [2024-05-07T08:10:01.961722 #1604567] INFO -- : DLDFLAGS = -Wl,--compress-debug-sections=zlib -fstack-protector-strong -pie I, [2024-05-07T08:10:01.961731 #1604567] INFO -- : SOLIBS = -lz -lrt -lrt -ldl -lcrypt -lm -lpthread I, [2024-05-07T08:10:01.961740 #1604567] INFO -- : LANG = en_US.UTF-8 I, [2024-05-07T08:10:01.961748 #1604567] INFO -- : LC_ALL = I, [2024-05-07T08:10:01.961756 #1604567] INFO -- : LC_CTYPE = I, [2024-05-07T08:10:01.961764 #1604567] INFO -- : MFLAGS = I, [2024-05-07T08:10:01.961771 #1604567] INFO -- : RUSTC = rustc I, [2024-05-07T08:10:01.961779 #1604567] INFO -- : YJIT_RUSTC_ARGS = --crate-name=yjit --crate-type=staticlib --edition=2021 -g -C lto=thin -C opt-level=3 -C overflow-checks=on '--out-dir=/home/opc/ruby/build/master/yjit/target/release/' /home/opc/ruby/src/master/yjit/src/lib.rs I, [2024-05-07T08:10:01.962443 #1604567] INFO -- : gcc (GCC) 8.5.0 20210514 (Red Hat 8.5.0-10.1.0.1) I, [2024-05-07T08:10:01.962462 #1604567] INFO -- : Copyright (C) 2018 Free Software Foundation, Inc. I, [2024-05-07T08:10:01.962471 #1604567] INFO -- : This is free software; see the source for copying conditions. There is NO I, [2024-05-07T08:10:01.962480 #1604567] INFO -- : warranty; not even for MERCHANTABILITY or FITNESS FOR A PARTICULAR PURPOSE. I, [2024-05-07T08:10:01.962489 #1604567] INFO -- : I, [2024-05-07T08:10:01.964468 #1604567] INFO -- : generating enc.mk I, [2024-05-07T08:10:02.198227 #1604567] INFO -- : making enc I, [2024-05-07T08:10:02.225800 #1604567] INFO -- : make[1]: Entering directory '/home/opc/ruby/build/master' I, [2024-05-07T08:10:02.225878 #1604567] INFO -- : make[1]: Nothing to be done for 'enc'. I, [2024-05-07T08:10:02.225898 #1604567] INFO -- : make[1]: Leaving directory '/home/opc/ruby/build/master' I, [2024-05-07T08:10:02.226510 #1604567] INFO -- : making srcs under enc I, [2024-05-07T08:10:02.268531 #1604567] INFO -- : make[1]: Entering directory '/home/opc/ruby/build/master' I, [2024-05-07T08:10:02.268569 #1604567] INFO -- : make[1]: Nothing to be done for 'srcs'. I, [2024-05-07T08:10:02.268579 #1604567] INFO -- : make[1]: Leaving directory '/home/opc/ruby/build/master' I, [2024-05-07T08:10:02.269612 #1604567] INFO -- : generating transdb.h I, [2024-05-07T08:10:02.415597 #1604567] INFO -- : transdb.h unchanged I, [2024-05-07T08:10:02.416873 #1604567] INFO -- : making trans I, [2024-05-07T08:10:02.465559 #1604567] INFO -- : make[1]: Entering directory '/home/opc/ruby/build/master' I, [2024-05-07T08:10:02.465598 #1604567] INFO -- : make[1]: Nothing to be done for 'trans'. I, [2024-05-07T08:10:02.465609 #1604567] INFO -- : make[1]: Leaving directory '/home/opc/ruby/build/master' I, [2024-05-07T08:10:02.466299 #1604567] INFO -- : making encs I, [2024-05-07T08:10:02.519421 #1604567] INFO -- : make[1]: Entering directory '/home/opc/ruby/build/master' I, [2024-05-07T08:10:02.519490 #1604567] INFO -- : make[1]: Nothing to be done for 'encs'. I, [2024-05-07T08:10:02.519508 #1604567] INFO -- : make[1]: Leaving directory '/home/opc/ruby/build/master' I, [2024-05-07T08:10:02.521467 #1604567] INFO -- : generating makefiles ext/configure-ext.mk I, [2024-05-07T08:10:02.561651 #1604567] INFO -- : ext/configure-ext.mk updated I, [2024-05-07T08:10:02.564391 #1604567] INFO -- : make[1]: Entering directory '/home/opc/ruby/build/master' I, [2024-05-07T08:10:04.616430 #1604567] INFO -- : make[1]: Leaving directory '/home/opc/ruby/build/master' I, [2024-05-07T08:10:04.616945 #1604567] INFO -- : generating makefile exts.mk I, [2024-05-07T08:10:04.674745 #1604567] INFO -- : exts.mk unchanged I, [2024-05-07T08:10:04.679726 #1604567] INFO -- : make[1]: Entering directory '/home/opc/ruby/build/master' I, [2024-05-07T08:10:04.972976 #1604567] INFO -- : make[2]: Entering directory '/home/opc/ruby/build/master/ext/coverage' I, [2024-05-07T08:10:04.977575 #1604567] INFO -- : make[2]: Leaving directory '/home/opc/ruby/build/master/ext/coverage' I, [2024-05-07T08:10:04.983113 #1604567] INFO -- : make[2]: Entering directory '/home/opc/ruby/build/master/ext/date' I, [2024-05-07T08:10:04.988415 #1604567] INFO -- : make[2]: Leaving directory '/home/opc/ruby/build/master/ext/date' I, [2024-05-07T08:10:04.992475 #1604567] INFO -- : make[2]: Entering directory '/home/opc/ruby/build/master/ext/digest' I, [2024-05-07T08:10:05.001058 #1604567] INFO -- : make[2]: Leaving directory '/home/opc/ruby/build/master/ext/digest' I, [2024-05-07T08:10:05.023283 #1604567] INFO -- : make[2]: Entering directory '/home/opc/ruby/build/master/ext/digest/sha2' I, [2024-05-07T08:10:05.028180 #1604567] INFO -- : make[2]: Leaving directory '/home/opc/ruby/build/master/ext/digest/sha2' I, [2024-05-07T08:10:05.046258 #1604567] INFO -- : make[2]: Entering directory '/home/opc/ruby/build/master/ext/fiddle' I, [2024-05-07T08:10:05.056294 #1604567] INFO -- : make[2]: Leaving directory '/home/opc/ruby/build/master/ext/fiddle' I, [2024-05-07T08:10:05.060546 #1604567] INFO -- : make[2]: Entering directory '/home/opc/ruby/build/master/ext/io/console' I, [2024-05-07T08:10:05.064664 #1604567] INFO -- : make[2]: Leaving directory '/home/opc/ruby/build/master/ext/io/console' I, [2024-05-07T08:10:05.075701 #1604567] INFO -- : make[2]: Entering directory '/home/opc/ruby/build/master/ext/json' I, [2024-05-07T08:10:05.085083 #1604567] INFO -- : make[2]: Leaving directory '/home/opc/ruby/build/master/ext/json' I, [2024-05-07T08:10:05.097950 #1604567] INFO -- : make[2]: Entering directory '/home/opc/ruby/build/master/ext/monitor' I, [2024-05-07T08:10:05.102080 #1604567] INFO -- : make[2]: Leaving directory '/home/opc/ruby/build/master/ext/monitor' I, [2024-05-07T08:10:05.107974 #1604567] INFO -- : make[2]: Entering directory '/home/opc/ruby/build/master/ext/objspace' I, [2024-05-07T08:10:05.113827 #1604567] INFO -- : make[2]: Leaving directory '/home/opc/ruby/build/master/ext/objspace' I, [2024-05-07T08:10:05.132824 #1604567] INFO -- : make[2]: Entering directory '/home/opc/ruby/build/master/ext/openssl' I, [2024-05-07T08:10:05.154366 #1604567] INFO -- : make[2]: Leaving directory '/home/opc/ruby/build/master/ext/openssl' I, [2024-05-07T08:10:05.158563 #1604567] INFO -- : make[2]: Entering directory '/home/opc/ruby/build/master/ext/pathname' I, [2024-05-07T08:10:05.162750 #1604567] INFO -- : make[2]: Leaving directory '/home/opc/ruby/build/master/ext/pathname' I, [2024-05-07T08:10:05.169027 #1604567] INFO -- : make[2]: Entering directory '/home/opc/ruby/build/master/ext/psych' I, [2024-05-07T08:10:05.190139 #1604567] INFO -- : make[2]: Leaving directory '/home/opc/ruby/build/master/ext/psych' I, [2024-05-07T08:10:05.194434 #1604567] INFO -- : make[2]: Entering directory '/home/opc/ruby/build/master/ext/pty' I, [2024-05-07T08:10:05.198640 #1604567] INFO -- : make[2]: Leaving directory '/home/opc/ruby/build/master/ext/pty' I, [2024-05-07T08:10:05.211840 #1604567] INFO -- : make[2]: Entering directory '/home/opc/ruby/build/master/ext/ripper' I, [2024-05-07T08:10:05.219515 #1604567] INFO -- : make[2]: Leaving directory '/home/opc/ruby/build/master/ext/ripper' I, [2024-05-07T08:10:05.221525 #1604567] INFO -- : make[2]: Entering directory '/home/opc/ruby/build/master/ext/rubyvm' I, [2024-05-07T08:10:05.224822 #1604567] INFO -- : make[2]: Leaving directory '/home/opc/ruby/build/master/ext/rubyvm' I, [2024-05-07T08:10:05.236759 #1604567] INFO -- : make[2]: Entering directory '/home/opc/ruby/build/master/ext/socket' I, [2024-05-07T08:10:05.247365 #1604567] INFO -- : make[2]: Leaving directory '/home/opc/ruby/build/master/ext/socket' I, [2024-05-07T08:10:05.262519 #1604567] INFO -- : make[2]: Entering directory '/home/opc/ruby/build/master/.bundle/gems/bigdecimal-3.1.7/ext/bigdecimal' I, [2024-05-07T08:10:05.293010 #1604567] INFO -- : make[2]: Leaving directory '/home/opc/ruby/build/master/.bundle/gems/bigdecimal-3.1.7/ext/bigdecimal' I, [2024-05-07T08:10:05.295628 #1604567] INFO -- : make[2]: Entering directory '/home/opc/ruby/build/master/.bundle/gems/bigdecimal-3.1.8/ext/bigdecimal' I, [2024-05-07T08:10:05.325587 #1604567] INFO -- : make[2]: Leaving directory '/home/opc/ruby/build/master/.bundle/gems/bigdecimal-3.1.8/ext/bigdecimal' I, [2024-05-07T08:10:05.328103 #1604567] INFO -- : make[2]: Entering directory '/home/opc/ruby/build/master/.bundle/gems/debug-1.9.2/ext/debug' I, [2024-05-07T08:10:05.358212 #1604567] INFO -- : make[2]: Leaving directory '/home/opc/ruby/build/master/.bundle/gems/debug-1.9.2/ext/debug' I, [2024-05-07T08:10:05.360676 #1604567] INFO -- : make[2]: Entering directory '/home/opc/ruby/build/master/.bundle/gems/nkf-0.2.0/ext/nkf' I, [2024-05-07T08:10:05.390636 #1604567] INFO -- : make[2]: Leaving directory '/home/opc/ruby/build/master/.bundle/gems/nkf-0.2.0/ext/nkf' I, [2024-05-07T08:10:05.393202 #1604567] INFO -- : make[2]: Entering directory '/home/opc/ruby/build/master/.bundle/gems/racc-1.7.3/ext/racc/cparse' I, [2024-05-07T08:10:05.422989 #1604567] INFO -- : make[2]: Leaving directory '/home/opc/ruby/build/master/.bundle/gems/racc-1.7.3/ext/racc/cparse' I, [2024-05-07T08:10:05.425948 #1604567] INFO -- : make[2]: Entering directory '/home/opc/ruby/build/master/.bundle/gems/rbs-3.4.4/ext/rbs_extension' I, [2024-05-07T08:10:05.456415 #1604567] INFO -- : make[2]: Leaving directory '/home/opc/ruby/build/master/.bundle/gems/rbs-3.4.4/ext/rbs_extension' I, [2024-05-07T08:10:05.458932 #1604567] INFO -- : make[2]: Entering directory '/home/opc/ruby/build/master/.bundle/gems/syslog-0.1.2/ext/syslog' I, [2024-05-07T08:10:05.489712 #1604567] INFO -- : make[2]: Leaving directory '/home/opc/ruby/build/master/.bundle/gems/syslog-0.1.2/ext/syslog' I, [2024-05-07T08:10:05.528798 #1604567] INFO -- : make[2]: Entering directory '/home/opc/ruby/build/master' I, [2024-05-07T08:10:05.612107 #1604567] INFO -- : make[2]: 'ruby' is up to date. I, [2024-05-07T08:10:05.612184 #1604567] INFO -- : make[2]: Leaving directory '/home/opc/ruby/build/master' I, [2024-05-07T08:10:05.612288 #1604567] INFO -- : make[1]: Leaving directory '/home/opc/ruby/build/master' I, [2024-05-07T08:10:05.616505 #1604567] INFO -- : make[1]: Entering directory '/home/opc/ruby/build/master' I, [2024-05-07T08:10:05.616540 #1604567] INFO -- : make[1]: Nothing to be done for 'note'. I, [2024-05-07T08:10:05.616550 #1604567] INFO -- : make[1]: Leaving directory '/home/opc/ruby/build/master' E, [2024-05-07T08:10:05.692761 #1604567] ERROR -- : $ /home/opc/ruby/build/master/miniruby -I/home/opc/ruby/src/master/lib /home/opc/ruby/src/master/tool/runruby.rb --archdir=/home/opc/ruby/build/master --extout=.ext -- /home/opc/ruby/src/master/spec/mspec/bin/mspec-run -B /home/opc/ruby/src/master/spec/default.mspec --error-output stderr --debug -fy -o /tmp/rubytest.qk7bu6/1-mspec-multi-0 E, [2024-05-07T08:10:05.693129 #1604567] ERROR -- : $ /home/opc/ruby/build/master/miniruby -I/home/opc/ruby/src/master/lib /home/opc/ruby/src/master/tool/runruby.rb --archdir=/home/opc/ruby/build/master --extout=.ext -- /home/opc/ruby/src/master/spec/mspec/bin/mspec-run -B /home/opc/ruby/src/master/spec/default.mspec --error-output stderr --debug -fy -o /tmp/rubytest.qk7bu6/2-mspec-multi-1 E, [2024-05-07T08:10:05.693400 #1604567] ERROR -- : $ /home/opc/ruby/build/master/miniruby -I/home/opc/ruby/src/master/lib /home/opc/ruby/src/master/tool/runruby.rb --archdir=/home/opc/ruby/build/master --extout=.ext -- /home/opc/ruby/src/master/spec/mspec/bin/mspec-run -B /home/opc/ruby/src/master/spec/default.mspec --error-output stderr --debug -fy -o /tmp/rubytest.qk7bu6/3-mspec-multi-2 I, [2024-05-07T08:10:05.822746 #1604567] INFO -- : ruby 3.4.0dev (2024-05-07T06:59:36Z master e1e6b4972f) [aarch64-linux] I, [2024-05-07T08:10:11.103771 #1604567] INFO -- : 0 ......................................................................... I, [2024-05-07T08:10:13.587220 #1604567] INFO -- : 73 ......................................................................... I, [2024-05-07T08:10:13.754466 #1604567] INFO -- : 146 ......................................................................... I, [2024-05-07T08:10:14.050462 #1604567] INFO -- : 219 ......................................................................... I, [2024-05-07T08:10:14.212376 #1604567] INFO -- : 292 ......................................................................... I, [2024-05-07T08:10:14.456910 #1604567] INFO -- : 365 ......................................................................... I, [2024-05-07T08:10:14.577833 #1604567] INFO -- : 438 ......................................................................... I, [2024-05-07T08:10:14.635778 #1604567] INFO -- : 511 ......................................................................... I, [2024-05-07T08:10:14.696581 #1604567] INFO -- : 584 ......................................................................... I, [2024-05-07T08:10:15.298096 #1604567] INFO -- : 657 ......................................................................... I, [2024-05-07T08:10:15.388859 #1604567] INFO -- : 730 ......................................................................... I, [2024-05-07T08:10:15.439199 #1604567] INFO -- : 803 ......................................................................... I, [2024-05-07T08:10:15.644843 #1604567] INFO -- : 876 ......................................................................... I, [2024-05-07T08:10:15.747048 #1604567] INFO -- : 949 ......................................................................... I, [2024-05-07T08:10:16.329887 #1604567] INFO -- : 1022 ......................................................................... I, [2024-05-07T08:10:18.634711 #1604567] INFO -- : 1095 ......................................................................... I, [2024-05-07T08:10:19.456035 #1604567] INFO -- : 1168 ......................................................................... I, [2024-05-07T08:10:19.629225 #1604567] INFO -- : 1241 ......................................................................... I, [2024-05-07T08:10:19.804030 #1604567] INFO -- : 1314 ......................................................................... I, [2024-05-07T08:10:19.907341 #1604567] INFO -- : 1387 ......................................................................... I, [2024-05-07T08:10:21.951075 #1604567] INFO -- : 1460 ......................................................................... I, [2024-05-07T08:10:25.162874 #1604567] INFO -- : 1533 ......................................................................... I, [2024-05-07T08:10:25.342243 #1604567] INFO -- : 1606 ......................................................................... I, [2024-05-07T08:10:26.134952 #1604567] INFO -- : 1679 ......................................................................... I, [2024-05-07T08:10:26.458407 #1604567] INFO -- : 1752 ......................................................................... I, [2024-05-07T08:10:26.721213 #1604567] INFO -- : 1825 ......................................................................... I, [2024-05-07T08:10:27.044027 #1604567] INFO -- : 1898 ......................................................................... I, [2024-05-07T08:10:27.448747 #1604567] INFO -- : 1971 ......................................................................... I, [2024-05-07T08:10:27.959967 #1604567] INFO -- : 2044 ......................................................................... I, [2024-05-07T08:10:28.041469 #1604567] INFO -- : 2117 ......................................................................... I, [2024-05-07T08:10:28.106348 #1604567] INFO -- : 2190 ......................................................................... I, [2024-05-07T08:10:28.150863 #1604567] INFO -- : 2263 ......................................................................... I, [2024-05-07T08:10:28.197815 #1604567] INFO -- : 2336 ......................................................................... I, [2024-05-07T08:10:28.283433 #1604567] INFO -- : 2409 ......................................................................... I, [2024-05-07T08:10:28.543063 #1604567] INFO -- : 2482 ......................................................................... I, [2024-05-07T08:10:28.656930 #1604567] INFO -- : 2555 ......................................................................... I, [2024-05-07T08:10:29.746951 #1604567] INFO -- : 2628 ......................................................................... I, [2024-05-07T08:10:30.006759 #1604567] INFO -- : 2701 ......................................................................... I, [2024-05-07T08:10:30.138479 #1604567] INFO -- : 2774 ......................................................................... I, [2024-05-07T08:10:30.469714 #1604567] INFO -- : 2847 ......................................................................... I, [2024-05-07T08:10:30.735110 #1604567] INFO -- : 2920 ......................................................................... I, [2024-05-07T08:10:30.849736 #1604567] INFO -- : 2993 ......................................................................... I, [2024-05-07T08:10:30.910262 #1604567] INFO -- : 3066 ......................................................................... I, [2024-05-07T08:10:30.968139 #1604567] INFO -- : 3139 ......................................................................... I, [2024-05-07T08:10:31.031725 #1604567] INFO -- : 3212 ......................................................................... I, [2024-05-07T08:10:31.104325 #1604567] INFO -- : 3285 ......................................................................... I, [2024-05-07T08:10:34.935285 #1604567] INFO -- : 3358 ........................................................................ I, [2024-05-07T08:10:34.935358 #1604567] INFO -- : I, [2024-05-07T08:10:34.935369 #1604567] INFO -- : Finished in 29.242477 seconds I, [2024-05-07T08:10:34.935378 #1604567] INFO -- : I, [2024-05-07T08:10:34.935387 #1604567] INFO -- : 3429 files, 32606 examples, 194266 expectations, 0 failures, 0 errors, 0 tagged I, [2024-05-07T08:10:34.936777 #1604567] INFO -- : $$$[end] "make yes-test-rubyspec MSPECOPT='--error-output stderr --debug -j' TESTS='-j3'" exit with 0.