# Logfile created on 2024-05-06 21:46:12 +0000 by logger.rb/v1.5.3 I, [2024-05-06T21:46:12.117002 #4074263] INFO -- : #, @formatter=nil, @logdev=#, @binmode=false, @mon_data=#, @mon_data_owner_object_id=860>>> I, [2024-05-06T21:46:12.117308 #4074263] INFO -- : $$$[beg] make update-unicode -j3 I, [2024-05-06T21:46:12.209295 #4074263] INFO -- : Downloading Unicode emoji 15.0 files... I, [2024-05-06T21:46:12.209553 #4074263] INFO -- : Downloading Unicode emoji 15.0 files... I, [2024-05-06T21:46:12.209744 #4074263] INFO -- : Downloading Unicode emoji 15.0 files... I, [2024-05-06T21:46:12.285868 #4074263] INFO -- : made symlink emoji/15.0/emoji-sequences.txt to /home/opc/ruby/src/master/.downloaded-cache/emoji/15.0/emoji-sequences.txt I, [2024-05-06T21:46:12.286841 #4074263] INFO -- : downloading emoji/15.0/emoji-test.txt ... /home/opc/ruby/src/master/enc/unicode/data/emoji/15.0/emoji-sequences.txt already exists I, [2024-05-06T21:46:12.292995 #4074263] INFO -- : downloading emoji/15.0/emoji-test.txt ... /home/opc/ruby/src/master/enc/unicode/data/emoji/15.0/emoji-sequences.txt already exists E, [2024-05-06T21:46:12.759495 #4074263] ERROR -- : /home/opc/ruby/src/master/tool/downloader.rb:302:in `rescue in download': failed to download emoji/15.0/emoji-test.txt (RuntimeError) E, [2024-05-06T21:46:12.759561 #4074263] ERROR -- : OpenURI::HTTPError: 403 Forbidden: https://www.unicode.org/Public/emoji/15.0/emoji-test.txt E, [2024-05-06T21:46:12.759574 #4074263] ERROR -- : from /home/opc/ruby/src/master/tool/downloader.rb:201:in `download' E, [2024-05-06T21:46:12.759584 #4074263] ERROR -- : from /home/opc/ruby/src/master/tool/downloader.rb:136:in `download' E, [2024-05-06T21:46:12.759593 #4074263] ERROR -- : from /home/opc/ruby/src/master/tool/downloader.rb:482:in `block in
' E, [2024-05-06T21:46:12.759601 #4074263] ERROR -- : from /home/opc/ruby/src/master/tool/downloader.rb:465:in `each' E, [2024-05-06T21:46:12.759609 #4074263] ERROR -- : from /home/opc/ruby/src/master/tool/downloader.rb:465:in `
' E, [2024-05-06T21:46:12.759617 #4074263] ERROR -- : /usr/local/lib/ruby/3.2.0/open-uri.rb:369:in `open_http': 403 Forbidden (OpenURI::HTTPError) E, [2024-05-06T21:46:12.759626 #4074263] ERROR -- : from /usr/local/lib/ruby/3.2.0/open-uri.rb:760:in `buffer_open' E, [2024-05-06T21:46:12.759634 #4074263] ERROR -- : from /usr/local/lib/ruby/3.2.0/open-uri.rb:214:in `block in open_loop' E, [2024-05-06T21:46:12.759642 #4074263] ERROR -- : from /usr/local/lib/ruby/3.2.0/open-uri.rb:212:in `catch' E, [2024-05-06T21:46:12.759650 #4074263] ERROR -- : from /usr/local/lib/ruby/3.2.0/open-uri.rb:212:in `open_loop' E, [2024-05-06T21:46:12.759659 #4074263] ERROR -- : from /usr/local/lib/ruby/3.2.0/open-uri.rb:153:in `open_uri' E, [2024-05-06T21:46:12.759667 #4074263] ERROR -- : from /usr/local/lib/ruby/3.2.0/open-uri.rb:740:in `open' E, [2024-05-06T21:46:12.759678 #4074263] ERROR -- : from /usr/local/lib/ruby/3.2.0/open-uri.rb:748:in `read' E, [2024-05-06T21:46:12.759686 #4074263] ERROR -- : from /home/opc/ruby/src/master/tool/downloader.rb:247:in `block in download' E, [2024-05-06T21:46:12.759695 #4074263] ERROR -- : from /home/opc/ruby/src/master/tool/downloader.rb:378:in `with_retry' E, [2024-05-06T21:46:12.759703 #4074263] ERROR -- : from /home/opc/ruby/src/master/tool/downloader.rb:246:in `download' E, [2024-05-06T21:46:12.759712 #4074263] ERROR -- : from /home/opc/ruby/src/master/tool/downloader.rb:136:in `download' E, [2024-05-06T21:46:12.759720 #4074263] ERROR -- : from /home/opc/ruby/src/master/tool/downloader.rb:482:in `block in
' E, [2024-05-06T21:46:12.759728 #4074263] ERROR -- : from /home/opc/ruby/src/master/tool/downloader.rb:465:in `each' E, [2024-05-06T21:46:12.759736 #4074263] ERROR -- : from /home/opc/ruby/src/master/tool/downloader.rb:465:in `
' E, [2024-05-06T21:46:12.762596 #4074263] ERROR -- : make: *** [uncommon.mk:1787: /home/opc/ruby/src/master/enc/unicode/data/emoji/15.0/emoji-zwj-sequences.txt] Error 1 E, [2024-05-06T21:46:12.762627 #4074263] ERROR -- : make: *** Waiting for unfinished jobs.... E, [2024-05-06T21:46:12.803964 #4074263] ERROR -- : /home/opc/ruby/src/master/tool/downloader.rb:302:in `rescue in download': failed to download emoji/15.0/emoji-test.txt (RuntimeError) E, [2024-05-06T21:46:12.804020 #4074263] ERROR -- : OpenURI::HTTPError: 403 Forbidden: https://www.unicode.org/Public/emoji/15.0/emoji-test.txt E, [2024-05-06T21:46:12.804031 #4074263] ERROR -- : from /home/opc/ruby/src/master/tool/downloader.rb:201:in `download' E, [2024-05-06T21:46:12.804041 #4074263] ERROR -- : from /home/opc/ruby/src/master/tool/downloader.rb:136:in `download' E, [2024-05-06T21:46:12.804050 #4074263] ERROR -- : from /home/opc/ruby/src/master/tool/downloader.rb:482:in `block in
' E, [2024-05-06T21:46:12.804058 #4074263] ERROR -- : from /home/opc/ruby/src/master/tool/downloader.rb:465:in `each' E, [2024-05-06T21:46:12.804066 #4074263] ERROR -- : from /home/opc/ruby/src/master/tool/downloader.rb:465:in `
' E, [2024-05-06T21:46:12.804075 #4074263] ERROR -- : /usr/local/lib/ruby/3.2.0/open-uri.rb:369:in `open_http': 403 Forbidden (OpenURI::HTTPError) E, [2024-05-06T21:46:12.804083 #4074263] ERROR -- : from /usr/local/lib/ruby/3.2.0/open-uri.rb:760:in `buffer_open' E, [2024-05-06T21:46:12.804091 #4074263] ERROR -- : from /usr/local/lib/ruby/3.2.0/open-uri.rb:214:in `block in open_loop' E, [2024-05-06T21:46:12.804099 #4074263] ERROR -- : from /usr/local/lib/ruby/3.2.0/open-uri.rb:212:in `catch' E, [2024-05-06T21:46:12.804107 #4074263] ERROR -- : from /usr/local/lib/ruby/3.2.0/open-uri.rb:212:in `open_loop' E, [2024-05-06T21:46:12.804115 #4074263] ERROR -- : from /usr/local/lib/ruby/3.2.0/open-uri.rb:153:in `open_uri' E, [2024-05-06T21:46:12.804123 #4074263] ERROR -- : from /usr/local/lib/ruby/3.2.0/open-uri.rb:740:in `open' E, [2024-05-06T21:46:12.804132 #4074263] ERROR -- : from /usr/local/lib/ruby/3.2.0/open-uri.rb:748:in `read' E, [2024-05-06T21:46:12.804140 #4074263] ERROR -- : from /home/opc/ruby/src/master/tool/downloader.rb:247:in `block in download' E, [2024-05-06T21:46:12.804148 #4074263] ERROR -- : from /home/opc/ruby/src/master/tool/downloader.rb:378:in `with_retry' E, [2024-05-06T21:46:12.804156 #4074263] ERROR -- : from /home/opc/ruby/src/master/tool/downloader.rb:246:in `download' E, [2024-05-06T21:46:12.804164 #4074263] ERROR -- : from /home/opc/ruby/src/master/tool/downloader.rb:136:in `download' E, [2024-05-06T21:46:12.804173 #4074263] ERROR -- : from /home/opc/ruby/src/master/tool/downloader.rb:482:in `block in
' E, [2024-05-06T21:46:12.804181 #4074263] ERROR -- : from /home/opc/ruby/src/master/tool/downloader.rb:465:in `each' E, [2024-05-06T21:46:12.804189 #4074263] ERROR -- : from /home/opc/ruby/src/master/tool/downloader.rb:465:in `
' E, [2024-05-06T21:46:12.807038 #4074263] ERROR -- : make: *** [uncommon.mk:1787: /home/opc/ruby/src/master/enc/unicode/data/emoji/15.0/emoji-sequences.txt] Error 1 E, [2024-05-06T21:46:12.807085 #4074263] ERROR -- : make: *** Deleting file '/home/opc/ruby/src/master/enc/unicode/data/emoji/15.0/emoji-sequences.txt' E, [2024-05-06T21:46:12.824104 #4074263] ERROR -- : /home/opc/ruby/src/master/tool/downloader.rb:302:in `rescue in download': failed to download emoji/15.0/emoji-test.txt (RuntimeError) E, [2024-05-06T21:46:12.824145 #4074263] ERROR -- : OpenURI::HTTPError: 403 Forbidden: https://www.unicode.org/Public/emoji/15.0/emoji-test.txt E, [2024-05-06T21:46:12.824155 #4074263] ERROR -- : from /home/opc/ruby/src/master/tool/downloader.rb:201:in `download' E, [2024-05-06T21:46:12.824164 #4074263] ERROR -- : from /home/opc/ruby/src/master/tool/downloader.rb:136:in `download' E, [2024-05-06T21:46:12.824173 #4074263] ERROR -- : from /home/opc/ruby/src/master/tool/downloader.rb:482:in `block in
' E, [2024-05-06T21:46:12.824181 #4074263] ERROR -- : from /home/opc/ruby/src/master/tool/downloader.rb:465:in `each' E, [2024-05-06T21:46:12.824189 #4074263] ERROR -- : from /home/opc/ruby/src/master/tool/downloader.rb:465:in `
' E, [2024-05-06T21:46:12.824197 #4074263] ERROR -- : /usr/local/lib/ruby/3.2.0/open-uri.rb:369:in `open_http': 403 Forbidden (OpenURI::HTTPError) E, [2024-05-06T21:46:12.824206 #4074263] ERROR -- : from /usr/local/lib/ruby/3.2.0/open-uri.rb:760:in `buffer_open' E, [2024-05-06T21:46:12.824214 #4074263] ERROR -- : from /usr/local/lib/ruby/3.2.0/open-uri.rb:214:in `block in open_loop' E, [2024-05-06T21:46:12.824222 #4074263] ERROR -- : from /usr/local/lib/ruby/3.2.0/open-uri.rb:212:in `catch' E, [2024-05-06T21:46:12.824230 #4074263] ERROR -- : from /usr/local/lib/ruby/3.2.0/open-uri.rb:212:in `open_loop' E, [2024-05-06T21:46:12.824238 #4074263] ERROR -- : from /usr/local/lib/ruby/3.2.0/open-uri.rb:153:in `open_uri' E, [2024-05-06T21:46:12.824246 #4074263] ERROR -- : from /usr/local/lib/ruby/3.2.0/open-uri.rb:740:in `open' E, [2024-05-06T21:46:12.824254 #4074263] ERROR -- : from /usr/local/lib/ruby/3.2.0/open-uri.rb:748:in `read' E, [2024-05-06T21:46:12.824263 #4074263] ERROR -- : from /home/opc/ruby/src/master/tool/downloader.rb:247:in `block in download' E, [2024-05-06T21:46:12.824271 #4074263] ERROR -- : from /home/opc/ruby/src/master/tool/downloader.rb:378:in `with_retry' E, [2024-05-06T21:46:12.824279 #4074263] ERROR -- : from /home/opc/ruby/src/master/tool/downloader.rb:246:in `download' E, [2024-05-06T21:46:12.824288 #4074263] ERROR -- : from /home/opc/ruby/src/master/tool/downloader.rb:136:in `download' E, [2024-05-06T21:46:12.824296 #4074263] ERROR -- : from /home/opc/ruby/src/master/tool/downloader.rb:482:in `block in
' E, [2024-05-06T21:46:12.824304 #4074263] ERROR -- : from /home/opc/ruby/src/master/tool/downloader.rb:465:in `each' E, [2024-05-06T21:46:12.824312 #4074263] ERROR -- : from /home/opc/ruby/src/master/tool/downloader.rb:465:in `
' E, [2024-05-06T21:46:12.827253 #4074263] ERROR -- : make: *** [uncommon.mk:1787: /home/opc/ruby/src/master/enc/unicode/data/emoji/15.0/emoji-test.txt] Error 1 I, [2024-05-06T21:46:12.827320 #4074263] INFO -- : downloading emoji/15.0/emoji-test.txt ... I, [2024-05-06T21:46:12.827501 #4074263] INFO -- : $$$[end] "make update-unicode -j3" exit with 512. I, [2024-05-06T21:46:12.827534 #4074263] INFO -- : $$$[beg] make update-download -j3 I, [2024-05-06T21:46:12.995885 #4074263] INFO -- : tool/config.guess already exists I, [2024-05-06T21:46:12.995955 #4074263] INFO -- : tool/config.sub already exists I, [2024-05-06T21:46:12.998817 #4074263] INFO -- : Update minitest to ea9caafc0754b1d6236a490d59e624b53209734a I, [2024-05-06T21:46:12.999026 #4074263] INFO -- : Update power_assert to 84e85124c5014a139af39161d484156cfe87a9ed I, [2024-05-06T21:46:12.999130 #4074263] INFO -- : Update rbs to ba7872795d5de04adb8ff500c0e6afdc81a041dd I, [2024-05-06T21:46:13.002280 #4074263] INFO -- : echo ea9caafc0754b1d6236a490d59e624b53209734a | /bin/sh /home/opc/ruby/src/master/tool/ifchange /home/opc/ruby/src/master/.bundle/.timestamp/minitest.revision - I, [2024-05-06T21:46:13.002423 #4074263] INFO -- : echo 84e85124c5014a139af39161d484156cfe87a9ed | /bin/sh /home/opc/ruby/src/master/tool/ifchange /home/opc/ruby/src/master/.bundle/.timestamp/power_assert.revision - I, [2024-05-06T21:46:13.002615 #4074263] INFO -- : echo ba7872795d5de04adb8ff500c0e6afdc81a041dd | /bin/sh /home/opc/ruby/src/master/tool/ifchange /home/opc/ruby/src/master/.bundle/.timestamp/rbs.revision - I, [2024-05-06T21:46:13.008132 #4074263] INFO -- : /home/opc/ruby/src/master/.bundle/.timestamp/minitest.revision unchanged I, [2024-05-06T21:46:13.008200 #4074263] INFO -- : /home/opc/ruby/src/master/.bundle/.timestamp/power_assert.revision unchanged I, [2024-05-06T21:46:13.008213 #4074263] INFO -- : /home/opc/ruby/src/master/.bundle/.timestamp/rbs.revision unchanged I, [2024-05-06T21:46:13.010648 #4074263] INFO -- : Update typeprof to b19a6416da3a05d57fadd6ffdadb382b6d236ca5 I, [2024-05-06T21:46:13.014102 #4074263] INFO -- : echo b19a6416da3a05d57fadd6ffdadb382b6d236ca5 | /bin/sh /home/opc/ruby/src/master/tool/ifchange /home/opc/ruby/src/master/.bundle/.timestamp/typeprof.revision - I, [2024-05-06T21:46:13.019483 #4074263] INFO -- : /home/opc/ruby/src/master/.bundle/.timestamp/typeprof.revision unchanged I, [2024-05-06T21:46:13.097866 #4074263] INFO -- : Building power_assert@84e85124c5014a139af39161d484156cfe87a9ed to /home/opc/ruby/src/master/gems/power_assert-2.0.3.gem I, [2024-05-06T21:46:13.209862 #4074263] INFO -- : Successfully built RubyGem I, [2024-05-06T21:46:13.209918 #4074263] INFO -- : Name: power_assert I, [2024-05-06T21:46:13.209929 #4074263] INFO -- : Version: 2.0.4dev I, [2024-05-06T21:46:13.209937 #4074263] INFO -- : File: power_assert-2.0.4dev.gem I, [2024-05-06T21:46:13.290684 #4074263] INFO -- : $$$[end] "make update-download -j3" exit with 0. I, [2024-05-06T21:46:13.290758 #4074263] INFO -- : $$$[beg] make update-rubyspec -j3 I, [2024-05-06T21:46:13.379478 #4074263] INFO -- : make: Nothing to be done for 'update-rubyspec'. I, [2024-05-06T21:46:13.379614 #4074263] INFO -- : $$$[end] "make update-rubyspec -j3" exit with 0. I, [2024-05-06T21:46:13.379639 #4074263] INFO -- : $$$[beg] make update-src -j3 I, [2024-05-06T21:46:14.439838 #4074263] INFO -- : Already up to date. I, [2024-05-06T21:46:14.454215 #4074263] INFO -- : Latest commit hash = 00b1553dc6 I, [2024-05-06T21:46:14.454804 #4074263] INFO -- : $$$[end] "make update-src -j3" exit with 0. I, [2024-05-06T21:46:14.454854 #4074263] INFO -- : $$$[beg] make after-update -j3 I, [2024-05-06T21:46:14.557091 #4074263] INFO -- : generating /home/opc/ruby/src/master/ext/ripper/eventids2table.c I, [2024-05-06T21:46:14.563759 #4074263] INFO -- : make[1]: Entering directory '/home/opc/ruby/src/master/ext/ripper' I, [2024-05-06T21:46:14.563805 #4074263] INFO -- : make[1]: Nothing to be done for 'src'. I, [2024-05-06T21:46:14.563816 #4074263] INFO -- : make[1]: Leaving directory '/home/opc/ruby/src/master/ext/ripper' I, [2024-05-06T21:46:14.590275 #4074263] INFO -- : /home/opc/ruby/src/master/revision.h updated I, [2024-05-06T21:46:14.591433 #4074263] INFO -- : generating aarch64-linux-fake.rb I, [2024-05-06T21:46:14.648113 #4074263] INFO -- : aarch64-linux-fake.rb updated I, [2024-05-06T21:46:14.649619 #4074263] INFO -- : generating enc.mk I, [2024-05-06T21:46:14.881731 #4074263] INFO -- : making srcs under enc I, [2024-05-06T21:46:14.923838 #4074263] INFO -- : make[1]: Entering directory '/home/opc/ruby/build/master' I, [2024-05-06T21:46:14.923902 #4074263] INFO -- : make[1]: Nothing to be done for 'srcs'. I, [2024-05-06T21:46:14.923913 #4074263] INFO -- : make[1]: Leaving directory '/home/opc/ruby/build/master' I, [2024-05-06T21:46:15.003739 #4074263] INFO -- : Update minitest to ea9caafc0754b1d6236a490d59e624b53209734a I, [2024-05-06T21:46:15.003983 #4074263] INFO -- : Update power_assert to 84e85124c5014a139af39161d484156cfe87a9ed I, [2024-05-06T21:46:15.004122 #4074263] INFO -- : Update rbs to ba7872795d5de04adb8ff500c0e6afdc81a041dd I, [2024-05-06T21:46:15.007282 #4074263] INFO -- : echo 84e85124c5014a139af39161d484156cfe87a9ed | /bin/sh /home/opc/ruby/src/master/tool/ifchange /home/opc/ruby/src/master/.bundle/.timestamp/power_assert.revision - I, [2024-05-06T21:46:15.007597 #4074263] INFO -- : echo ea9caafc0754b1d6236a490d59e624b53209734a | /bin/sh /home/opc/ruby/src/master/tool/ifchange /home/opc/ruby/src/master/.bundle/.timestamp/minitest.revision - I, [2024-05-06T21:46:15.007781 #4074263] INFO -- : echo ba7872795d5de04adb8ff500c0e6afdc81a041dd | /bin/sh /home/opc/ruby/src/master/tool/ifchange /home/opc/ruby/src/master/.bundle/.timestamp/rbs.revision - I, [2024-05-06T21:46:15.013617 #4074263] INFO -- : /home/opc/ruby/src/master/.bundle/.timestamp/power_assert.revision unchanged I, [2024-05-06T21:46:15.013678 #4074263] INFO -- : /home/opc/ruby/src/master/.bundle/.timestamp/minitest.revision unchanged I, [2024-05-06T21:46:15.014203 #4074263] INFO -- : /home/opc/ruby/src/master/.bundle/.timestamp/rbs.revision unchanged I, [2024-05-06T21:46:15.015895 #4074263] INFO -- : Update typeprof to b19a6416da3a05d57fadd6ffdadb382b6d236ca5 I, [2024-05-06T21:46:15.019883 #4074263] INFO -- : echo b19a6416da3a05d57fadd6ffdadb382b6d236ca5 | /bin/sh /home/opc/ruby/src/master/tool/ifchange /home/opc/ruby/src/master/.bundle/.timestamp/typeprof.revision - I, [2024-05-06T21:46:15.025980 #4074263] INFO -- : /home/opc/ruby/src/master/.bundle/.timestamp/typeprof.revision unchanged I, [2024-05-06T21:46:15.103796 #4074263] INFO -- : Building power_assert@84e85124c5014a139af39161d484156cfe87a9ed to /home/opc/ruby/src/master/gems/power_assert-2.0.3.gem I, [2024-05-06T21:46:15.213054 #4074263] INFO -- : Successfully built RubyGem I, [2024-05-06T21:46:15.213114 #4074263] INFO -- : Name: power_assert I, [2024-05-06T21:46:15.213125 #4074263] INFO -- : Version: 2.0.4dev I, [2024-05-06T21:46:15.213134 #4074263] INFO -- : File: power_assert-2.0.4dev.gem I, [2024-05-06T21:46:15.215454 #4074263] INFO -- : Extracting bundle gem power_assert-2.0.3... I, [2024-05-06T21:46:15.316007 #4074263] INFO -- : Try with hash version of bundled gems instead of gems/power_assert-2.0.3.gem. We don't use this gem with release version of Ruby. I, [2024-05-06T21:46:15.326624 #4074263] INFO -- : Unpacked gems/power_assert-2.0.4dev.gem I, [2024-05-06T21:46:15.328567 #4074263] INFO -- : $$$[end] "make after-update -j3" exit with 0. I, [2024-05-06T21:46:15.328718 #4074263] INFO -- : $$$[beg] make miniruby -j3 I, [2024-05-06T21:46:15.417195 #4074263] INFO -- : BASERUBY = /usr/local/bin/ruby --disable=gems I, [2024-05-06T21:46:15.417291 #4074263] INFO -- : CC = gcc I, [2024-05-06T21:46:15.417306 #4074263] INFO -- : LD = ld I, [2024-05-06T21:46:15.417317 #4074263] INFO -- : LDSHARED = gcc -shared I, [2024-05-06T21:46:15.417328 #4074263] INFO -- : CFLAGS = -O3 -fno-fast-math -ggdb3 -Wall -Wextra -Wdeprecated-declarations -Wdiv-by-zero -Wduplicated-cond -Wimplicit-function-declaration -Wimplicit-int -Wpointer-arith -Wwrite-strings -Wold-style-definition -Wimplicit-fallthrough=0 -Wmissing-noreturn -Wno-cast-function-type -Wno-constant-logical-operand -Wno-long-long -Wno-missing-field-initializers -Wno-overlength-strings -Wno-packed-bitfield-compat -Wno-parentheses-equality -Wno-self-assign -Wno-tautological-compare -Wno-unused-parameter -Wno-unused-value -Wsuggest-attribute=format -Wsuggest-attribute=noreturn -Wunused-variable -Wmisleading-indentation -Wundef I, [2024-05-06T21:46:15.417338 #4074263] INFO -- : XCFLAGS = -U_FORTIFY_SOURCE -D_FORTIFY_SOURCE=2 -fstack-protector-strong -msign-return-address=all -fno-strict-overflow -fvisibility=hidden -fexcess-precision=standard -DRUBY_EXPORT -fPIE -I. -I.ext/include/aarch64-linux -I/home/opc/ruby/src/master/include -I/home/opc/ruby/src/master -I/home/opc/ruby/src/master/prism -I/home/opc/ruby/src/master/enc/unicode/15.0.0 I, [2024-05-06T21:46:15.417347 #4074263] INFO -- : CPPFLAGS = I, [2024-05-06T21:46:15.417355 #4074263] INFO -- : DLDFLAGS = -Wl,--compress-debug-sections=zlib -fstack-protector-strong -pie I, [2024-05-06T21:46:15.417389 #4074263] INFO -- : SOLIBS = -lz -lrt -lrt -ldl -lcrypt -lm -lpthread I, [2024-05-06T21:46:15.417397 #4074263] INFO -- : LANG = en_US.UTF-8 I, [2024-05-06T21:46:15.417405 #4074263] INFO -- : LC_ALL = I, [2024-05-06T21:46:15.417413 #4074263] INFO -- : LC_CTYPE = I, [2024-05-06T21:46:15.417421 #4074263] INFO -- : MFLAGS = -j3 --jobserver-auth=4,5 I, [2024-05-06T21:46:15.417429 #4074263] INFO -- : RUSTC = rustc I, [2024-05-06T21:46:15.417437 #4074263] INFO -- : YJIT_RUSTC_ARGS = --crate-name=yjit --crate-type=staticlib --edition=2021 -g -C lto=thin -C opt-level=3 -C overflow-checks=on '--out-dir=/home/opc/ruby/build/master/yjit/target/release/' /home/opc/ruby/src/master/yjit/src/lib.rs I, [2024-05-06T21:46:15.418218 #4074263] INFO -- : gcc (GCC) 8.5.0 20210514 (Red Hat 8.5.0-10.1.0.1) I, [2024-05-06T21:46:15.418252 #4074263] INFO -- : Copyright (C) 2018 Free Software Foundation, Inc. I, [2024-05-06T21:46:15.418263 #4074263] INFO -- : This is free software; see the source for copying conditions. There is NO I, [2024-05-06T21:46:15.418272 #4074263] INFO -- : warranty; not even for MERCHANTABILITY or FITNESS FOR A PARTICULAR PURPOSE. I, [2024-05-06T21:46:15.418281 #4074263] INFO -- : I, [2024-05-06T21:46:15.442944 #4074263] INFO -- : compiling /home/opc/ruby/src/master/version.c I, [2024-05-06T21:46:15.584282 #4074263] INFO -- : linking miniruby I, [2024-05-06T21:46:16.489135 #4074263] INFO -- : $$$[end] "make miniruby -j3" exit with 0. I, [2024-05-06T21:46:16.489335 #4074263] INFO -- : $$$[beg] make ruby -j3 I, [2024-05-06T21:46:16.577707 #4074263] INFO -- : BASERUBY = /usr/local/bin/ruby --disable=gems I, [2024-05-06T21:46:16.577774 #4074263] INFO -- : CC = gcc I, [2024-05-06T21:46:16.577784 #4074263] INFO -- : LD = ld I, [2024-05-06T21:46:16.577793 #4074263] INFO -- : LDSHARED = gcc -shared I, [2024-05-06T21:46:16.577802 #4074263] INFO -- : CFLAGS = -O3 -fno-fast-math -ggdb3 -Wall -Wextra -Wdeprecated-declarations -Wdiv-by-zero -Wduplicated-cond -Wimplicit-function-declaration -Wimplicit-int -Wpointer-arith -Wwrite-strings -Wold-style-definition -Wimplicit-fallthrough=0 -Wmissing-noreturn -Wno-cast-function-type -Wno-constant-logical-operand -Wno-long-long -Wno-missing-field-initializers -Wno-overlength-strings -Wno-packed-bitfield-compat -Wno-parentheses-equality -Wno-self-assign -Wno-tautological-compare -Wno-unused-parameter -Wno-unused-value -Wsuggest-attribute=format -Wsuggest-attribute=noreturn -Wunused-variable -Wmisleading-indentation -Wundef I, [2024-05-06T21:46:16.577813 #4074263] INFO -- : XCFLAGS = -U_FORTIFY_SOURCE -D_FORTIFY_SOURCE=2 -fstack-protector-strong -msign-return-address=all -fno-strict-overflow -fvisibility=hidden -fexcess-precision=standard -DRUBY_EXPORT -fPIE -I. -I.ext/include/aarch64-linux -I/home/opc/ruby/src/master/include -I/home/opc/ruby/src/master -I/home/opc/ruby/src/master/prism -I/home/opc/ruby/src/master/enc/unicode/15.0.0 I, [2024-05-06T21:46:16.577822 #4074263] INFO -- : CPPFLAGS = I, [2024-05-06T21:46:16.577830 #4074263] INFO -- : DLDFLAGS = -Wl,--compress-debug-sections=zlib -fstack-protector-strong -pie I, [2024-05-06T21:46:16.577840 #4074263] INFO -- : SOLIBS = -lz -lrt -lrt -ldl -lcrypt -lm -lpthread I, [2024-05-06T21:46:16.577848 #4074263] INFO -- : LANG = en_US.UTF-8 I, [2024-05-06T21:46:16.577856 #4074263] INFO -- : LC_ALL = I, [2024-05-06T21:46:16.577864 #4074263] INFO -- : LC_CTYPE = I, [2024-05-06T21:46:16.577888 #4074263] INFO -- : MFLAGS = -j3 --jobserver-auth=4,5 I, [2024-05-06T21:46:16.577899 #4074263] INFO -- : RUSTC = rustc I, [2024-05-06T21:46:16.577907 #4074263] INFO -- : YJIT_RUSTC_ARGS = --crate-name=yjit --crate-type=staticlib --edition=2021 -g -C lto=thin -C opt-level=3 -C overflow-checks=on '--out-dir=/home/opc/ruby/build/master/yjit/target/release/' /home/opc/ruby/src/master/yjit/src/lib.rs I, [2024-05-06T21:46:16.578676 #4074263] INFO -- : gcc (GCC) 8.5.0 20210514 (Red Hat 8.5.0-10.1.0.1) I, [2024-05-06T21:46:16.578711 #4074263] INFO -- : Copyright (C) 2018 Free Software Foundation, Inc. I, [2024-05-06T21:46:16.578726 #4074263] INFO -- : This is free software; see the source for copying conditions. There is NO I, [2024-05-06T21:46:16.578736 #4074263] INFO -- : warranty; not even for MERCHANTABILITY or FITNESS FOR A PARTICULAR PURPOSE. I, [2024-05-06T21:46:16.578744 #4074263] INFO -- : I, [2024-05-06T21:46:16.762543 #4074263] INFO -- : builtin_binary.inc updated I, [2024-05-06T21:46:16.766063 #4074263] INFO -- : c5234a9416e4f20f175185e840b25b0f08674d14078ed7083f37e655458e3ca9 builtin_binary.inc I, [2024-05-06T21:46:16.767281 #4074263] INFO -- : compiling /home/opc/ruby/src/master/builtin.c I, [2024-05-06T21:46:17.091317 #4074263] INFO -- : linking static-library libruby-static.a I, [2024-05-06T21:46:19.608710 #4074263] INFO -- : linking ruby I, [2024-05-06T21:46:20.517098 #4074263] INFO -- : $$$[end] "make ruby -j3" exit with 0. I, [2024-05-06T21:46:20.517294 #4074263] INFO -- : $$$[beg] make all -j3 I, [2024-05-06T21:46:20.606123 #4074263] INFO -- : BASERUBY = /usr/local/bin/ruby --disable=gems I, [2024-05-06T21:46:20.606190 #4074263] INFO -- : CC = gcc I, [2024-05-06T21:46:20.606201 #4074263] INFO -- : LD = ld I, [2024-05-06T21:46:20.606210 #4074263] INFO -- : LDSHARED = gcc -shared I, [2024-05-06T21:46:20.606221 #4074263] INFO -- : CFLAGS = -O3 -fno-fast-math -ggdb3 -Wall -Wextra -Wdeprecated-declarations -Wdiv-by-zero -Wduplicated-cond -Wimplicit-function-declaration -Wimplicit-int -Wpointer-arith -Wwrite-strings -Wold-style-definition -Wimplicit-fallthrough=0 -Wmissing-noreturn -Wno-cast-function-type -Wno-constant-logical-operand -Wno-long-long -Wno-missing-field-initializers -Wno-overlength-strings -Wno-packed-bitfield-compat -Wno-parentheses-equality -Wno-self-assign -Wno-tautological-compare -Wno-unused-parameter -Wno-unused-value -Wsuggest-attribute=format -Wsuggest-attribute=noreturn -Wunused-variable -Wmisleading-indentation -Wundef I, [2024-05-06T21:46:20.606230 #4074263] INFO -- : XCFLAGS = -U_FORTIFY_SOURCE -D_FORTIFY_SOURCE=2 -fstack-protector-strong -msign-return-address=all -fno-strict-overflow -fvisibility=hidden -fexcess-precision=standard -DRUBY_EXPORT -fPIE -I. -I.ext/include/aarch64-linux -I/home/opc/ruby/src/master/include -I/home/opc/ruby/src/master -I/home/opc/ruby/src/master/prism -I/home/opc/ruby/src/master/enc/unicode/15.0.0 I, [2024-05-06T21:46:20.606239 #4074263] INFO -- : CPPFLAGS = I, [2024-05-06T21:46:20.606247 #4074263] INFO -- : DLDFLAGS = -Wl,--compress-debug-sections=zlib -fstack-protector-strong -pie I, [2024-05-06T21:46:20.606256 #4074263] INFO -- : SOLIBS = -lz -lrt -lrt -ldl -lcrypt -lm -lpthread I, [2024-05-06T21:46:20.606264 #4074263] INFO -- : LANG = en_US.UTF-8 I, [2024-05-06T21:46:20.606272 #4074263] INFO -- : LC_ALL = I, [2024-05-06T21:46:20.606279 #4074263] INFO -- : LC_CTYPE = I, [2024-05-06T21:46:20.606287 #4074263] INFO -- : MFLAGS = -j3 --jobserver-auth=4,5 I, [2024-05-06T21:46:20.606295 #4074263] INFO -- : RUSTC = rustc I, [2024-05-06T21:46:20.606303 #4074263] INFO -- : YJIT_RUSTC_ARGS = --crate-name=yjit --crate-type=staticlib --edition=2021 -g -C lto=thin -C opt-level=3 -C overflow-checks=on '--out-dir=/home/opc/ruby/build/master/yjit/target/release/' /home/opc/ruby/src/master/yjit/src/lib.rs I, [2024-05-06T21:46:20.607031 #4074263] INFO -- : gcc (GCC) 8.5.0 20210514 (Red Hat 8.5.0-10.1.0.1) I, [2024-05-06T21:46:20.607066 #4074263] INFO -- : Copyright (C) 2018 Free Software Foundation, Inc. I, [2024-05-06T21:46:20.607076 #4074263] INFO -- : This is free software; see the source for copying conditions. There is NO I, [2024-05-06T21:46:20.607086 #4074263] INFO -- : warranty; not even for MERCHANTABILITY or FITNESS FOR A PARTICULAR PURPOSE. I, [2024-05-06T21:46:20.607094 #4074263] INFO -- : I, [2024-05-06T21:46:20.640677 #4074263] INFO -- : generating enc.mk I, [2024-05-06T21:46:20.884189 #4074263] INFO -- : making srcs under enc I, [2024-05-06T21:46:20.884308 #4074263] INFO -- : making enc I, [2024-05-06T21:46:20.911664 #4074263] INFO -- : make[1]: Entering directory '/home/opc/ruby/build/master' I, [2024-05-06T21:46:20.911739 #4074263] INFO -- : make[1]: Nothing to be done for 'enc'. I, [2024-05-06T21:46:20.911750 #4074263] INFO -- : make[1]: Leaving directory '/home/opc/ruby/build/master' I, [2024-05-06T21:46:20.926308 #4074263] INFO -- : make[1]: Entering directory '/home/opc/ruby/build/master' I, [2024-05-06T21:46:20.926367 #4074263] INFO -- : make[1]: Nothing to be done for 'srcs'. I, [2024-05-06T21:46:20.926378 #4074263] INFO -- : make[1]: Leaving directory '/home/opc/ruby/build/master' I, [2024-05-06T21:46:20.927230 #4074263] INFO -- : generating transdb.h I, [2024-05-06T21:46:21.071751 #4074263] INFO -- : transdb.h unchanged I, [2024-05-06T21:46:21.073046 #4074263] INFO -- : generating makefiles ext/configure-ext.mk I, [2024-05-06T21:46:21.073284 #4074263] INFO -- : making trans I, [2024-05-06T21:46:21.112577 #4074263] INFO -- : ext/configure-ext.mk updated I, [2024-05-06T21:46:21.115855 #4074263] INFO -- : make[1]: Entering directory '/home/opc/ruby/build/master' I, [2024-05-06T21:46:21.121773 #4074263] INFO -- : make[1]: Entering directory '/home/opc/ruby/build/master' I, [2024-05-06T21:46:21.121823 #4074263] INFO -- : make[1]: Nothing to be done for 'trans'. I, [2024-05-06T21:46:21.121834 #4074263] INFO -- : make[1]: Leaving directory '/home/opc/ruby/build/master' I, [2024-05-06T21:46:21.696919 #4074263] INFO -- : making encs I, [2024-05-06T21:46:21.755869 #4074263] INFO -- : make[1]: Entering directory '/home/opc/ruby/build/master' I, [2024-05-06T21:46:21.755943 #4074263] INFO -- : make[1]: Nothing to be done for 'encs'. I, [2024-05-06T21:46:21.755954 #4074263] INFO -- : make[1]: Leaving directory '/home/opc/ruby/build/master' I, [2024-05-06T21:46:21.831463 #4074263] INFO -- : make[1]: Leaving directory '/home/opc/ruby/build/master' I, [2024-05-06T21:46:21.832137 #4074263] INFO -- : generating makefile exts.mk I, [2024-05-06T21:46:21.891032 #4074263] INFO -- : exts.mk unchanged I, [2024-05-06T21:46:21.895897 #4074263] INFO -- : make[1]: Entering directory '/home/opc/ruby/build/master' I, [2024-05-06T21:46:22.002669 #4074263] INFO -- : make[2]: Entering directory '/home/opc/ruby/build/master/ext/coverage' I, [2024-05-06T21:46:22.003452 #4074263] INFO -- : make[2]: Entering directory '/home/opc/ruby/build/master/ext/date' I, [2024-05-06T21:46:22.005503 #4074263] INFO -- : make[2]: Entering directory '/home/opc/ruby/build/master/ext/digest' I, [2024-05-06T21:46:22.009622 #4074263] INFO -- : make[2]: Leaving directory '/home/opc/ruby/build/master/ext/date' I, [2024-05-06T21:46:22.009668 #4074263] INFO -- : make[2]: Leaving directory '/home/opc/ruby/build/master/ext/coverage' I, [2024-05-06T21:46:22.013910 #4074263] INFO -- : make[2]: Leaving directory '/home/opc/ruby/build/master/ext/digest' I, [2024-05-06T21:46:22.020622 #4074263] INFO -- : make[2]: Entering directory '/home/opc/ruby/build/master/ext/io/console' I, [2024-05-06T21:46:22.021322 #4074263] INFO -- : make[2]: Entering directory '/home/opc/ruby/build/master/ext/fiddle' I, [2024-05-06T21:46:22.027045 #4074263] INFO -- : make[2]: Leaving directory '/home/opc/ruby/build/master/ext/io/console' I, [2024-05-06T21:46:22.028024 #4074263] INFO -- : make[2]: Entering directory '/home/opc/ruby/build/master/ext/json' I, [2024-05-06T21:46:22.031103 #4074263] INFO -- : make[2]: Entering directory '/home/opc/ruby/build/master/ext/monitor' I, [2024-05-06T21:46:22.031638 #4074263] INFO -- : make[2]: Leaving directory '/home/opc/ruby/build/master/ext/fiddle' I, [2024-05-06T21:46:22.037763 #4074263] INFO -- : make[2]: Entering directory '/home/opc/ruby/build/master/ext/objspace' I, [2024-05-06T21:46:22.038117 #4074263] INFO -- : make[2]: Leaving directory '/home/opc/ruby/build/master/ext/monitor' I, [2024-05-06T21:46:22.041783 #4074263] INFO -- : make[2]: Leaving directory '/home/opc/ruby/build/master/ext/json' I, [2024-05-06T21:46:22.043810 #4074263] INFO -- : make[2]: Leaving directory '/home/opc/ruby/build/master/ext/objspace' I, [2024-05-06T21:46:22.045847 #4074263] INFO -- : make[2]: Entering directory '/home/opc/ruby/build/master/ext/pathname' I, [2024-05-06T21:46:22.050098 #4074263] INFO -- : make[2]: Entering directory '/home/opc/ruby/build/master/ext/psych' I, [2024-05-06T21:46:22.053646 #4074263] INFO -- : make[2]: Leaving directory '/home/opc/ruby/build/master/ext/pathname' I, [2024-05-06T21:46:22.057163 #4074263] INFO -- : make[2]: Entering directory '/home/opc/ruby/build/master/ext/openssl' I, [2024-05-06T21:46:22.064669 #4074263] INFO -- : make[2]: Entering directory '/home/opc/ruby/build/master/ext/pty' I, [2024-05-06T21:46:22.067029 #4074263] INFO -- : make[2]: Leaving directory '/home/opc/ruby/build/master/ext/psych' I, [2024-05-06T21:46:22.069125 #4074263] INFO -- : make[2]: Leaving directory '/home/opc/ruby/build/master/ext/pty' I, [2024-05-06T21:46:22.075460 #4074263] INFO -- : make[2]: Entering directory '/home/opc/ruby/build/master/ext/rubyvm' I, [2024-05-06T21:46:22.077048 #4074263] INFO -- : make[2]: Entering directory '/home/opc/ruby/build/master/ext/ripper' I, [2024-05-06T21:46:22.079052 #4074263] INFO -- : make[2]: Leaving directory '/home/opc/ruby/build/master/ext/rubyvm' I, [2024-05-06T21:46:22.079250 #4074263] INFO -- : make[2]: Leaving directory '/home/opc/ruby/build/master/ext/openssl' I, [2024-05-06T21:46:22.083667 #4074263] INFO -- : make[2]: Leaving directory '/home/opc/ruby/build/master/ext/ripper' I, [2024-05-06T21:46:22.090478 #4074263] INFO -- : make[2]: Entering directory '/home/opc/ruby/build/master/.bundle/gems/bigdecimal-3.1.7/ext/bigdecimal' I, [2024-05-06T21:46:22.090562 #4074263] INFO -- : make[2]: Entering directory '/home/opc/ruby/build/master/.bundle/gems/debug-1.9.2/ext/debug' I, [2024-05-06T21:46:22.091388 #4074263] INFO -- : make[2]: Entering directory '/home/opc/ruby/build/master/ext/socket' I, [2024-05-06T21:46:22.102356 #4074263] INFO -- : make[2]: Leaving directory '/home/opc/ruby/build/master/ext/socket' I, [2024-05-06T21:46:22.104653 #4074263] INFO -- : make[2]: Entering directory '/home/opc/ruby/build/master/.bundle/gems/nkf-0.2.0/ext/nkf' I, [2024-05-06T21:46:22.122036 #4074263] INFO -- : make[2]: Leaving directory '/home/opc/ruby/build/master/.bundle/gems/bigdecimal-3.1.7/ext/bigdecimal' I, [2024-05-06T21:46:22.122644 #4074263] INFO -- : make[2]: Leaving directory '/home/opc/ruby/build/master/.bundle/gems/debug-1.9.2/ext/debug' I, [2024-05-06T21:46:22.124947 #4074263] INFO -- : make[2]: Entering directory '/home/opc/ruby/build/master/.bundle/gems/racc-1.7.3/ext/racc/cparse' I, [2024-05-06T21:46:22.127647 #4074263] INFO -- : make[2]: Entering directory '/home/opc/ruby/build/master/.bundle/gems/rbs-3.4.4/ext/rbs_extension' I, [2024-05-06T21:46:22.139164 #4074263] INFO -- : make[2]: Leaving directory '/home/opc/ruby/build/master/.bundle/gems/nkf-0.2.0/ext/nkf' I, [2024-05-06T21:46:22.143882 #4074263] INFO -- : make[2]: Entering directory '/home/opc/ruby/build/master/.bundle/gems/syslog-0.1.2/ext/syslog' I, [2024-05-06T21:46:22.155142 #4074263] INFO -- : make[2]: Leaving directory '/home/opc/ruby/build/master/.bundle/gems/racc-1.7.3/ext/racc/cparse' I, [2024-05-06T21:46:22.163645 #4074263] INFO -- : make[2]: Leaving directory '/home/opc/ruby/build/master/.bundle/gems/rbs-3.4.4/ext/rbs_extension' I, [2024-05-06T21:46:22.173670 #4074263] INFO -- : make[2]: Entering directory '/home/opc/ruby/build/master/ext/digest/sha2' I, [2024-05-06T21:46:22.175779 #4074263] INFO -- : make[2]: Leaving directory '/home/opc/ruby/build/master/.bundle/gems/syslog-0.1.2/ext/syslog' I, [2024-05-06T21:46:22.178257 #4074263] INFO -- : make[2]: Leaving directory '/home/opc/ruby/build/master/ext/digest/sha2' I, [2024-05-06T21:46:22.220153 #4074263] INFO -- : make[2]: Entering directory '/home/opc/ruby/build/master' I, [2024-05-06T21:46:22.303424 #4074263] INFO -- : make[2]: 'ruby' is up to date. I, [2024-05-06T21:46:22.303498 #4074263] INFO -- : make[2]: Leaving directory '/home/opc/ruby/build/master' I, [2024-05-06T21:46:22.303664 #4074263] INFO -- : make[1]: Leaving directory '/home/opc/ruby/build/master' I, [2024-05-06T21:46:22.308074 #4074263] INFO -- : make[1]: Entering directory '/home/opc/ruby/build/master' I, [2024-05-06T21:46:22.308115 #4074263] INFO -- : make[1]: Nothing to be done for 'note'. I, [2024-05-06T21:46:22.308126 #4074263] INFO -- : make[1]: Leaving directory '/home/opc/ruby/build/master' I, [2024-05-06T21:46:22.308412 #4074263] INFO -- : $$$[end] "make all -j3" exit with 0. I, [2024-05-06T21:46:22.308579 #4074263] INFO -- : $$$[beg] make install -j3 I, [2024-05-06T21:46:22.402529 #4074263] INFO -- : Update minitest to ea9caafc0754b1d6236a490d59e624b53209734a I, [2024-05-06T21:46:22.402737 #4074263] INFO -- : Update power_assert to 84e85124c5014a139af39161d484156cfe87a9ed I, [2024-05-06T21:46:22.402929 #4074263] INFO -- : Update rbs to ba7872795d5de04adb8ff500c0e6afdc81a041dd I, [2024-05-06T21:46:22.405866 #4074263] INFO -- : echo ea9caafc0754b1d6236a490d59e624b53209734a | /bin/sh /home/opc/ruby/src/master/tool/ifchange /home/opc/ruby/src/master/.bundle/.timestamp/minitest.revision - I, [2024-05-06T21:46:22.406060 #4074263] INFO -- : echo 84e85124c5014a139af39161d484156cfe87a9ed | /bin/sh /home/opc/ruby/src/master/tool/ifchange /home/opc/ruby/src/master/.bundle/.timestamp/power_assert.revision - I, [2024-05-06T21:46:22.407947 #4074263] INFO -- : echo ba7872795d5de04adb8ff500c0e6afdc81a041dd | /bin/sh /home/opc/ruby/src/master/tool/ifchange /home/opc/ruby/src/master/.bundle/.timestamp/rbs.revision - I, [2024-05-06T21:46:22.411675 #4074263] INFO -- : /home/opc/ruby/src/master/.bundle/.timestamp/power_assert.revision unchanged I, [2024-05-06T21:46:22.411833 #4074263] INFO -- : /home/opc/ruby/src/master/.bundle/.timestamp/minitest.revision unchanged I, [2024-05-06T21:46:22.413700 #4074263] INFO -- : /home/opc/ruby/src/master/.bundle/.timestamp/rbs.revision unchanged I, [2024-05-06T21:46:22.415630 #4074263] INFO -- : Update typeprof to b19a6416da3a05d57fadd6ffdadb382b6d236ca5 I, [2024-05-06T21:46:22.417120 #4074263] INFO -- : BASERUBY = /usr/local/bin/ruby --disable=gems I, [2024-05-06T21:46:22.417187 #4074263] INFO -- : CC = gcc I, [2024-05-06T21:46:22.417319 #4074263] INFO -- : LD = ld I, [2024-05-06T21:46:22.417367 #4074263] INFO -- : LDSHARED = gcc -shared I, [2024-05-06T21:46:22.417379 #4074263] INFO -- : CFLAGS = -O3 -fno-fast-math -ggdb3 -Wall -Wextra -Wdeprecated-declarations -Wdiv-by-zero -Wduplicated-cond -Wimplicit-function-declaration -Wimplicit-int -Wpointer-arith -Wwrite-strings -Wold-style-definition -Wimplicit-fallthrough=0 -Wmissing-noreturn -Wno-cast-function-type -Wno-constant-logical-operand -Wno-long-long -Wno-missing-field-initializers -Wno-overlength-strings -Wno-packed-bitfield-compat -Wno-parentheses-equality -Wno-self-assign -Wno-tautological-compare -Wno-unused-parameter -Wno-unused-value -Wsuggest-attribute=format -Wsuggest-attribute=noreturn -Wunused-variable -Wmisleading-indentation -Wundef I, [2024-05-06T21:46:22.417414 #4074263] INFO -- : XCFLAGS = -U_FORTIFY_SOURCE -D_FORTIFY_SOURCE=2 -fstack-protector-strong -msign-return-address=all -fno-strict-overflow -fvisibility=hidden -fexcess-precision=standard -DRUBY_EXPORT -fPIE -I. -I.ext/include/aarch64-linux -I/home/opc/ruby/src/master/include -I/home/opc/ruby/src/master -I/home/opc/ruby/src/master/prism -I/home/opc/ruby/src/master/enc/unicode/15.0.0 I, [2024-05-06T21:46:22.417424 #4074263] INFO -- : CPPFLAGS = I, [2024-05-06T21:46:22.417432 #4074263] INFO -- : DLDFLAGS = -Wl,--compress-debug-sections=zlib -fstack-protector-strong -pie I, [2024-05-06T21:46:22.417440 #4074263] INFO -- : SOLIBS = -lz -lrt -lrt -ldl -lcrypt -lm -lpthread I, [2024-05-06T21:46:22.417448 #4074263] INFO -- : LANG = en_US.UTF-8 I, [2024-05-06T21:46:22.417456 #4074263] INFO -- : LC_ALL = I, [2024-05-06T21:46:22.417464 #4074263] INFO -- : LC_CTYPE = I, [2024-05-06T21:46:22.417472 #4074263] INFO -- : MFLAGS = -j3 --jobserver-auth=4,5 I, [2024-05-06T21:46:22.417479 #4074263] INFO -- : RUSTC = rustc I, [2024-05-06T21:46:22.417487 #4074263] INFO -- : YJIT_RUSTC_ARGS = --crate-name=yjit --crate-type=staticlib --edition=2021 -g -C lto=thin -C opt-level=3 -C overflow-checks=on '--out-dir=/home/opc/ruby/build/master/yjit/target/release/' /home/opc/ruby/src/master/yjit/src/lib.rs I, [2024-05-06T21:46:22.448950 #4074263] INFO -- : echo b19a6416da3a05d57fadd6ffdadb382b6d236ca5 | /bin/sh /home/opc/ruby/src/master/tool/ifchange /home/opc/ruby/src/master/.bundle/.timestamp/typeprof.revision - I, [2024-05-06T21:46:22.449881 #4074263] INFO -- : gcc (GCC) 8.5.0 20210514 (Red Hat 8.5.0-10.1.0.1) I, [2024-05-06T21:46:22.449919 #4074263] INFO -- : Copyright (C) 2018 Free Software Foundation, Inc. I, [2024-05-06T21:46:22.449930 #4074263] INFO -- : This is free software; see the source for copying conditions. There is NO I, [2024-05-06T21:46:22.449939 #4074263] INFO -- : warranty; not even for MERCHANTABILITY or FITNESS FOR A PARTICULAR PURPOSE. I, [2024-05-06T21:46:22.449948 #4074263] INFO -- : I, [2024-05-06T21:46:22.450601 #4074263] INFO -- : generating enc.mk I, [2024-05-06T21:46:22.454194 #4074263] INFO -- : /home/opc/ruby/src/master/.bundle/.timestamp/typeprof.revision unchanged I, [2024-05-06T21:46:22.773403 #4074263] INFO -- : making srcs under enc I, [2024-05-06T21:46:22.776418 #4074263] INFO -- : making enc I, [2024-05-06T21:46:22.778475 #4074263] INFO -- : Building power_assert@84e85124c5014a139af39161d484156cfe87a9ed to /home/opc/ruby/src/master/gems/power_assert-2.0.3.gem I, [2024-05-06T21:46:22.803415 #4074263] INFO -- : make[1]: Entering directory '/home/opc/ruby/build/master' I, [2024-05-06T21:46:22.803474 #4074263] INFO -- : make[1]: Nothing to be done for 'enc'. I, [2024-05-06T21:46:22.803485 #4074263] INFO -- : make[1]: Leaving directory '/home/opc/ruby/build/master' I, [2024-05-06T21:46:22.815224 #4074263] INFO -- : make[1]: Entering directory '/home/opc/ruby/build/master' I, [2024-05-06T21:46:22.815279 #4074263] INFO -- : make[1]: Nothing to be done for 'srcs'. I, [2024-05-06T21:46:22.815290 #4074263] INFO -- : make[1]: Leaving directory '/home/opc/ruby/build/master' I, [2024-05-06T21:46:22.816041 #4074263] INFO -- : generating transdb.h I, [2024-05-06T21:46:22.891847 #4074263] INFO -- : Successfully built RubyGem I, [2024-05-06T21:46:22.891905 #4074263] INFO -- : Name: power_assert I, [2024-05-06T21:46:22.891915 #4074263] INFO -- : Version: 2.0.4dev I, [2024-05-06T21:46:22.891926 #4074263] INFO -- : File: power_assert-2.0.4dev.gem I, [2024-05-06T21:46:22.894228 #4074263] INFO -- : Extracting bundle gem power_assert-2.0.3... I, [2024-05-06T21:46:22.959222 #4074263] INFO -- : transdb.h unchanged I, [2024-05-06T21:46:22.960561 #4074263] INFO -- : generating makefiles ext/configure-ext.mk I, [2024-05-06T21:46:22.960702 #4074263] INFO -- : making trans I, [2024-05-06T21:46:22.993562 #4074263] INFO -- : Try with hash version of bundled gems instead of gems/power_assert-2.0.3.gem. We don't use this gem with release version of Ruby. I, [2024-05-06T21:46:23.000844 #4074263] INFO -- : ext/configure-ext.mk unchanged I, [2024-05-06T21:46:23.003748 #4074263] INFO -- : make[1]: Entering directory '/home/opc/ruby/build/master' I, [2024-05-06T21:46:23.004755 #4074263] INFO -- : Unpacked gems/power_assert-2.0.4dev.gem I, [2024-05-06T21:46:23.009918 #4074263] INFO -- : make[1]: Entering directory '/home/opc/ruby/build/master' I, [2024-05-06T21:46:23.009980 #4074263] INFO -- : make[1]: Nothing to be done for 'trans'. I, [2024-05-06T21:46:23.010017 #4074263] INFO -- : make[1]: Leaving directory '/home/opc/ruby/build/master' I, [2024-05-06T21:46:23.010733 #4074263] INFO -- : making encs I, [2024-05-06T21:46:23.063369 #4074263] INFO -- : make[1]: Entering directory '/home/opc/ruby/build/master' I, [2024-05-06T21:46:23.063453 #4074263] INFO -- : make[1]: Nothing to be done for 'encs'. I, [2024-05-06T21:46:23.063487 #4074263] INFO -- : make[1]: Leaving directory '/home/opc/ruby/build/master' I, [2024-05-06T21:46:23.735158 #4074263] INFO -- : make[1]: Leaving directory '/home/opc/ruby/build/master' I, [2024-05-06T21:46:23.735865 #4074263] INFO -- : generating makefile exts.mk I, [2024-05-06T21:46:23.793983 #4074263] INFO -- : exts.mk unchanged I, [2024-05-06T21:46:23.798804 #4074263] INFO -- : make[1]: Entering directory '/home/opc/ruby/build/master' I, [2024-05-06T21:46:23.903771 #4074263] INFO -- : make[2]: Entering directory '/home/opc/ruby/build/master/ext/coverage' I, [2024-05-06T21:46:23.905749 #4074263] INFO -- : make[2]: Entering directory '/home/opc/ruby/build/master/ext/digest' I, [2024-05-06T21:46:23.905794 #4074263] INFO -- : make[2]: Entering directory '/home/opc/ruby/build/master/ext/date' I, [2024-05-06T21:46:23.909834 #4074263] INFO -- : make[2]: Leaving directory '/home/opc/ruby/build/master/ext/coverage' I, [2024-05-06T21:46:23.912019 #4074263] INFO -- : make[2]: Leaving directory '/home/opc/ruby/build/master/ext/date' I, [2024-05-06T21:46:23.914797 #4074263] INFO -- : make[2]: Leaving directory '/home/opc/ruby/build/master/ext/digest' I, [2024-05-06T21:46:23.920731 #4074263] INFO -- : make[2]: Entering directory '/home/opc/ruby/build/master/ext/io/console' I, [2024-05-06T21:46:23.922444 #4074263] INFO -- : make[2]: Entering directory '/home/opc/ruby/build/master/ext/fiddle' I, [2024-05-06T21:46:23.924892 #4074263] INFO -- : make[2]: Leaving directory '/home/opc/ruby/build/master/ext/io/console' I, [2024-05-06T21:46:23.930494 #4074263] INFO -- : make[2]: Entering directory '/home/opc/ruby/build/master/ext/json' I, [2024-05-06T21:46:23.930792 #4074263] INFO -- : make[2]: Leaving directory '/home/opc/ruby/build/master/ext/fiddle' I, [2024-05-06T21:46:23.933088 #4074263] INFO -- : make[2]: Entering directory '/home/opc/ruby/build/master/ext/monitor' I, [2024-05-06T21:46:23.936748 #4074263] INFO -- : make[2]: Entering directory '/home/opc/ruby/build/master/ext/objspace' I, [2024-05-06T21:46:23.937223 #4074263] INFO -- : make[2]: Leaving directory '/home/opc/ruby/build/master/ext/monitor' I, [2024-05-06T21:46:23.939856 #4074263] INFO -- : make[2]: Leaving directory '/home/opc/ruby/build/master/ext/json' I, [2024-05-06T21:46:23.942555 #4074263] INFO -- : make[2]: Leaving directory '/home/opc/ruby/build/master/ext/objspace' I, [2024-05-06T21:46:23.943981 #4074263] INFO -- : make[2]: Entering directory '/home/opc/ruby/build/master/ext/pathname' I, [2024-05-06T21:46:23.948034 #4074263] INFO -- : make[2]: Leaving directory '/home/opc/ruby/build/master/ext/pathname' I, [2024-05-06T21:46:23.948793 #4074263] INFO -- : make[2]: Entering directory '/home/opc/ruby/build/master/ext/psych' I, [2024-05-06T21:46:23.952340 #4074263] INFO -- : make[2]: Entering directory '/home/opc/ruby/build/master/ext/pty' I, [2024-05-06T21:46:23.956287 #4074263] INFO -- : make[2]: Entering directory '/home/opc/ruby/build/master/ext/openssl' I, [2024-05-06T21:46:23.957702 #4074263] INFO -- : make[2]: Leaving directory '/home/opc/ruby/build/master/ext/pty' I, [2024-05-06T21:46:23.970120 #4074263] INFO -- : make[2]: Leaving directory '/home/opc/ruby/build/master/ext/psych' I, [2024-05-06T21:46:23.971394 #4074263] INFO -- : make[2]: Entering directory '/home/opc/ruby/build/master/ext/ripper' I, [2024-05-06T21:46:23.972047 #4074263] INFO -- : make[2]: Entering directory '/home/opc/ruby/build/master/ext/rubyvm' I, [2024-05-06T21:46:23.975432 #4074263] INFO -- : make[2]: Leaving directory '/home/opc/ruby/build/master/ext/rubyvm' I, [2024-05-06T21:46:23.977131 #4074263] INFO -- : make[2]: Leaving directory '/home/opc/ruby/build/master/ext/openssl' I, [2024-05-06T21:46:23.979256 #4074263] INFO -- : make[2]: Leaving directory '/home/opc/ruby/build/master/ext/ripper' I, [2024-05-06T21:46:23.986281 #4074263] INFO -- : make[2]: Entering directory '/home/opc/ruby/build/master/.bundle/gems/bigdecimal-3.1.7/ext/bigdecimal' I, [2024-05-06T21:46:23.987684 #4074263] INFO -- : make[2]: Entering directory '/home/opc/ruby/build/master/ext/socket' I, [2024-05-06T21:46:23.988660 #4074263] INFO -- : make[2]: Entering directory '/home/opc/ruby/build/master/.bundle/gems/debug-1.9.2/ext/debug' I, [2024-05-06T21:46:23.998791 #4074263] INFO -- : make[2]: Leaving directory '/home/opc/ruby/build/master/ext/socket' I, [2024-05-06T21:46:24.003125 #4074263] INFO -- : make[2]: Entering directory '/home/opc/ruby/build/master/.bundle/gems/nkf-0.2.0/ext/nkf' I, [2024-05-06T21:46:24.017731 #4074263] INFO -- : make[2]: Leaving directory '/home/opc/ruby/build/master/.bundle/gems/bigdecimal-3.1.7/ext/bigdecimal' I, [2024-05-06T21:46:24.019380 #4074263] INFO -- : make[2]: Leaving directory '/home/opc/ruby/build/master/.bundle/gems/debug-1.9.2/ext/debug' I, [2024-05-06T21:46:24.020408 #4074263] INFO -- : make[2]: Entering directory '/home/opc/ruby/build/master/.bundle/gems/racc-1.7.3/ext/racc/cparse' I, [2024-05-06T21:46:24.022984 #4074263] INFO -- : make[2]: Entering directory '/home/opc/ruby/build/master/.bundle/gems/rbs-3.4.4/ext/rbs_extension' I, [2024-05-06T21:46:24.036224 #4074263] INFO -- : make[2]: Leaving directory '/home/opc/ruby/build/master/.bundle/gems/nkf-0.2.0/ext/nkf' I, [2024-05-06T21:46:24.038880 #4074263] INFO -- : make[2]: Entering directory '/home/opc/ruby/build/master/.bundle/gems/syslog-0.1.2/ext/syslog' I, [2024-05-06T21:46:24.051269 #4074263] INFO -- : make[2]: Leaving directory '/home/opc/ruby/build/master/.bundle/gems/racc-1.7.3/ext/racc/cparse' I, [2024-05-06T21:46:24.054675 #4074263] INFO -- : make[2]: Leaving directory '/home/opc/ruby/build/master/.bundle/gems/rbs-3.4.4/ext/rbs_extension' I, [2024-05-06T21:46:24.065749 #4074263] INFO -- : make[2]: Entering directory '/home/opc/ruby/build/master/ext/digest/sha2' I, [2024-05-06T21:46:24.076081 #4074263] INFO -- : make[2]: Leaving directory '/home/opc/ruby/build/master/ext/digest/sha2' I, [2024-05-06T21:46:24.076337 #4074263] INFO -- : make[2]: Leaving directory '/home/opc/ruby/build/master/.bundle/gems/syslog-0.1.2/ext/syslog' I, [2024-05-06T21:46:24.114116 #4074263] INFO -- : make[2]: Entering directory '/home/opc/ruby/build/master' I, [2024-05-06T21:46:24.196300 #4074263] INFO -- : make[2]: 'ruby' is up to date. I, [2024-05-06T21:46:24.196380 #4074263] INFO -- : make[2]: Leaving directory '/home/opc/ruby/build/master' I, [2024-05-06T21:46:24.196505 #4074263] INFO -- : make[1]: Leaving directory '/home/opc/ruby/build/master' I, [2024-05-06T21:46:24.201010 #4074263] INFO -- : make[1]: Entering directory '/home/opc/ruby/build/master' I, [2024-05-06T21:46:24.201058 #4074263] INFO -- : make[1]: Nothing to be done for 'note'. I, [2024-05-06T21:46:24.201068 #4074263] INFO -- : make[1]: Leaving directory '/home/opc/ruby/build/master' I, [2024-05-06T21:46:24.201198 #4074263] INFO -- : ./miniruby -I/home/opc/ruby/src/master/lib -I. -I.ext/common /home/opc/ruby/src/master/tool/runruby.rb --extout=.ext -- --disable-gems -r./aarch64-linux-fake /home/opc/ruby/src/master/tool/rbinstall.rb --make="make" --dest-dir="" --extout=".ext" --ext-build-dir="./ext" --mflags="-j3 --jobserver-auth=4,5" --make-flags=" -j3 --jobserver-auth=4,5" --data-mode=0644 --prog-mode=0755 --installed-list .installed.list --mantype="doc" --gnumake --install=all --exclude=doc I, [2024-05-06T21:46:24.350750 #4074263] INFO -- : Installing to I, [2024-05-06T21:46:24.350838 #4074263] INFO -- : installing binary commands: /home/opc/ruby/install/master/bin I, [2024-05-06T21:46:24.362872 #4074263] INFO -- : installing base libraries: /home/opc/ruby/install/master/lib I, [2024-05-06T21:46:24.363396 #4074263] INFO -- : installing arch files: /home/opc/ruby/install/master/lib/ruby/3.4.0+0/aarch64-linux I, [2024-05-06T21:46:24.363510 #4074263] INFO -- : installing pkgconfig data: /home/opc/ruby/install/master/lib/pkgconfig I, [2024-05-06T21:46:24.363602 #4074263] INFO -- : installing extension objects: /home/opc/ruby/install/master/lib/ruby/3.4.0+0/aarch64-linux I, [2024-05-06T21:46:24.376293 #4074263] INFO -- : installing extension objects: /home/opc/ruby/install/master/lib/ruby/site_ruby/3.4.0+0/aarch64-linux I, [2024-05-06T21:46:24.376330 #4074263] INFO -- : installing extension objects: /home/opc/ruby/install/master/lib/ruby/vendor_ruby/3.4.0+0/aarch64-linux I, [2024-05-06T21:46:24.376564 #4074263] INFO -- : installing extension headers: /home/opc/ruby/install/master/include/ruby-3.4.0+0/aarch64-linux I, [2024-05-06T21:46:24.376858 #4074263] INFO -- : installing extension scripts: /home/opc/ruby/install/master/lib/ruby/3.4.0+0 I, [2024-05-06T21:46:24.386298 #4074263] INFO -- : installing extension scripts: /home/opc/ruby/install/master/lib/ruby/site_ruby/3.4.0+0 I, [2024-05-06T21:46:24.386319 #4074263] INFO -- : installing extension scripts: /home/opc/ruby/install/master/lib/ruby/vendor_ruby/3.4.0+0 I, [2024-05-06T21:46:24.386330 #4074263] INFO -- : installing extension headers: /home/opc/ruby/install/master/include/ruby-3.4.0+0/ruby I, [2024-05-06T21:46:24.386469 #4074263] INFO -- : installing command scripts: /home/opc/ruby/install/master/bin I, [2024-05-06T21:46:24.386602 #4074263] INFO -- : installing library scripts: /home/opc/ruby/install/master/lib/ruby/3.4.0+0 I, [2024-05-06T21:46:24.470398 #4074263] INFO -- : installing common headers: /home/opc/ruby/install/master/include/ruby-3.4.0+0 I, [2024-05-06T21:46:24.486848 #4074263] INFO -- : installing manpages: /home/opc/ruby/install/master/share/man/man1 I, [2024-05-06T21:46:24.487136 #4074263] INFO -- : installing default gems from lib: /home/opc/ruby/install/master/lib/ruby/gems/3.4.0+0 I, [2024-05-06T21:46:24.526351 #4074263] INFO -- : benchmark 0.3.0 I, [2024-05-06T21:46:24.539452 #4074263] INFO -- : bundler 2.6.0.dev I, [2024-05-06T21:46:24.544396 #4074263] INFO -- : cgi 0.4.1 I, [2024-05-06T21:46:24.545665 #4074263] INFO -- : delegate 0.3.1 I, [2024-05-06T21:46:24.546770 #4074263] INFO -- : did_you_mean 1.6.3 I, [2024-05-06T21:46:24.547899 #4074263] INFO -- : english 0.8.0 I, [2024-05-06T21:46:24.549039 #4074263] INFO -- : erb 4.0.4 I, [2024-05-06T21:46:24.551878 #4074263] INFO -- : error_highlight 0.6.0 I, [2024-05-06T21:46:24.552964 #4074263] INFO -- : fileutils 1.7.2 I, [2024-05-06T21:46:24.554104 #4074263] INFO -- : find 0.2.0 I, [2024-05-06T21:46:24.555196 #4074263] INFO -- : forwardable 1.3.3 I, [2024-05-06T21:46:24.556311 #4074263] INFO -- : ipaddr 1.2.6 I, [2024-05-06T21:46:24.557466 #4074263] INFO -- : irb 1.13.1 I, [2024-05-06T21:46:24.560101 #4074263] INFO -- : logger 1.6.0 I, [2024-05-06T21:46:24.561237 #4074263] INFO -- : net-http 0.4.1 I, [2024-05-06T21:46:24.563588 #4074263] INFO -- : net-protocol 0.2.2 I, [2024-05-06T21:46:24.565111 #4074263] INFO -- : open-uri 0.4.1 I, [2024-05-06T21:46:24.566330 #4074263] INFO -- : open3 0.2.1 I, [2024-05-06T21:46:24.567448 #4074263] INFO -- : optparse 0.5.0 I, [2024-05-06T21:46:24.568643 #4074263] INFO -- : ostruct 0.6.0 I, [2024-05-06T21:46:24.569780 #4074263] INFO -- : pp 0.5.0 I, [2024-05-06T21:46:24.570929 #4074263] INFO -- : prettyprint 0.2.0 I, [2024-05-06T21:46:24.572110 #4074263] INFO -- : prism 0.27.0 I, [2024-05-06T21:46:24.573354 #4074263] INFO -- : pstore 0.1.3 I, [2024-05-06T21:46:24.574505 #4074263] INFO -- : rdoc 6.6.3.1 I, [2024-05-06T21:46:24.578500 #4074263] INFO -- : readline 0.0.4 I, [2024-05-06T21:46:24.579625 #4074263] INFO -- : reline 0.5.5 I, [2024-05-06T21:46:24.580836 #4074263] INFO -- : resolv 0.4.0 I, [2024-05-06T21:46:24.582059 #4074263] INFO -- : ruby2_keywords 0.0.5 I, [2024-05-06T21:46:24.583200 #4074263] INFO -- : securerandom 0.3.1 I, [2024-05-06T21:46:24.584363 #4074263] INFO -- : set 1.1.0 I, [2024-05-06T21:46:24.585612 #4074263] INFO -- : shellwords 0.2.0 I, [2024-05-06T21:46:24.586755 #4074263] INFO -- : singleton 0.2.0 I, [2024-05-06T21:46:24.587855 #4074263] INFO -- : syntax_suggest 2.0.0 I, [2024-05-06T21:46:24.591819 #4074263] INFO -- : tempfile 0.2.1 I, [2024-05-06T21:46:24.592982 #4074263] INFO -- : time 0.3.0 I, [2024-05-06T21:46:24.594184 #4074263] INFO -- : timeout 0.4.1 I, [2024-05-06T21:46:24.595308 #4074263] INFO -- : tmpdir 0.2.0 I, [2024-05-06T21:46:24.596416 #4074263] INFO -- : tsort 0.2.0 I, [2024-05-06T21:46:24.597597 #4074263] INFO -- : un 0.3.0 I, [2024-05-06T21:46:24.598707 #4074263] INFO -- : uri 0.13.0 I, [2024-05-06T21:46:24.599844 #4074263] INFO -- : weakref 0.1.3 I, [2024-05-06T21:46:24.600995 #4074263] INFO -- : yaml 0.3.0 I, [2024-05-06T21:46:24.601951 #4074263] INFO -- : installing default gems from ext: /home/opc/ruby/install/master/lib/ruby/gems/3.4.0+0 I, [2024-05-06T21:46:24.611356 #4074263] INFO -- : date 3.3.4 I, [2024-05-06T21:46:24.613810 #4074263] INFO -- : digest 3.1.1 I, [2024-05-06T21:46:24.614946 #4074263] INFO -- : etc 1.4.3 I, [2024-05-06T21:46:24.616106 #4074263] INFO -- : fcntl 1.1.0 I, [2024-05-06T21:46:24.617349 #4074263] INFO -- : fiddle 1.1.3 I, [2024-05-06T21:46:24.618483 #4074263] INFO -- : io-console 0.7.2 I, [2024-05-06T21:46:24.619580 #4074263] INFO -- : io-nonblock 0.3.0 I, [2024-05-06T21:46:24.620707 #4074263] INFO -- : io-wait 0.3.1 I, [2024-05-06T21:46:24.621816 #4074263] INFO -- : json 2.7.2 I, [2024-05-06T21:46:24.623026 #4074263] INFO -- : openssl 3.2.0 I, [2024-05-06T21:46:24.624165 #4074263] INFO -- : pathname 0.3.0 I, [2024-05-06T21:46:24.625780 #4074263] INFO -- : psych 5.1.2 I, [2024-05-06T21:46:24.627203 #4074263] INFO -- : stringio 3.1.1 I, [2024-05-06T21:46:24.628373 #4074263] INFO -- : strscan 3.1.1 I, [2024-05-06T21:46:24.629516 #4074263] INFO -- : zlib 3.1.0 I, [2024-05-06T21:46:24.630452 #4074263] INFO -- : installing bundled gems: /home/opc/ruby/install/master/lib/ruby/gems/3.4.0+0 I, [2024-05-06T21:46:24.631074 #4074263] INFO -- : minitest 5.22.3 I, [2024-05-06T21:46:24.645187 #4074263] INFO -- : rake 13.2.1 I, [2024-05-06T21:46:24.661606 #4074263] INFO -- : test-unit 3.6.2 I, [2024-05-06T21:46:24.677745 #4074263] INFO -- : rexml 3.2.6 I, [2024-05-06T21:46:24.693276 #4074263] INFO -- : rss 0.3.0 I, [2024-05-06T21:46:24.703160 #4074263] INFO -- : net-ftp 0.3.4 I, [2024-05-06T21:46:24.706647 #4074263] INFO -- : net-imap 0.4.10 I, [2024-05-06T21:46:24.718512 #4074263] INFO -- : net-pop 0.1.2 I, [2024-05-06T21:46:24.722408 #4074263] INFO -- : net-smtp 0.5.0 I, [2024-05-06T21:46:24.725468 #4074263] INFO -- : matrix 0.4.2 I, [2024-05-06T21:46:24.731032 #4074263] INFO -- : prime 0.1.2 I, [2024-05-06T21:46:24.741068 #4074263] INFO -- : rbs 3.4.4 I, [2024-05-06T21:46:24.840180 #4074263] INFO -- : typeprof 0.21.11 I, [2024-05-06T21:46:24.851255 #4074263] INFO -- : debug 1.9.2 I, [2024-05-06T21:46:24.862264 #4074263] INFO -- : racc 1.7.3 I, [2024-05-06T21:46:24.872956 #4074263] INFO -- : mutex_m 0.2.0 I, [2024-05-06T21:46:24.875694 #4074263] INFO -- : getoptlong 0.2.1 I, [2024-05-06T21:46:24.881105 #4074263] INFO -- : base64 0.2.0 I, [2024-05-06T21:46:24.883404 #4074263] INFO -- : bigdecimal 3.1.7 I, [2024-05-06T21:46:24.889438 #4074263] INFO -- : observer 0.1.2 I, [2024-05-06T21:46:24.892219 #4074263] INFO -- : abbrev 0.1.2 I, [2024-05-06T21:46:24.895265 #4074263] INFO -- : resolv-replace 0.1.1 I, [2024-05-06T21:46:24.898478 #4074263] INFO -- : rinda 0.2.0 I, [2024-05-06T21:46:24.901816 #4074263] INFO -- : drb 2.2.1 I, [2024-05-06T21:46:24.906313 #4074263] INFO -- : nkf 0.2.0 I, [2024-05-06T21:46:24.912654 #4074263] INFO -- : syslog 0.1.2 I, [2024-05-06T21:46:24.918006 #4074263] INFO -- : csv 3.3.0 I, [2024-05-06T21:46:24.927036 #4074263] INFO -- : installing bundled gem cache: /home/opc/ruby/install/master/lib/ruby/gems/3.4.0+0/cache I, [2024-05-06T21:46:24.928889 #4074263] INFO -- : skipped bundled gems: I, [2024-05-06T21:46:24.928928 #4074263] INFO -- : power_assert-2.0.4dev.gem not found in bundled_gems I, [2024-05-06T21:46:24.931700 #4074263] INFO -- : $$$[end] "make install -j3" exit with 0. I, [2024-05-06T21:46:24.931852 #4074263] INFO -- : $$$[beg] make yes-btest TESTOPTS='-q -j3' I, [2024-05-06T21:46:46.446738 #4074263] INFO -- : PASS all 1936 tests E, [2024-05-06T21:46:46.448432 #4074263] ERROR -- : I, [2024-05-06T21:46:46.448559 #4074263] INFO -- : $$$[end] "make yes-btest TESTOPTS='-q -j3'" exit with 0. I, [2024-05-06T21:46:46.448725 #4074263] INFO -- : $$$[beg] make yes-test-basic TESTS='-j3' I, [2024-05-06T21:46:46.539346 #4074263] INFO -- : BASERUBY = /usr/local/bin/ruby --disable=gems I, [2024-05-06T21:46:46.539414 #4074263] INFO -- : CC = gcc I, [2024-05-06T21:46:46.539425 #4074263] INFO -- : LD = ld I, [2024-05-06T21:46:46.539436 #4074263] INFO -- : LDSHARED = gcc -shared I, [2024-05-06T21:46:46.539445 #4074263] INFO -- : CFLAGS = -O3 -fno-fast-math -ggdb3 -Wall -Wextra -Wdeprecated-declarations -Wdiv-by-zero -Wduplicated-cond -Wimplicit-function-declaration -Wimplicit-int -Wpointer-arith -Wwrite-strings -Wold-style-definition -Wimplicit-fallthrough=0 -Wmissing-noreturn -Wno-cast-function-type -Wno-constant-logical-operand -Wno-long-long -Wno-missing-field-initializers -Wno-overlength-strings -Wno-packed-bitfield-compat -Wno-parentheses-equality -Wno-self-assign -Wno-tautological-compare -Wno-unused-parameter -Wno-unused-value -Wsuggest-attribute=format -Wsuggest-attribute=noreturn -Wunused-variable -Wmisleading-indentation -Wundef I, [2024-05-06T21:46:46.539455 #4074263] INFO -- : XCFLAGS = -U_FORTIFY_SOURCE -D_FORTIFY_SOURCE=2 -fstack-protector-strong -msign-return-address=all -fno-strict-overflow -fvisibility=hidden -fexcess-precision=standard -DRUBY_EXPORT -fPIE -I. -I.ext/include/aarch64-linux -I/home/opc/ruby/src/master/include -I/home/opc/ruby/src/master -I/home/opc/ruby/src/master/prism -I/home/opc/ruby/src/master/enc/unicode/15.0.0 I, [2024-05-06T21:46:46.539477 #4074263] INFO -- : CPPFLAGS = I, [2024-05-06T21:46:46.539486 #4074263] INFO -- : DLDFLAGS = -Wl,--compress-debug-sections=zlib -fstack-protector-strong -pie I, [2024-05-06T21:46:46.540992 #4074263] INFO -- : SOLIBS = -lz -lrt -lrt -ldl -lcrypt -lm -lpthread I, [2024-05-06T21:46:46.541006 #4074263] INFO -- : LANG = en_US.UTF-8 I, [2024-05-06T21:46:46.541015 #4074263] INFO -- : LC_ALL = I, [2024-05-06T21:46:46.541022 #4074263] INFO -- : LC_CTYPE = I, [2024-05-06T21:46:46.541030 #4074263] INFO -- : MFLAGS = I, [2024-05-06T21:46:46.541038 #4074263] INFO -- : RUSTC = rustc I, [2024-05-06T21:46:46.541046 #4074263] INFO -- : YJIT_RUSTC_ARGS = --crate-name=yjit --crate-type=staticlib --edition=2021 -g -C lto=thin -C opt-level=3 -C overflow-checks=on '--out-dir=/home/opc/ruby/build/master/yjit/target/release/' /home/opc/ruby/src/master/yjit/src/lib.rs I, [2024-05-06T21:46:46.541057 #4074263] INFO -- : gcc (GCC) 8.5.0 20210514 (Red Hat 8.5.0-10.1.0.1) I, [2024-05-06T21:46:46.541065 #4074263] INFO -- : Copyright (C) 2018 Free Software Foundation, Inc. I, [2024-05-06T21:46:46.541073 #4074263] INFO -- : This is free software; see the source for copying conditions. There is NO I, [2024-05-06T21:46:46.541081 #4074263] INFO -- : warranty; not even for MERCHANTABILITY or FITNESS FOR A PARTICULAR PURPOSE. I, [2024-05-06T21:46:46.541089 #4074263] INFO -- : I, [2024-05-06T21:46:46.696517 #4074263] INFO -- : Checking leaked global symbols...none I, [2024-05-06T21:46:46.748501 #4074263] INFO -- : /home/opc/ruby/src/master/basictest/test.rb:assignment ....................................................................................................................................................................................................................................................................................................................................................................................OK 372 I, [2024-05-06T21:46:46.748604 #4074263] INFO -- : /home/opc/ruby/src/master/basictest/test.rb:condition ..OK 2 I, [2024-05-06T21:46:46.748632 #4074263] INFO -- : /home/opc/ruby/src/master/basictest/test.rb:if/unless ...OK 3 I, [2024-05-06T21:46:46.748685 #4074263] INFO -- : /home/opc/ruby/src/master/basictest/test.rb:case .....OK 5 I, [2024-05-06T21:46:46.749323 #4074263] INFO -- : /home/opc/ruby/src/master/basictest/test.rb:while/until ........OK 8 I, [2024-05-06T21:46:46.749450 #4074263] INFO -- : /home/opc/ruby/src/master/basictest/test.rb:exception ..........OK 10 I, [2024-05-06T21:46:46.750104 #4074263] INFO -- : /home/opc/ruby/src/master/basictest/test.rb:array .......................................OK 39 I, [2024-05-06T21:46:46.750399 #4074263] INFO -- : /home/opc/ruby/src/master/basictest/test.rb:hash ...........................OK 27 I, [2024-05-06T21:46:46.752130 #4074263] INFO -- : /home/opc/ruby/src/master/basictest/test.rb:iterator ...........................................................................................................OK 107 I, [2024-05-06T21:46:46.752942 #4074263] INFO -- : /home/opc/ruby/src/master/basictest/test.rb:float ................................................................................OK 80 I, [2024-05-06T21:46:46.756576 #4074263] INFO -- : /home/opc/ruby/src/master/basictest/test.rb:bignum ...............................OK 31 I, [2024-05-06T21:46:46.758227 #4074263] INFO -- : /home/opc/ruby/src/master/basictest/test.rb:string & char ..............................................................OK 62 I, [2024-05-06T21:46:46.758312 #4074263] INFO -- : /home/opc/ruby/src/master/basictest/test.rb:assignment ..........OK 10 I, [2024-05-06T21:46:46.758389 #4074263] INFO -- : /home/opc/ruby/src/master/basictest/test.rb:call ......OK 6 I, [2024-05-06T21:46:46.758520 #4074263] INFO -- : /home/opc/ruby/src/master/basictest/test.rb:proc .........OK 9 I, [2024-05-06T21:46:46.858822 #4074263] INFO -- : /home/opc/ruby/src/master/basictest/test.rb:signal ..OK 2 I, [2024-05-06T21:46:46.860376 #4074263] INFO -- : /home/opc/ruby/src/master/basictest/test.rb:eval ...........................OK 27 I, [2024-05-06T21:46:46.990222 #4074263] INFO -- : /home/opc/ruby/src/master/basictest/test.rb:system ........OK 8 I, [2024-05-06T21:46:46.990305 #4074263] INFO -- : /home/opc/ruby/src/master/basictest/test.rb:const .....OK 5 I, [2024-05-06T21:46:46.990409 #4074263] INFO -- : /home/opc/ruby/src/master/basictest/test.rb:clone .....OK 5 I, [2024-05-06T21:46:46.990603 #4074263] INFO -- : /home/opc/ruby/src/master/basictest/test.rb:marshal ....OK 4 I, [2024-05-06T21:46:46.990679 #4074263] INFO -- : /home/opc/ruby/src/master/basictest/test.rb:pack ....OK 4 I, [2024-05-06T21:46:46.990710 #4074263] INFO -- : /home/opc/ruby/src/master/basictest/test.rb:math ..OK 2 I, [2024-05-06T21:46:46.990801 #4074263] INFO -- : /home/opc/ruby/src/master/basictest/test.rb:struct ......OK 6 I, [2024-05-06T21:46:46.990972 #4074263] INFO -- : /home/opc/ruby/src/master/basictest/test.rb:variable ............OK 12 I, [2024-05-06T21:46:46.991013 #4074263] INFO -- : /home/opc/ruby/src/master/basictest/test.rb:trace ...OK 3 I, [2024-05-06T21:46:46.991144 #4074263] INFO -- : /home/opc/ruby/src/master/basictest/test.rb:defined? ............OK 12 I, [2024-05-06T21:46:46.991228 #4074263] INFO -- : /home/opc/ruby/src/master/basictest/test.rb:alias ......OK 6 I, [2024-05-06T21:46:46.991723 #4074263] INFO -- : /home/opc/ruby/src/master/basictest/test.rb:path .......................OK 23 I, [2024-05-06T21:46:47.059849 #4074263] INFO -- : /home/opc/ruby/src/master/basictest/test.rb:gc ....OK 4 I, [2024-05-06T21:46:47.061808 #4074263] INFO -- : I, [2024-05-06T21:46:47.061840 #4074263] INFO -- : test succeeded I, [2024-05-06T21:46:47.062930 #4074263] INFO -- : $$$[end] "make yes-test-basic TESTS='-j3'" exit with 0. I, [2024-05-06T21:46:47.063139 #4074263] INFO -- : $$$[beg] make yes-test-all TESTOPTS='--stderr-on-failure' TESTS='-j3' I, [2024-05-06T21:46:47.186268 #4074263] INFO -- : BASERUBY = /usr/local/bin/ruby --disable=gems I, [2024-05-06T21:46:47.186343 #4074263] INFO -- : CC = gcc I, [2024-05-06T21:46:47.186354 #4074263] INFO -- : LD = ld I, [2024-05-06T21:46:47.186362 #4074263] INFO -- : LDSHARED = gcc -shared I, [2024-05-06T21:46:47.186375 #4074263] INFO -- : CFLAGS = -O3 -fno-fast-math -ggdb3 -Wall -Wextra -Wdeprecated-declarations -Wdiv-by-zero -Wduplicated-cond -Wimplicit-function-declaration -Wimplicit-int -Wpointer-arith -Wwrite-strings -Wold-style-definition -Wimplicit-fallthrough=0 -Wmissing-noreturn -Wno-cast-function-type -Wno-constant-logical-operand -Wno-long-long -Wno-missing-field-initializers -Wno-overlength-strings -Wno-packed-bitfield-compat -Wno-parentheses-equality -Wno-self-assign -Wno-tautological-compare -Wno-unused-parameter -Wno-unused-value -Wsuggest-attribute=format -Wsuggest-attribute=noreturn -Wunused-variable -Wmisleading-indentation -Wundef I, [2024-05-06T21:46:47.186384 #4074263] INFO -- : XCFLAGS = -U_FORTIFY_SOURCE -D_FORTIFY_SOURCE=2 -fstack-protector-strong -msign-return-address=all -fno-strict-overflow -fvisibility=hidden -fexcess-precision=standard -DRUBY_EXPORT -fPIE -I. -I.ext/include/aarch64-linux -I/home/opc/ruby/src/master/include -I/home/opc/ruby/src/master -I/home/opc/ruby/src/master/prism -I/home/opc/ruby/src/master/enc/unicode/15.0.0 I, [2024-05-06T21:46:47.186393 #4074263] INFO -- : CPPFLAGS = I, [2024-05-06T21:46:47.186401 #4074263] INFO -- : DLDFLAGS = -Wl,--compress-debug-sections=zlib -fstack-protector-strong -pie I, [2024-05-06T21:46:47.186411 #4074263] INFO -- : SOLIBS = -lz -lrt -lrt -ldl -lcrypt -lm -lpthread I, [2024-05-06T21:46:47.186420 #4074263] INFO -- : LANG = en_US.UTF-8 I, [2024-05-06T21:46:47.186428 #4074263] INFO -- : LC_ALL = I, [2024-05-06T21:46:47.186436 #4074263] INFO -- : LC_CTYPE = I, [2024-05-06T21:46:47.186445 #4074263] INFO -- : MFLAGS = I, [2024-05-06T21:46:47.186454 #4074263] INFO -- : RUSTC = rustc I, [2024-05-06T21:46:47.186462 #4074263] INFO -- : YJIT_RUSTC_ARGS = --crate-name=yjit --crate-type=staticlib --edition=2021 -g -C lto=thin -C opt-level=3 -C overflow-checks=on '--out-dir=/home/opc/ruby/build/master/yjit/target/release/' /home/opc/ruby/src/master/yjit/src/lib.rs I, [2024-05-06T21:46:47.187092 #4074263] INFO -- : gcc (GCC) 8.5.0 20210514 (Red Hat 8.5.0-10.1.0.1) I, [2024-05-06T21:46:47.187109 #4074263] INFO -- : Copyright (C) 2018 Free Software Foundation, Inc. I, [2024-05-06T21:46:47.187118 #4074263] INFO -- : This is free software; see the source for copying conditions. There is NO I, [2024-05-06T21:46:47.187127 #4074263] INFO -- : warranty; not even for MERCHANTABILITY or FITNESS FOR A PARTICULAR PURPOSE. I, [2024-05-06T21:46:47.187135 #4074263] INFO -- : I, [2024-05-06T21:46:47.189113 #4074263] INFO -- : generating enc.mk I, [2024-05-06T21:46:47.425095 #4074263] INFO -- : making enc I, [2024-05-06T21:46:47.452404 #4074263] INFO -- : make[1]: Entering directory '/home/opc/ruby/build/master' I, [2024-05-06T21:46:47.452462 #4074263] INFO -- : make[1]: Nothing to be done for 'enc'. I, [2024-05-06T21:46:47.452473 #4074263] INFO -- : make[1]: Leaving directory '/home/opc/ruby/build/master' I, [2024-05-06T21:46:47.453156 #4074263] INFO -- : making srcs under enc I, [2024-05-06T21:46:47.495157 #4074263] INFO -- : make[1]: Entering directory '/home/opc/ruby/build/master' I, [2024-05-06T21:46:47.495208 #4074263] INFO -- : make[1]: Nothing to be done for 'srcs'. I, [2024-05-06T21:46:47.495218 #4074263] INFO -- : make[1]: Leaving directory '/home/opc/ruby/build/master' I, [2024-05-06T21:46:47.496332 #4074263] INFO -- : generating transdb.h I, [2024-05-06T21:46:47.643863 #4074263] INFO -- : transdb.h unchanged I, [2024-05-06T21:46:47.645156 #4074263] INFO -- : making trans I, [2024-05-06T21:46:47.693299 #4074263] INFO -- : make[1]: Entering directory '/home/opc/ruby/build/master' I, [2024-05-06T21:46:47.693390 #4074263] INFO -- : make[1]: Nothing to be done for 'trans'. I, [2024-05-06T21:46:47.693401 #4074263] INFO -- : make[1]: Leaving directory '/home/opc/ruby/build/master' I, [2024-05-06T21:46:47.694540 #4074263] INFO -- : making encs I, [2024-05-06T21:46:47.747127 #4074263] INFO -- : make[1]: Entering directory '/home/opc/ruby/build/master' I, [2024-05-06T21:46:47.747204 #4074263] INFO -- : make[1]: Nothing to be done for 'encs'. I, [2024-05-06T21:46:47.747215 #4074263] INFO -- : make[1]: Leaving directory '/home/opc/ruby/build/master' I, [2024-05-06T21:46:47.749338 #4074263] INFO -- : generating makefiles ext/configure-ext.mk I, [2024-05-06T21:46:47.789170 #4074263] INFO -- : ext/configure-ext.mk updated I, [2024-05-06T21:46:47.792677 #4074263] INFO -- : make[1]: Entering directory '/home/opc/ruby/build/master' I, [2024-05-06T21:46:49.815202 #4074263] INFO -- : make[1]: Leaving directory '/home/opc/ruby/build/master' I, [2024-05-06T21:46:49.815865 #4074263] INFO -- : generating makefile exts.mk I, [2024-05-06T21:46:49.874646 #4074263] INFO -- : exts.mk unchanged I, [2024-05-06T21:46:49.879412 #4074263] INFO -- : make[1]: Entering directory '/home/opc/ruby/build/master' I, [2024-05-06T21:46:50.172263 #4074263] INFO -- : make[2]: Entering directory '/home/opc/ruby/build/master/ext/coverage' I, [2024-05-06T21:46:50.176850 #4074263] INFO -- : make[2]: Leaving directory '/home/opc/ruby/build/master/ext/coverage' I, [2024-05-06T21:46:50.182352 #4074263] INFO -- : make[2]: Entering directory '/home/opc/ruby/build/master/ext/date' I, [2024-05-06T21:46:50.187650 #4074263] INFO -- : make[2]: Leaving directory '/home/opc/ruby/build/master/ext/date' I, [2024-05-06T21:46:50.190945 #4074263] INFO -- : make[2]: Entering directory '/home/opc/ruby/build/master/ext/digest' I, [2024-05-06T21:46:50.200093 #4074263] INFO -- : make[2]: Leaving directory '/home/opc/ruby/build/master/ext/digest' I, [2024-05-06T21:46:50.222720 #4074263] INFO -- : make[2]: Entering directory '/home/opc/ruby/build/master/ext/digest/sha2' I, [2024-05-06T21:46:50.227719 #4074263] INFO -- : make[2]: Leaving directory '/home/opc/ruby/build/master/ext/digest/sha2' I, [2024-05-06T21:46:50.246138 #4074263] INFO -- : make[2]: Entering directory '/home/opc/ruby/build/master/ext/fiddle' I, [2024-05-06T21:46:50.256203 #4074263] INFO -- : make[2]: Leaving directory '/home/opc/ruby/build/master/ext/fiddle' I, [2024-05-06T21:46:50.260523 #4074263] INFO -- : make[2]: Entering directory '/home/opc/ruby/build/master/ext/io/console' I, [2024-05-06T21:46:50.264836 #4074263] INFO -- : make[2]: Leaving directory '/home/opc/ruby/build/master/ext/io/console' I, [2024-05-06T21:46:50.275643 #4074263] INFO -- : make[2]: Entering directory '/home/opc/ruby/build/master/ext/json' I, [2024-05-06T21:46:50.285225 #4074263] INFO -- : make[2]: Leaving directory '/home/opc/ruby/build/master/ext/json' I, [2024-05-06T21:46:50.298445 #4074263] INFO -- : make[2]: Entering directory '/home/opc/ruby/build/master/ext/monitor' I, [2024-05-06T21:46:50.302691 #4074263] INFO -- : make[2]: Leaving directory '/home/opc/ruby/build/master/ext/monitor' I, [2024-05-06T21:46:50.308688 #4074263] INFO -- : make[2]: Entering directory '/home/opc/ruby/build/master/ext/objspace' I, [2024-05-06T21:46:50.314746 #4074263] INFO -- : make[2]: Leaving directory '/home/opc/ruby/build/master/ext/objspace' I, [2024-05-06T21:46:50.333679 #4074263] INFO -- : make[2]: Entering directory '/home/opc/ruby/build/master/ext/openssl' I, [2024-05-06T21:46:50.355594 #4074263] INFO -- : make[2]: Leaving directory '/home/opc/ruby/build/master/ext/openssl' I, [2024-05-06T21:46:50.359927 #4074263] INFO -- : make[2]: Entering directory '/home/opc/ruby/build/master/ext/pathname' I, [2024-05-06T21:46:50.364058 #4074263] INFO -- : make[2]: Leaving directory '/home/opc/ruby/build/master/ext/pathname' I, [2024-05-06T21:46:50.370382 #4074263] INFO -- : make[2]: Entering directory '/home/opc/ruby/build/master/ext/psych' I, [2024-05-06T21:46:50.392920 #4074263] INFO -- : make[2]: Leaving directory '/home/opc/ruby/build/master/ext/psych' I, [2024-05-06T21:46:50.397462 #4074263] INFO -- : make[2]: Entering directory '/home/opc/ruby/build/master/ext/pty' I, [2024-05-06T21:46:50.401757 #4074263] INFO -- : make[2]: Leaving directory '/home/opc/ruby/build/master/ext/pty' I, [2024-05-06T21:46:50.415212 #4074263] INFO -- : make[2]: Entering directory '/home/opc/ruby/build/master/ext/ripper' I, [2024-05-06T21:46:50.423038 #4074263] INFO -- : make[2]: Leaving directory '/home/opc/ruby/build/master/ext/ripper' I, [2024-05-06T21:46:50.424985 #4074263] INFO -- : make[2]: Entering directory '/home/opc/ruby/build/master/ext/rubyvm' I, [2024-05-06T21:46:50.428348 #4074263] INFO -- : make[2]: Leaving directory '/home/opc/ruby/build/master/ext/rubyvm' I, [2024-05-06T21:46:50.440508 #4074263] INFO -- : make[2]: Entering directory '/home/opc/ruby/build/master/ext/socket' I, [2024-05-06T21:46:50.451097 #4074263] INFO -- : make[2]: Leaving directory '/home/opc/ruby/build/master/ext/socket' I, [2024-05-06T21:46:50.466596 #4074263] INFO -- : make[2]: Entering directory '/home/opc/ruby/build/master/.bundle/gems/bigdecimal-3.1.7/ext/bigdecimal' I, [2024-05-06T21:46:50.497551 #4074263] INFO -- : make[2]: Leaving directory '/home/opc/ruby/build/master/.bundle/gems/bigdecimal-3.1.7/ext/bigdecimal' I, [2024-05-06T21:46:50.500081 #4074263] INFO -- : make[2]: Entering directory '/home/opc/ruby/build/master/.bundle/gems/debug-1.9.2/ext/debug' I, [2024-05-06T21:46:50.530576 #4074263] INFO -- : make[2]: Leaving directory '/home/opc/ruby/build/master/.bundle/gems/debug-1.9.2/ext/debug' I, [2024-05-06T21:46:50.533195 #4074263] INFO -- : make[2]: Entering directory '/home/opc/ruby/build/master/.bundle/gems/nkf-0.2.0/ext/nkf' I, [2024-05-06T21:46:50.564201 #4074263] INFO -- : make[2]: Leaving directory '/home/opc/ruby/build/master/.bundle/gems/nkf-0.2.0/ext/nkf' I, [2024-05-06T21:46:50.566747 #4074263] INFO -- : make[2]: Entering directory '/home/opc/ruby/build/master/.bundle/gems/racc-1.7.3/ext/racc/cparse' I, [2024-05-06T21:46:50.597521 #4074263] INFO -- : make[2]: Leaving directory '/home/opc/ruby/build/master/.bundle/gems/racc-1.7.3/ext/racc/cparse' I, [2024-05-06T21:46:50.600511 #4074263] INFO -- : make[2]: Entering directory '/home/opc/ruby/build/master/.bundle/gems/rbs-3.4.4/ext/rbs_extension' I, [2024-05-06T21:46:50.631156 #4074263] INFO -- : make[2]: Leaving directory '/home/opc/ruby/build/master/.bundle/gems/rbs-3.4.4/ext/rbs_extension' I, [2024-05-06T21:46:50.633750 #4074263] INFO -- : make[2]: Entering directory '/home/opc/ruby/build/master/.bundle/gems/syslog-0.1.2/ext/syslog' I, [2024-05-06T21:46:50.666011 #4074263] INFO -- : make[2]: Leaving directory '/home/opc/ruby/build/master/.bundle/gems/syslog-0.1.2/ext/syslog' I, [2024-05-06T21:46:50.704227 #4074263] INFO -- : make[2]: Entering directory '/home/opc/ruby/build/master' I, [2024-05-06T21:46:50.787625 #4074263] INFO -- : make[2]: 'ruby' is up to date. I, [2024-05-06T21:46:50.787704 #4074263] INFO -- : make[2]: Leaving directory '/home/opc/ruby/build/master' I, [2024-05-06T21:46:50.787853 #4074263] INFO -- : make[1]: Leaving directory '/home/opc/ruby/build/master' I, [2024-05-06T21:46:50.792366 #4074263] INFO -- : make[1]: Entering directory '/home/opc/ruby/build/master' I, [2024-05-06T21:46:50.792408 #4074263] INFO -- : make[1]: Nothing to be done for 'note'. I, [2024-05-06T21:46:50.792419 #4074263] INFO -- : make[1]: Leaving directory '/home/opc/ruby/build/master' I, [2024-05-06T21:46:50.905719 #4074263] INFO -- : Run options: I, [2024-05-06T21:46:50.905797 #4074263] INFO -- : --seed=47180 I, [2024-05-06T21:46:50.905808 #4074263] INFO -- : "--ruby=./miniruby -I/home/opc/ruby/src/master/lib -I. -I.ext/common /home/opc/ruby/src/master/tool/runruby.rb --extout=.ext -- --disable-gems" I, [2024-05-06T21:46:50.905818 #4074263] INFO -- : --excludes-dir=/home/opc/ruby/src/master/test/.excludes I, [2024-05-06T21:46:50.905826 #4074263] INFO -- : --name=!/memory_leak/ I, [2024-05-06T21:46:50.905835 #4074263] INFO -- : --stderr-on-failure I, [2024-05-06T21:46:50.905843 #4074263] INFO -- : -j3 I, [2024-05-06T21:46:50.905851 #4074263] INFO -- : I, [2024-05-06T21:46:50.905860 #4074263] INFO -- : # Running tests: I, [2024-05-06T21:46:50.905868 #4074263] INFO -- : I, [2024-05-06T21:46:51.053083 #4074263] INFO -- : [ 1/885] 4115144=test_yjit I, [2024-05-06T21:46:51.054972 #4074263] INFO -- : [ 2/885] 4115146=test_gem_uninstaller I, [2024-05-06T21:46:51.063641 #4074263] INFO -- : [ 3/885] 4115144=test_cclass I, [2024-05-06T21:46:51.139267 #4074263] INFO -- : [ 4/885] 4115143=test_gem_dependency I, [2024-05-06T21:46:51.235976 #4074263] INFO -- : [ 5/885] 4115144=test_method I, [2024-05-06T21:46:51.456861 #4074263] INFO -- : [ 6/885] 4115143=test_m17n I, [2024-05-06T21:46:51.557795 #4074263] INFO -- : [ 7/885] 4115143=test_argf I, [2024-05-06T21:46:52.752053 #4074263] INFO -- : [ 8/885] 4115146=test_x509name I, [2024-05-06T21:46:52.798567 #4074263] INFO -- : [ 9/885] 4115146=test_yaml I, [2024-05-06T21:46:52.851919 #4074263] INFO -- : [ 10/885] 4115146=test_pkcs12 I, [2024-05-06T21:46:52.992354 #4074263] INFO -- : [ 11/885] 4115144=test_json_tree I, [2024-05-06T21:46:53.052432 #4074263] INFO -- : [ 12/885] 4115144=test_koi8 I, [2024-05-06T21:46:53.062159 #4074263] INFO -- : [ 13/885] 4115144=test_gem_remote_fetcher I, [2024-05-06T21:46:53.573007 #4074263] INFO -- : [ 14/885] 4115146=test_parser_events I, [2024-05-06T21:46:53.650764 #4074263] INFO -- : [ 15/885] 4115146=test_filter I, [2024-05-06T21:46:53.696691 #4074263] INFO -- : [ 16/885] 4115146=test_set I, [2024-05-06T21:46:53.714706 #4074263] INFO -- : [ 17/885] 4115146=attribute_write_test I, [2024-05-06T21:46:53.765833 #4074263] INFO -- : [ 18/885] 4115146=test_utf16 I, [2024-05-06T21:46:53.808578 #4074263] INFO -- : [ 19/885] 4115146=test_http I, [2024-05-06T21:46:55.620645 #4074263] INFO -- : [ 20/885] 4115143=test_ractor I, [2024-05-06T21:46:55.626971 #4074263] INFO -- : [ 21/885] 4115143=test_case I, [2024-05-06T21:46:55.633480 #4074263] INFO -- : [ 22/885] 4115143=test_severity I, [2024-05-06T21:46:55.636946 #4074263] INFO -- : [ 23/885] 4115143=test_str2big I, [2024-05-06T21:46:55.657395 #4074263] INFO -- : [ 24/885] 4115143=test_gem_package_tar_writer I, [2024-05-06T21:46:55.732567 #4074263] INFO -- : [ 25/885] 4115144=test_rdoc_markup_to_rdoc I, [2024-05-06T21:46:55.776063 #4074263] INFO -- : [ 26/885] 4115143=test_method_cache I, [2024-05-06T21:46:55.840800 #4074263] INFO -- : [ 27/885] 4115143=test_too_many_dummy_encodings I, [2024-05-06T21:46:55.867887 #4074263] INFO -- : [ 28/885] 4115143=test_sprintf_comb I, [2024-05-06T21:46:55.908625 #4074263] INFO -- : [ 29/885] 4115144=test_gem_commands_push_command I, [2024-05-06T21:46:56.063347 #4074263] INFO -- : [ 30/885] 4115143=locals_test I, [2024-05-06T21:46:56.518707 #4074263] INFO -- : [ 31/885] 4115143=test_rdoc_task I, [2024-05-06T21:46:56.532100 #4074263] INFO -- : [ 32/885] 4115143=test_backtrace I, [2024-05-06T21:46:56.572159 #4074263] INFO -- : [ 33/885] 4115144=test_settracefunc I, [2024-05-06T21:46:57.368480 #4074263] INFO -- : [ 34/885] 4115144=test_gem_text I, [2024-05-06T21:46:57.470334 #4074263] INFO -- : [ 35/885] 4115144=test_tracepoint I, [2024-05-06T21:46:57.752238 #4074263] INFO -- : [ 36/885] 4115144=test_rendering I, [2024-05-06T21:46:57.800761 #4074263] INFO -- : [ 37/885] 4115143=test_gem_source_local I, [2024-05-06T21:46:57.834460 #4074263] INFO -- : [ 38/885] 4115144=desugar_compiler_test I, [2024-05-06T21:46:57.905622 #4074263] INFO -- : [ 39/885] 4115144=test_internal_ivar I, [2024-05-06T21:46:57.912380 #4074263] INFO -- : [ 40/885] 4115144=test_win32ole I, [2024-05-06T21:46:57.933208 #4074263] INFO -- : [ 41/885] 4115144=test_gem_gemcutter_utilities I, [2024-05-06T21:46:58.039240 #4074263] INFO -- : [ 42/885] 4115143=test_http I, [2024-05-06T21:46:58.072540 #4074263] INFO -- : [ 43/885] 4115143=test_hash I, [2024-05-06T21:46:58.362031 #4074263] INFO -- : [ 44/885] 4115144=parser_test I, [2024-05-06T21:46:58.367840 #4074263] INFO -- : [ 45/885] 4115144=test_pty I, [2024-05-06T21:46:58.368336 #4074263] INFO -- : Leaked file descriptor: TestPTY#test_open_with_block: 8 # I, [2024-05-06T21:46:58.412661 #4074263] INFO -- : COMMAND PID USER FD TYPE DEVICE SIZE/OFF NODE NAME I, [2024-05-06T21:46:58.412733 #4074263] INFO -- : ruby 4115144 opc 8r REG 252,0 6940392 13705429 /var/lib/sss/mc/group I, [2024-05-06T21:46:58.949373 #4074263] INFO -- : [ 46/885] 4115144=test_gem_dependency_installer I, [2024-05-06T21:47:01.200838 #4074263] INFO -- : [ 47/885] 4115143=test_gem_request I, [2024-05-06T21:47:01.276132 #4074263] INFO -- : [ 48/885] 4115144=test_gem_commands_which_command I, [2024-05-06T21:47:01.319475 #4074263] INFO -- : [ 49/885] 4115144=test_gem_package_old I, [2024-05-06T21:47:01.366764 #4074263] INFO -- : [ 50/885] 4115144=encoding_test I, [2024-05-06T21:47:01.425887 #4074263] INFO -- : [ 51/885] 4115143=test_scan_args I, [2024-05-06T21:47:01.441557 #4074263] INFO -- : [ 52/885] 4115143=test_gem_commands_specification_command I, [2024-05-06T21:47:01.459280 #4074263] INFO -- : [ 53/885] 4115144=test_rdoc_context I, [2024-05-06T21:47:01.583758 #4074263] INFO -- : [ 54/885] 4115143=test_gem_command_manager I, [2024-05-06T21:47:01.774971 #4074263] INFO -- : [ 55/885] 4115143=test_array I, [2024-05-06T21:47:01.783512 #4074263] INFO -- : [ 56/885] 4115143=test_open-uri I, [2024-05-06T21:47:02.213123 #4074263] INFO -- : [ 57/885] 4115144=test_case I, [2024-05-06T21:47:02.229284 #4074263] INFO -- : [ 58/885] 4115144=test_enumerator I, [2024-05-06T21:47:02.320967 #4074263] INFO -- : [ 59/885] 4115143=test_enc_associate I, [2024-05-06T21:47:02.665427 #4074263] INFO -- : [ 60/885] 4115146=test_sprintf I, [2024-05-06T21:47:02.715746 #4074263] INFO -- : [ 61/885] 4115143=test_recorder I, [2024-05-06T21:47:02.723976 #4074263] INFO -- : [ 62/885] 4115143=test_yaml_special_cases I, [2024-05-06T21:47:02.740723 #4074263] INFO -- : [ 63/885] 4115143=test_gem_commands_sources_command I, [2024-05-06T21:47:02.888250 #4074263] INFO -- : [ 64/885] 4115146=json_addition_test I, [2024-05-06T21:47:02.916400 #4074263] INFO -- : [ 65/885] 4115146=test_gem_source_list I, [2024-05-06T21:47:02.926042 #4074263] INFO -- : [ 66/885] 4115143=test_name_error I, [2024-05-06T21:47:03.016055 #4074263] INFO -- : [ 67/885] 4115146=test_exit I, [2024-05-06T21:47:03.047613 #4074263] INFO -- : [ 68/885] 4115143=test_class I, [2024-05-06T21:47:03.131682 #4074263] INFO -- : [ 69/885] 4115146=test_rdoc_parser_rd I, [2024-05-06T21:47:03.211647 #4074263] INFO -- : [ 70/885] 4115146=index_write_test I, [2024-05-06T21:47:03.217695 #4074263] INFO -- : [ 71/885] 4115146=test_const I, [2024-05-06T21:47:03.225501 #4074263] INFO -- : [ 72/885] 4115146=test_math I, [2024-05-06T21:47:03.240808 #4074263] INFO -- : [ 73/885] 4115146=test_gc I, [2024-05-06T21:47:03.247454 #4074263] INFO -- : [ 74/885] 4115146=comments_test I, [2024-05-06T21:47:03.251719 #4074263] INFO -- : [ 75/885] 4115146=test_qsort I, [2024-05-06T21:47:03.307254 #4074263] INFO -- : [ 76/885] 4115146=ripper_test I, [2024-05-06T21:47:03.901169 #4074263] INFO -- : [ 77/885] 4115146=test_iso_8859 I, [2024-05-06T21:47:03.945832 #4074263] INFO -- : [ 78/885] 4115146=test_libs I, [2024-05-06T21:47:03.958123 #4074263] INFO -- : [ 79/885] 4115146=test_safe_load I, [2024-05-06T21:47:03.979403 #4074263] INFO -- : [ 80/885] 4115146=test_cgi_tag_helper I, [2024-05-06T21:47:04.014451 #4074263] INFO -- : [ 81/885] 4115146=test_pack I, [2024-05-06T21:47:04.041943 #4074263] INFO -- : [ 82/885] 4115146=test_pinned I, [2024-05-06T21:47:04.068137 #4074263] INFO -- : [ 83/885] 4115146=test_framework I, [2024-05-06T21:47:04.118774 #4074263] INFO -- : [ 84/885] 4115146=test_ansi_with_terminfo I, [2024-05-06T21:47:04.129384 #4074263] INFO -- : [ 85/885] 4115146=test_inadvertent_creation I, [2024-05-06T21:47:04.249999 #4074263] INFO -- : [ 86/885] 4115146=test_weakmap I, [2024-05-06T21:47:07.441462 #4074263] INFO -- : [ 87/885] 4115143=test_coderange I, [2024-05-06T21:47:07.446567 #4074263] INFO -- : [ 88/885] 4115143=test_nil2vtempty I, [2024-05-06T21:47:07.455464 #4074263] INFO -- : [ 89/885] 4115143=test_date_time I, [2024-05-06T21:47:07.622141 #4074263] INFO -- : [ 90/885] 4115143=test_rdoc_generator_json_index I, [2024-05-06T21:47:07.655299 #4074263] INFO -- : [ 91/885] 4115143=test_windows_1252 I, [2024-05-06T21:47:07.850633 #4074263] INFO -- : [ 92/885] 4115143=test_stack I, [2024-05-06T21:47:08.835929 #4074263] INFO -- : [ 93/885] 4115143=test_emoji I, [2024-05-06T21:47:08.870320 #4074263] INFO -- : [ 94/885] 4115146=test_sorted_set I, [2024-05-06T21:47:08.899818 #4074263] INFO -- : [ 95/885] 4115143=test_gem_resolver_vendor_set I, [2024-05-06T21:47:08.919793 #4074263] INFO -- : [ 96/885] 4115143=test_condition I, [2024-05-06T21:47:08.928024 #4074263] INFO -- : [ 97/885] 4115143=test_jaro_winkler I, [2024-05-06T21:47:08.935068 #4074263] INFO -- : [ 98/885] 4115143=test_cp949 I, [2024-05-06T21:47:08.946896 #4074263] INFO -- : [ 99/885] 4115143=test_fileutils I, [2024-05-06T21:47:09.085023 #4074263] INFO -- : [100/885] 4115146=test_sleep I, [2024-05-06T21:47:09.269534 #4074263] INFO -- : Leaked file descriptor: TestFileUtils#test_chown: 8 # I, [2024-05-06T21:47:09.294440 #4074263] INFO -- : COMMAND PID USER FD TYPE DEVICE SIZE/OFF NODE NAME I, [2024-05-06T21:47:09.294514 #4074263] INFO -- : ruby 4115143 opc 8r REG 252,0 6940392 13705429 /var/lib/sss/mc/group I, [2024-05-06T21:47:09.395993 #4074263] INFO -- : Leaked file descriptor: TestFileUtils#test_chown_error: 9 # I, [2024-05-06T21:47:09.422120 #4074263] INFO -- : COMMAND PID USER FD TYPE DEVICE SIZE/OFF NODE NAME I, [2024-05-06T21:47:09.422193 #4074263] INFO -- : ruby 4115143 opc 9r REG 252,0 9253600 13705411 /var/lib/sss/mc/passwd I, [2024-05-06T21:47:09.558968 #4074263] INFO -- : [101/885] 4115143=test_mixed_unicode_escapes I, [2024-05-06T21:47:09.566753 #4074263] INFO -- : [102/885] 4115143=test_gem_dependency_resolution_error I, [2024-05-06T21:47:09.575588 #4074263] INFO -- : [103/885] 4115143=test_econv I, [2024-05-06T21:47:10.433772 #4074263] INFO -- : [104/885] 4115143=test_gem_install_update_options I, [2024-05-06T21:47:10.575364 #4074263] INFO -- : [105/885] 4115143=test_gem_request_set_lockfile_parser I, [2024-05-06T21:47:11.129826 #4074263] INFO -- : [106/885] 4115143=test_sizeof I, [2024-05-06T21:47:11.134754 #4074263] INFO -- : [107/885] 4115146=test_date_attr I, [2024-05-06T21:47:11.141181 #4074263] INFO -- : [108/885] 4115146=test_face I, [2024-05-06T21:47:11.162497 #4074263] INFO -- : [109/885] 4115146=warnings_test I, [2024-05-06T21:47:11.262576 #4074263] INFO -- : [110/885] 4115146=test_stringchar I, [2024-05-06T21:47:11.274767 #4074263] INFO -- : [111/885] 4115146=test_pkey_rsa I, [2024-05-06T21:47:11.545694 #4074263] INFO -- : [112/885] 4115146=test_flush I, [2024-05-06T21:47:11.710959 #4074263] INFO -- : [113/885] 4115146=test_system I, [2024-05-06T21:47:12.447392 #4074263] INFO -- : [114/885] 4115146=test_numhash I, [2024-05-06T21:47:12.471551 #4074263] INFO -- : [115/885] 4115146=test_gem_specification I, [2024-05-06T21:47:13.132795 #4074263] INFO -- : [116/885] 4115143=test_method_cache I, [2024-05-06T21:47:13.138176 #4074263] INFO -- : [117/885] 4115143=test_parse I, [2024-05-06T21:47:13.656103 #4074263] INFO -- : [118/885] 4115143=test_rdoc_cross_reference I, [2024-05-06T21:47:14.056558 #4074263] INFO -- : [119/885] 4115143=test_rdoc_class_module I, [2024-05-06T21:47:14.551804 #4074263] INFO -- : [120/885] 4115143=test_win32ole_variable I, [2024-05-06T21:47:14.558114 #4074263] INFO -- : [121/885] 4115143=test_gem_command I, [2024-05-06T21:47:14.673245 #4074263] INFO -- : [122/885] 4115143=test_asn1 I, [2024-05-06T21:47:14.704105 #4074263] INFO -- : [123/885] 4115143=test_random I, [2024-05-06T21:47:14.710776 #4074263] INFO -- : [124/885] 4115143=test_gem_resolver_lock_set I, [2024-05-06T21:47:14.740741 #4074263] INFO -- : [125/885] 4115143=test_rdoc_generator_darkfish I, [2024-05-06T21:47:14.863409 #4074263] INFO -- : [126/885] 4115146=test_undef I, [2024-05-06T21:47:14.864405 #4074263] INFO -- : [127/885] 4115146=test_emoji_breaks I, [2024-05-06T21:47:14.873479 #4074263] INFO -- : [128/885] 4115146=test_normalize I, [2024-05-06T21:47:14.884800 #4074263] INFO -- : [129/885] 4115146=test_gem_commands_open_command I, [2024-05-06T21:47:14.986601 #4074263] INFO -- : [130/885] 4115146=test_verbose I, [2024-05-06T21:47:15.032014 #4074263] INFO -- : [131/885] 4115146=test_gem_update_suggestion I, [2024-05-06T21:47:15.079695 #4074263] INFO -- : [132/885] 4115143=test_assignment I, [2024-05-06T21:47:15.143011 #4074263] INFO -- : [133/885] 4115146=test_hash I, [2024-05-06T21:47:15.170463 #4074263] INFO -- : [134/885] 4115146=test_variable I, [2024-05-06T21:47:15.222279 #4074263] INFO -- : [135/885] 4115144=test_optarg I, [2024-05-06T21:47:15.272057 #4074263] INFO -- : [136/885] 4115146=test_gem_commands_pristine_command I, [2024-05-06T21:47:15.293220 #4074263] INFO -- : [137/885] 4115144=test_rdoc_tom_doc I, [2024-05-06T21:47:15.316887 #4074263] INFO -- : [138/885] 4115144=test_gem_resolver_git_specification I, [2024-05-06T21:47:15.626831 #4074263] INFO -- : [139/885] 4115144=test_utf32 I, [2024-05-06T21:47:15.638719 #4074263] INFO -- : [140/885] 4115144=test_basicinstructions I, [2024-05-06T21:47:15.814576 #4074263] INFO -- : [141/885] 4115144=test_date_ractor I, [2024-05-06T21:47:15.930658 #4074263] INFO -- : [142/885] 4115144=test_erb I, [2024-05-06T21:47:15.982692 #4074263] INFO -- : [143/885] 4115144=test_gem_security I, [2024-05-06T21:47:16.336876 #4074263] INFO -- : [144/885] 4115143=test_key_actor_emacs I, [2024-05-06T21:47:16.503327 #4074263] INFO -- : [145/885] 4115143=test_pp I, [2024-05-06T21:47:16.550442 #4074263] INFO -- : [146/885] 4115143=test_gem_impossible_dependencies_error I, [2024-05-06T21:47:16.555113 #4074263] INFO -- : [147/885] 4115143=test_noarg I, [2024-05-06T21:47:16.704231 #4074263] INFO -- : [148/885] 4115146=test_exception I, [2024-05-06T21:47:16.731597 #4074263] INFO -- : [149/885] 4115146=test_arith_seq_beg_len_step I, [2024-05-06T21:47:16.765089 #4074263] INFO -- : [150/885] 4115143=test_raise_exception I, [2024-05-06T21:47:16.768833 #4074263] INFO -- : [151/885] 4115146=memsize_test I, [2024-05-06T21:47:16.776451 #4074263] INFO -- : [152/885] 4115146=test_gem_resolver_requirement_list I, [2024-05-06T21:47:16.792969 #4074263] INFO -- : [153/885] 4115146=test_method_name_check I, [2024-05-06T21:47:16.808061 #4074263] INFO -- : [154/885] 4115146=test_err_in_callback I, [2024-05-06T21:47:16.816666 #4074263] INFO -- : [155/885] 4115146=test_storage I, [2024-05-06T21:47:16.825881 #4074263] INFO -- : [156/885] 4115146=test_merge_keys I, [2024-05-06T21:47:16.836302 #4074263] INFO -- : [157/885] 4115146=test_did_you_mean I, [2024-05-06T21:47:16.949638 #4074263] INFO -- : [158/885] 4115146=test_shapes I, [2024-05-06T21:47:16.959005 #4074263] INFO -- : [159/885] 4115146=test_cesu8 I, [2024-05-06T21:47:16.988309 #4074263] INFO -- : [160/885] 4115146=test_rdoc_extend I, [2024-05-06T21:47:17.064644 #4074263] INFO -- : [161/885] 4115146=test_rendering I, [2024-05-06T21:47:17.102530 #4074263] INFO -- : [162/885] 4115146=test_kernel I, [2024-05-06T21:47:17.331415 #4074263] INFO -- : [163/885] 4115143=test_dot_dot I, [2024-05-06T21:47:17.349353 #4074263] INFO -- : [164/885] 4115143=test_gem_rdoc I, [2024-05-06T21:47:17.528091 #4074263] INFO -- : [165/885] 4115143=pattern_test I, [2024-05-06T21:47:17.548128 #4074263] INFO -- : [166/885] 4115143=test_string I, [2024-05-06T21:47:17.559600 #4074263] INFO -- : [167/885] 4115143=test_iterator I, [2024-05-06T21:47:17.642802 #4074263] INFO -- : [168/885] 4115143=test_gem_commands_install_command I, [2024-05-06T21:47:17.692223 #4074263] INFO -- : [169/885] 4115146=test_forwardable I, [2024-05-06T21:47:17.714533 #4074263] INFO -- : [170/885] 4115146=test_process I, [2024-05-06T21:47:17.731755 #4074263] INFO -- : [171/885] 4115146=test_fd_setsize I, [2024-05-06T21:47:17.733725 #4074263] INFO -- : [172/885] 4115146=!Nothing_to_test I, [2024-05-06T21:47:17.742009 #4074263] INFO -- : [173/885] 4115146=test_memory_view I, [2024-05-06T21:47:17.997912 #4074263] INFO -- : [174/885] 4115146=test_dir_m17n I, [2024-05-06T21:47:19.160938 #4074263] INFO -- : [175/885] 4115146=test_array_create I, [2024-05-06T21:47:19.166627 #4074263] INFO -- : [176/885] 4115146=test_threadgroup I, [2024-05-06T21:47:19.482145 #4074263] INFO -- : [177/885] 4115143=test_complex I, [2024-05-06T21:47:19.549514 #4074263] INFO -- : [178/885] 4115143=test_gem_resolver_api_specification I, [2024-05-06T21:47:19.601434 #4074263] INFO -- : [179/885] 4115143=test_rdoc_rubygems_hook I, [2024-05-06T21:47:19.678279 #4074263] INFO -- : [180/885] 4115143=test_ractor I, [2024-05-06T21:47:19.691835 #4074263] INFO -- : [181/885] 4115143=test_webauthn_listener I, [2024-05-06T21:47:19.721211 #4074263] INFO -- : Leaked file descriptor: WebauthnListenerTest#test_wait_for_otp_code_options_request: 14 : # I, [2024-05-06T21:47:19.755105 #4074263] INFO -- : COMMAND PID USER FD TYPE DEVICE SIZE/OFF NODE NAME I, [2024-05-06T21:47:19.755171 #4074263] INFO -- : ruby 4115143 opc 14u IPv4 2870800795 0t0 TCP localhost:37837->localhost:47294 (CLOSE_WAIT) I, [2024-05-06T21:47:19.795548 #4074263] INFO -- : Closed file descriptor: WebauthnListenerTest#test_wait_for_otp_code_get_follows_options: 14 I, [2024-05-06T21:47:19.826265 #4074263] INFO -- : [182/885] 4115143=test_gem_ext_cargo_builder_unit I, [2024-05-06T21:47:19.860842 #4074263] INFO -- : [183/885] 4115143=test_rational I, [2024-05-06T21:47:19.872110 #4074263] INFO -- : [184/885] 4115143=test_case_mapping I, [2024-05-06T21:47:19.876679 #4074263] INFO -- : [185/885] 4115143=test_thread I, [2024-05-06T21:47:19.882280 #4074263] INFO -- : [186/885] 4115143=test_arity I, [2024-05-06T21:47:19.891354 #4074263] INFO -- : [187/885] 4115143=test_pkey_ec I, [2024-05-06T21:47:19.912680 #4074263] INFO -- : [188/885] 4115143=test_svcb_https I, [2024-05-06T21:47:19.917976 #4074263] INFO -- : [189/885] 4115143=test_buffering I, [2024-05-06T21:47:19.919573 #4074263] INFO -- : [190/885] 4115143=test_key_event_record I, [2024-05-06T21:47:19.922918 #4074263] INFO -- : [191/885] 4115143=test_mdns I, [2024-05-06T21:47:19.985188 #4074263] INFO -- : [192/885] 4115143=test_open3 I, [2024-05-06T21:47:20.212862 #4074263] INFO -- : [193/885] 4115146=test_date_parse I, [2024-05-06T21:47:20.492527 #4074263] INFO -- : [194/885] 4115146=test_gbk I, [2024-05-06T21:47:20.497438 #4074263] INFO -- : [195/885] 4115146=test_backtrace I, [2024-05-06T21:47:20.513898 #4074263] INFO -- : [196/885] 4115146=test_gem_commands_dependency_command I, [2024-05-06T21:47:20.620711 #4074263] INFO -- : [197/885] 4115146=test_gem_spec_fetcher I, [2024-05-06T21:47:20.823302 #4074263] INFO -- : [198/885] 4115146=test_yamldbm I, [2024-05-06T21:47:20.872439 #4074263] INFO -- : [199/885] 4115146=test_default_gems I, [2024-05-06T21:47:20.886644 #4074263] INFO -- : [200/885] 4115146=test_switch_hitter I, [2024-05-06T21:47:20.896438 #4074263] INFO -- : [201/885] 4115146=test_unicode_escape I, [2024-05-06T21:47:20.982778 #4074263] INFO -- : [202/885] 4115146=test_grapheme_breaks I, [2024-05-06T21:47:21.046669 #4074263] INFO -- : [203/885] 4115146=test_hash_create I, [2024-05-06T21:47:21.068915 #4074263] INFO -- : [204/885] 4115146=test_set I, [2024-05-06T21:47:21.091446 #4074263] INFO -- : [205/885] 4115146=test_enumerable I, [2024-05-06T21:47:21.111065 #4074263] INFO -- : [206/885] 4115146=test_rdoc_method_attr I, [2024-05-06T21:47:21.219131 #4074263] INFO -- : [207/885] 4115146=test_tree_spell_checker I, [2024-05-06T21:47:21.236580 #4074263] INFO -- : [208/885] 4115146=static_literals_test I, [2024-05-06T21:47:21.244692 #4074263] INFO -- : [209/885] 4115146=test_dryrun I, [2024-05-06T21:47:21.293357 #4074263] INFO -- : [210/885] 4115146=test_gc_compact I, [2024-05-06T21:47:22.607138 #4074263] INFO -- : [211/885] 4115143=test_rdoc_i18n_locale I, [2024-05-06T21:47:22.620730 #4074263] INFO -- : [212/885] 4115143=test_queue I, [2024-05-06T21:47:22.626232 #4074263] INFO -- : [213/885] 4115143=test_boolean I, [2024-05-06T21:47:22.644608 #4074263] INFO -- : [214/885] 4115143=test_gem_resolver_lock_specification I, [2024-05-06T21:47:22.855381 #4074263] INFO -- : [215/885] 4115143=test_clone I, [2024-05-06T21:47:22.885906 #4074263] INFO -- : [216/885] 4115143=test_enc_raise I, [2024-05-06T21:47:22.894248 #4074263] INFO -- : [217/885] 4115143=test_prettyprint I, [2024-05-06T21:47:22.917991 #4074263] INFO -- : [218/885] 4115143=test_gem_uri_formatter I, [2024-05-06T21:47:22.951654 #4074263] INFO -- : [219/885] 4115143=test_cgi_util I, [2024-05-06T21:47:23.142580 #4074263] INFO -- : [220/885] 4115143=test_ole_methods I, [2024-05-06T21:47:23.161078 #4074263] INFO -- : [221/885] 4115143=test_rdoc_store I, [2024-05-06T21:47:23.891759 #4074263] INFO -- : [222/885] 4115143=test_shift_jis I, [2024-05-06T21:47:24.027609 #4074263] INFO -- : [223/885] 4115143=test_rubyoptions I, [2024-05-06T21:47:24.367915 #4074263] INFO -- : [224/885] 4115146=test_files_sample I, [2024-05-06T21:47:24.379374 #4074263] INFO -- : [225/885] 4115146=test_rdoc_stats I, [2024-05-06T21:47:24.501956 #4074263] INFO -- : [226/885] 4115146=test_data_error I, [2024-05-06T21:47:24.571867 #4074263] INFO -- : [227/885] 4115146=test_optimization I, [2024-05-06T21:47:27.298653 #4074263] INFO -- : [228/885] 4115144=test_force_exit I, [2024-05-06T21:47:27.347058 #4074263] INFO -- : [229/885] 4115144=regexp_test I, [2024-05-06T21:47:27.369664 #4074263] INFO -- : [230/885] 4115144=test_remote_fetch_error I, [2024-05-06T21:47:27.389066 #4074263] INFO -- : [231/885] 4115144=test_show_source I, [2024-05-06T21:47:27.406483 #4074263] INFO -- : [232/885] 4115144=test_yield I, [2024-05-06T21:47:30.051092 #4074263] INFO -- : [233/885] 4115143=test_bash_completion I, [2024-05-06T21:47:30.093175 #4074263] INFO -- : [234/885] 4115143=test_exception I, [2024-05-06T21:47:30.257616 #4074263] INFO -- : [235/885] 4115144=test_rdoc_markup_to_html_crossref I, [2024-05-06T21:47:30.563333 #4074263] INFO -- : [236/885] 4115144=test_files_test_2 I, [2024-05-06T21:47:31.217896 #4074263] INFO -- : [237/885] 4115146=test_div I, [2024-05-06T21:47:31.224592 #4074263] INFO -- : [238/885] 4115146=test_deprecated I, [2024-05-06T21:47:31.232206 #4074263] INFO -- : [239/885] 4115146=test_rdoc_context_section I, [2024-05-06T21:47:31.279846 #4074263] INFO -- : [240/885] 4115146=test_io_buffer I, [2024-05-06T21:47:31.383254 #4074263] INFO -- : [241/885] 4115146=test_optparse I, [2024-05-06T21:47:31.397320 #4074263] INFO -- : [242/885] 4115146=test_gem_commands_environment_command I, [2024-05-06T21:47:31.475905 #4074263] INFO -- : [243/885] 4115146=test_pkcs7 I, [2024-05-06T21:47:31.627363 #4074263] INFO -- : [244/885] 4115146=test_pack I, [2024-05-06T21:47:31.804988 #4074263] INFO -- : [245/885] 4115146=test_class_name_check I, [2024-05-06T21:47:31.886074 #4074263] INFO -- : [246/885] 4115146=test_scalar I, [2024-05-06T21:47:31.906605 #4074263] INFO -- : [247/885] 4115146=test_syntax I, [2024-05-06T21:47:33.092447 #4074263] INFO -- : [248/885] 4115143=test_zsh_completion I, [2024-05-06T21:47:33.099644 #4074263] INFO -- : [249/885] 4115143=test_basicsocket I, [2024-05-06T21:47:33.109481 #4074263] INFO -- : [250/885] 4115143=test_gem_commands_cert_command I, [2024-05-06T21:47:33.212562 #4074263] INFO -- : [251/885] 4115144=ruby_parser_test I, [2024-05-06T21:47:33.226084 #4074263] INFO -- : [252/885] 4115144=test_gem_commands_stale_command I, [2024-05-06T21:47:33.264356 #4074263] INFO -- : [253/885] 4115144=test_ws I, [2024-05-06T21:47:33.279921 #4074263] INFO -- : [254/885] 4115144=test_date_strftime I, [2024-05-06T21:47:33.723341 #4074263] INFO -- : [255/885] 4115144=json_parser_test I, [2024-05-06T21:47:33.745229 #4074263] INFO -- : [256/885] 4115144=test_rdoc_markup_to_tt_only I, [2024-05-06T21:47:33.779525 #4074263] INFO -- : [257/885] 4115144=test_rdoc_markup_to_bs I, [2024-05-06T21:47:33.826354 #4074263] INFO -- : [258/885] 4115144=test_key_name_check I, [2024-05-06T21:47:33.833973 #4074263] INFO -- : [259/885] 4115144=test_rdoc_markup_raw I, [2024-05-06T21:47:33.869186 #4074263] INFO -- : [260/885] 4115144=test_timeout I, [2024-05-06T21:47:34.741434 #4074263] INFO -- : [261/885] 4115144=test_rdoc_alias I, [2024-05-06T21:47:34.752403 #4074263] INFO -- : [262/885] 4115144=test_weakref I, [2024-05-06T21:47:34.806227 #4074263] INFO -- : [263/885] 4115143=test_instrumentation_api I, [2024-05-06T21:47:35.001187 #4074263] INFO -- : [264/885] 4115144=test_fstring I, [2024-05-06T21:47:35.057387 #4074263] INFO -- : [265/885] 4115144=test_numeric I, [2024-05-06T21:47:35.066574 #4074263] INFO -- : [266/885] 4115144=test_singleton I, [2024-05-06T21:47:35.073703 #4074263] INFO -- : [267/885] 4115144=test_word I, [2024-05-06T21:47:35.204233 #4074263] INFO -- : [268/885] 4115144=test_gem_ext_rake_builder I, [2024-05-06T21:47:35.699538 #4074263] INFO -- : [269/885] 4115144=test_rdoc_require I, [2024-05-06T21:47:35.710478 #4074263] INFO -- : [270/885] 4115144=test_pkey_dh I, [2024-05-06T21:47:37.034455 #4074263] INFO -- : [271/885] 4115144=test_multi_irb_commands I, [2024-05-06T21:47:37.097127 #4074263] INFO -- : [272/885] 4115144=test_m17n_comb I, [2024-05-06T21:47:37.810854 #4074263] INFO -- : [273/885] 4115143=test_null I, [2024-05-06T21:47:37.869140 #4074263] INFO -- : [274/885] 4115143=test_ractor I, [2024-05-06T21:47:37.880815 #4074263] INFO -- : [275/885] 4115143=test_memory_view I, [2024-05-06T21:47:37.901342 #4074263] INFO -- : [276/885] 4115143=test_data I, [2024-05-06T21:47:37.909774 #4074263] INFO -- : [277/885] 4115143=test_bigzero I, [2024-05-06T21:47:37.919275 #4074263] INFO -- : [278/885] 4115143=test_gem_commands_query_command I, [2024-05-06T21:47:38.580185 #4074263] INFO -- : [279/885] 4115143=test_gem_platform I, [2024-05-06T21:47:38.707444 #4074263] INFO -- : [280/885] 4115143=test_win32ole_typelib I, [2024-05-06T21:47:38.713815 #4074263] INFO -- : [281/885] 4115143=test_external_new I, [2024-05-06T21:47:38.721238 #4074263] INFO -- : [282/885] 4115143=test_pkey I, [2024-05-06T21:47:38.739390 #4074263] INFO -- : [283/885] 4115143=test_thread I, [2024-05-06T21:47:38.761525 #4074263] INFO -- : [284/885] 4115146=test_gem_util I, [2024-05-06T21:47:38.918118 #4074263] INFO -- : [285/885] 4115146=test_gem_security_signer I, [2024-05-06T21:47:38.951787 #4074263] INFO -- : [286/885] 4115143=test_config I, [2024-05-06T21:47:39.008352 #4074263] INFO -- : [287/885] 4115143=test_complex2 I, [2024-05-06T21:47:39.016003 #4074263] INFO -- : [288/885] 4115143=test_literal I, [2024-05-06T21:47:39.023269 #4074263] INFO -- : [289/885] 4115146=test_gem_unsatisfiable_dependency_error I, [2024-05-06T21:47:39.056036 #4074263] INFO -- : [290/885] 4115146=test_io I, [2024-05-06T21:47:39.272577 #4074263] INFO -- : [291/885] 4115146=test_rdoc_i18n_text I, [2024-05-06T21:47:39.299559 #4074263] INFO -- : [292/885] 4115146=test_input_method I, [2024-05-06T21:47:39.380158 #4074263] INFO -- : [293/885] 4115146=test_pack I, [2024-05-06T21:47:39.561052 #4074263] INFO -- : [294/885] 4115143=test_io_wait I, [2024-05-06T21:47:39.607665 #4074263] INFO -- : [295/885] 4115146=test_kwargs I, [2024-05-06T21:47:39.619265 #4074263] INFO -- : [296/885] 4115146=test_rdoc_parser_c I, [2024-05-06T21:47:39.874300 #4074263] INFO -- : [297/885] 4115146=parse_test I, [2024-05-06T21:47:39.906769 #4074263] INFO -- : [298/885] 4115143=json_fixtures_test I, [2024-05-06T21:47:39.918107 #4074263] INFO -- : [299/885] 4115143=test_gem_doctor I, [2024-05-06T21:47:39.968217 #4074263] INFO -- : [300/885] 4115143=test_len I, [2024-05-06T21:47:39.977321 #4074263] INFO -- : [301/885] 4115143=test_gem_dependency_list I, [2024-05-06T21:47:40.013233 #4074263] INFO -- : [302/885] 4115144=test_gem_commands_outdated_command I, [2024-05-06T21:47:40.078570 #4074263] INFO -- : [303/885] 4115144=parameters_signature_test I, [2024-05-06T21:47:40.088791 #4074263] INFO -- : [304/885] 4115143=test_rdoc_parser_changelog I, [2024-05-06T21:47:40.099048 #4074263] INFO -- : [305/885] 4115144=test_gem_commands_fetch_command I, [2024-05-06T21:47:40.166061 #4074263] INFO -- : [306/885] 4115143=test_typeddata I, [2024-05-06T21:47:40.295844 #4074263] INFO -- : [307/885] 4115144=test_tsort I, [2024-05-06T21:47:40.317023 #4074263] INFO -- : [308/885] 4115144=test_securerandom I, [2024-05-06T21:47:40.348308 #4074263] INFO -- : [309/885] 4115144=test_rdoc_markup_attributes I, [2024-05-06T21:47:40.355427 #4074263] INFO -- : [310/885] 4115144=redundant_return_test I, [2024-05-06T21:47:40.362263 #4074263] INFO -- : [311/885] 4115144=test_random_formatter I, [2024-05-06T21:47:40.364911 #4074263] INFO -- : [312/885] 4115144=test_string_processing I, [2024-05-06T21:47:40.380032 #4074263] INFO -- : [313/885] 4115144=test_rand I, [2024-05-06T21:47:40.405103 #4074263] INFO -- : [314/885] 4115143=test_bmethod I, [2024-05-06T21:47:40.416014 #4074263] INFO -- : [315/885] 4115143=test_gem_source_specific_file I, [2024-05-06T21:47:40.568909 #4074263] INFO -- : [316/885] 4115143=test_provider I, [2024-05-06T21:47:40.570260 #4074263] INFO -- : [317/885] 4115143=test_euc_kr I, [2024-05-06T21:47:40.582772 #4074263] INFO -- : [318/885] 4115143=test_rdoc_code_object I, [2024-05-06T21:47:40.680704 #4074263] INFO -- : [319/885] 4115144=test_process I, [2024-05-06T21:47:40.930532 #4074263] INFO -- : [320/885] 4115143=test_postponed_job I, [2024-05-06T21:47:41.244843 #4074263] INFO -- : [321/885] 4115143=test_key_actor_vi I, [2024-05-06T21:47:41.316041 #4074263] INFO -- : [322/885] 4115143=test_rdoc_markdown I, [2024-05-06T21:47:41.592602 #4074263] INFO -- : [323/885] 4115143=test_gem_request_set_lockfile I, [2024-05-06T21:47:42.074128 #4074263] INFO -- : [324/885] 4115143=test_rdoc_encoding I, [2024-05-06T21:47:42.118061 #4074263] INFO -- : [325/885] 4115143=test_win32ole_variant_outarg I, [2024-05-06T21:47:42.121095 #4074263] INFO -- : [326/885] 4115143=test_generic I, [2024-05-06T21:47:42.160016 #4074263] INFO -- : [327/885] 4115143=test_common I, [2024-05-06T21:47:42.323115 #4074263] INFO -- : [328/885] 4115143=test_rdoc_markup_to_html_snippet I, [2024-05-06T21:47:42.401445 #4074263] INFO -- : [329/885] 4115143=test_httpresponses I, [2024-05-06T21:47:42.410165 #4074263] INFO -- : [330/885] 4115143=test_deprecate I, [2024-05-06T21:47:42.462880 #4074263] INFO -- : [331/885] 4115143=test_rdoc_constant I, [2024-05-06T21:47:42.570363 #4074263] INFO -- : [332/885] 4115143=test_rdoc_text I, [2024-05-06T21:47:42.622676 #4074263] INFO -- : [333/885] 4115143=library_symbols_test I, [2024-05-06T21:47:42.623328 #4074263] INFO -- : [334/885] 4115143=test_require I, [2024-05-06T21:47:42.624816 #4074263] INFO -- : [335/885] 4115143=test_stringify_symbols I, [2024-05-06T21:47:42.638932 #4074263] INFO -- : [336/885] 4115143=test_objspace I, [2024-05-06T21:47:43.317138 #4074263] INFO -- : [337/885] 4115146=test_have_library I, [2024-05-06T21:47:44.164624 #4074263] INFO -- : [338/885] 4115146=test_stream I, [2024-05-06T21:47:44.176214 #4074263] INFO -- : [339/885] 4115146=test_ns_spki I, [2024-05-06T21:47:44.190578 #4074263] INFO -- : [340/885] 4115146=test_rdoc_markup_parser I, [2024-05-06T21:47:44.271278 #4074263] INFO -- : [341/885] 4115146=test_iseq_load I, [2024-05-06T21:47:45.273346 #4074263] INFO -- : Leaked file descriptor: TestProcess#test_seteuid_name: 7 # I, [2024-05-06T21:47:45.297647 #4074263] INFO -- : COMMAND PID USER FD TYPE DEVICE SIZE/OFF NODE NAME I, [2024-05-06T21:47:45.297721 #4074263] INFO -- : ruby 4115144 opc 7r REG 252,0 9253600 13705411 /var/lib/sss/mc/passwd I, [2024-05-06T21:47:45.366278 #4074263] INFO -- : [342/885] 4115146=test_rdoc_markup_indented_paragraph I, [2024-05-06T21:47:45.375726 #4074263] INFO -- : [343/885] 4115146=test_reqarg I, [2024-05-06T21:47:45.861802 #4074263] INFO -- : [344/885] 4115146=test_gem_ext_ext_conf_builder I, [2024-05-06T21:47:46.856977 #4074263] INFO -- : [345/885] 4115146=test_gem_version I, [2024-05-06T21:47:47.015998 #4074263] INFO -- : [346/885] 4115146=test_spell_checker I, [2024-05-06T21:47:47.022412 #4074263] INFO -- : [347/885] 4115146=test_frozen_error I, [2024-05-06T21:47:47.027686 #4074263] INFO -- : [348/885] 4115146=test_path_to_class I, [2024-05-06T21:47:47.033143 #4074263] INFO -- : [349/885] 4115146=test_enumerator I, [2024-05-06T21:47:47.039617 #4074263] INFO -- : [350/885] 4115146=test_yield_block I, [2024-05-06T21:47:47.047325 #4074263] INFO -- : [351/885] 4115146=test_bug-5832 I, [2024-05-06T21:47:47.093990 #4074263] INFO -- : [352/885] 4115146=test_c_struct_builder I, [2024-05-06T21:47:47.305806 #4074263] INFO -- : [353/885] 4115146=test_gem_package_tar_reader_entry I, [2024-05-06T21:47:47.596751 #4074263] INFO -- : [354/885] 4115146=test_resource I, [2024-05-06T21:47:47.614535 #4074263] INFO -- : [355/885] 4115146=test_gem_uri I, [2024-05-06T21:47:47.662421 #4074263] INFO -- : [356/885] 4115146=test_gem_version_option I, [2024-05-06T21:47:47.737087 #4074263] INFO -- : [357/885] 4115146=test_rdoc_include I, [2024-05-06T21:47:47.761015 #4074263] INFO -- : [358/885] 4115146=test_win32ole_record I, [2024-05-06T21:47:47.766040 #4074263] INFO -- : [359/885] 4115146=test_date_compat I, [2024-05-06T21:47:47.783084 #4074263] INFO -- : [360/885] 4115146=test_pstore I, [2024-05-06T21:47:47.986223 #4074263] INFO -- : [361/885] 4115146=test_ubf_async_safe I, [2024-05-06T21:47:48.000111 #4074263] INFO -- : [362/885] 4115146=test_rdoc_options I, [2024-05-06T21:47:48.306092 #4074263] INFO -- : [363/885] 4115146=test_zlib I, [2024-05-06T21:47:48.996335 #4074263] INFO -- : Leaked file descriptor: TestProcess#test_uid_from_name: 9 # I, [2024-05-06T21:47:49.025841 #4074263] INFO -- : COMMAND PID USER FD TYPE DEVICE SIZE/OFF NODE NAME I, [2024-05-06T21:47:49.025919 #4074263] INFO -- : ruby 4115144 opc 9u unix 0x0000000000000000 0t0 2870810013 type=STREAM I, [2024-05-06T21:47:55.258002 #4074263] INFO -- : [364/885] 4115146=test_console_attr I, [2024-05-06T21:47:55.320807 #4074263] INFO -- : [365/885] 4115146=test_proc I, [2024-05-06T21:47:56.216395 #4074263] INFO -- : [366/885] 4115146=test_gem_ext_cargo_builder I, [2024-05-06T21:47:56.248266 #4074263] INFO -- : [367/885] 4115146=test_gem_commands_unpack_command I, [2024-05-06T21:47:56.677923 #4074263] INFO -- : [368/885] 4115146=test_time I, [2024-05-06T21:47:56.796301 #4074263] INFO -- : [369/885] 4115146=test_file I, [2024-05-06T21:47:56.813619 #4074263] INFO -- : [370/885] 4115146=test_nextafter I, [2024-05-06T21:47:56.919753 #4074263] INFO -- : [371/885] 4115146=test_gem_commands_owner_command I, [2024-05-06T21:47:57.600968 #4074263] INFO -- : [372/885] 4115146=test_capacity I, [2024-05-06T21:47:57.619344 #4074263] INFO -- : [373/885] 4115146=test_init I, [2024-05-06T21:47:57.899673 #4074263] INFO -- : [374/885] 4115146=test_gem_request_connection_pools I, [2024-05-06T21:47:58.954351 #4074263] INFO -- : [375/885] 4115146=test_rat I, [2024-05-06T21:47:58.971637 #4074263] INFO -- : [376/885] 4115146=test_numeric I, [2024-05-06T21:47:59.037186 #4074263] INFO -- : [377/885] 4115146=test_yamlstore I, [2024-05-06T21:47:59.058322 #4074263] INFO -- : [378/885] 4115146=test_bug-3571 I, [2024-05-06T21:47:59.080671 #4074263] INFO -- : [379/885] 4115146=test_flags I, [2024-05-06T21:47:59.157641 #4074263] INFO -- : [380/885] 4115144=test_rdoc_generator_markup I, [2024-05-06T21:47:59.168779 #4074263] INFO -- : [381/885] 4115144=test_find I, [2024-05-06T21:47:59.257525 #4074263] INFO -- : [382/885] 4115144=test_constant I, [2024-05-06T21:47:59.641761 #4074263] INFO -- : [383/885] 4115146=test_hmac I, [2024-05-06T21:47:59.652938 #4074263] INFO -- : [384/885] 4115146=test_encoding I, [2024-05-06T21:47:59.844053 #4074263] INFO -- : [385/885] 4115146=test_gem_commands_server_command I, [2024-05-06T21:47:59.855495 #4074263] INFO -- : [386/885] 4115146=test_gem_resolver_activation_request I, [2024-05-06T21:47:59.921141 #4074263] INFO -- : [387/885] 4115146=test_function I, [2024-05-06T21:48:00.151141 #4074263] INFO -- : [388/885] 4115146=test_string I, [2024-05-06T21:48:01.218875 #4074263] INFO -- : [389/885] 4115144=test_macro I, [2024-05-06T21:48:01.224326 #4074263] INFO -- : [390/885] 4115144=test_pipe I, [2024-05-06T21:48:01.342406 #4074263] INFO -- : [391/885] 4115144=test_gem_requirement I, [2024-05-06T21:48:01.501409 #4074263] INFO -- : [392/885] 4115144=parse_comments_test I, [2024-05-06T21:48:01.506627 #4074263] INFO -- : [393/885] 4115144=test_win32ole_method_event I, [2024-05-06T21:48:01.511443 #4074263] INFO -- : [394/885] 4115144=test_tcp I, [2024-05-06T21:48:01.638987 #4074263] INFO -- : [395/885] 4115144=test_integer I, [2024-05-06T21:48:01.648421 #4074263] INFO -- : [396/885] 4115144=test_rdoc_markup_to_table_of_contents I, [2024-05-06T21:48:01.691578 #4074263] INFO -- : [397/885] 4115144=test_gem_name_tuple I, [2024-05-06T21:48:01.722212 #4074263] INFO -- : [398/885] 4115144=test_pathname I, [2024-05-06T21:48:01.966313 #4074263] INFO -- : [399/885] 4115144=test_fnmatch I, [2024-05-06T21:48:02.018644 #4074263] INFO -- : [400/885] 4115144=test_tempfile I, [2024-05-06T21:48:02.250710 #4074263] INFO -- : [401/885] 4115144=test_http_request I, [2024-05-06T21:48:02.276029 #4074263] INFO -- : [402/885] 4115144=test_coverage I, [2024-05-06T21:48:02.888769 #4074263] INFO -- : [403/885] 4115144=test_store I, [2024-05-06T21:48:03.273224 #4074263] INFO -- : [404/885] 4115144=test_rdoc_markup_pre_process I, [2024-05-06T21:48:03.356312 #4074263] INFO -- : [405/885] 4115144=test_tree_builder I, [2024-05-06T21:48:03.363022 #4074263] INFO -- : [406/885] 4115144=test_protect I, [2024-05-06T21:48:03.371002 #4074263] INFO -- : [407/885] 4115144=test_big5 I, [2024-05-06T21:48:03.379080 #4074263] INFO -- : [408/885] 4115144=test_date I, [2024-05-06T21:48:03.436495 #4074263] INFO -- : [409/885] 4115144=test_gem_commands_update_command I, [2024-05-06T21:48:05.033877 #4074263] INFO -- : [410/885] 4115144=test_date_conv I, [2024-05-06T21:48:05.045828 #4074263] INFO -- : [411/885] 4115144=test_webauthn_poller I, [2024-05-06T21:48:05.213117 #4074263] INFO -- : [412/885] 4115144=test_rdoc_markup_verbatim I, [2024-05-06T21:48:05.272975 #4074263] INFO -- : [413/885] 4115144=test_egrep_cpp I, [2024-05-06T21:48:05.324555 #4074263] INFO -- : [414/885] 4115144=test_serialize_subclasses I, [2024-05-06T21:48:05.337479 #4074263] INFO -- : [415/885] 4115144=test_gem_resolver_index_specification I, [2024-05-06T21:48:05.439482 #4074263] INFO -- : [416/885] 4115144=test_frozen I, [2024-05-06T21:48:05.447773 #4074263] INFO -- : [417/885] 4115144=test_rdoc_generator_pot_po_entry I, [2024-05-06T21:48:05.459331 #4074263] INFO -- : [418/885] 4115144=test_erb_m17n I, [2024-05-06T21:48:05.467811 #4074263] INFO -- : [419/885] 4115144=test_timeout I, [2024-05-06T21:48:05.472657 #4074263] INFO -- : [420/885] 4115144=test_enumerator_kw I, [2024-05-06T21:48:05.477682 #4074263] INFO -- : [421/885] 4115144=test_marshalable I, [2024-05-06T21:48:05.485495 #4074263] INFO -- : [422/885] 4115144=test_line_editor I, [2024-05-06T21:48:05.492068 #4074263] INFO -- : [423/885] 4115144=reflection_test I, [2024-05-06T21:48:05.494107 #4074263] INFO -- : [424/885] 4115144=test_files_lib I, [2024-05-06T21:48:05.502458 #4074263] INFO -- : [425/885] 4115144=test_help I, [2024-05-06T21:48:05.552573 #4074263] INFO -- : [426/885] 4115144=test_string_memory I, [2024-05-06T21:48:05.646126 #4074263] INFO -- : [427/885] 4115144=test_complexrational I, [2024-05-06T21:48:05.649547 #4074263] INFO -- : [428/885] 4115144=test_raise I, [2024-05-06T21:48:05.653106 #4074263] INFO -- : [429/885] 4115144=version_test I, [2024-05-06T21:48:05.663855 #4074263] INFO -- : [430/885] 4115144=json_common_interface_test I, [2024-05-06T21:48:05.677839 #4074263] INFO -- : [431/885] 4115144=test_string I, [2024-05-06T21:48:05.691910 #4074263] INFO -- : [432/885] 4115144=test_function_entry I, [2024-05-06T21:48:05.710094 #4074263] INFO -- : [433/885] 4115144=test_rdoc_any_method I, [2024-05-06T21:48:06.134032 #4074263] INFO -- : [434/885] 4115144=test_error_highlight I, [2024-05-06T21:48:06.722313 #4074263] INFO -- : [435/885] 4115144=test_psych I, [2024-05-06T21:48:06.748902 #4074263] INFO -- : [436/885] 4115144=test_nil I, [2024-05-06T21:48:06.756984 #4074263] INFO -- : [437/885] 4115144=test_wait I, [2024-05-06T21:48:06.860470 #4074263] INFO -- : [438/885] 4115144=test_import I, [2024-05-06T21:48:08.726963 #4074263] INFO -- : [439/885] 4115144=test_human_typo I, [2024-05-06T21:48:08.736562 #4074263] INFO -- : [440/885] 4115144=test_gem_resolver_specification I, [2024-05-06T21:48:08.764161 #4074263] INFO -- : [441/885] 4115144=test_big2str I, [2024-05-06T21:48:08.773827 #4074263] INFO -- : [442/885] 4115144=test_pkey_dsa I, [2024-05-06T21:48:12.361980 #4074263] INFO -- : [443/885] 4115144=test_logger I, [2024-05-06T21:48:12.387968 #4074263] INFO -- : [444/885] 4115144=test_gem_commands_yank_command I, [2024-05-06T21:48:12.919009 #4074263] INFO -- : [445/885] 4115144=test_yaml_tree I, [2024-05-06T21:48:12.943594 #4074263] INFO -- : [446/885] 4115144=test_gem_resolver_dependency_request I, [2024-05-06T21:48:12.989761 #4074263] INFO -- : [447/885] 4115144=test_command I, [2024-05-06T21:48:13.282702 #4074263] INFO -- : [448/885] 4115144=test_euc_tw I, [2024-05-06T21:48:13.296276 #4074263] INFO -- : [449/885] 4115144=test_cstr I, [2024-05-06T21:48:14.772420 #4074263] INFO -- : [450/885] 4115144=test_yjit_exit_locations I, [2024-05-06T21:48:14.782842 #4074263] INFO -- : [451/885] 4115144=test_rdoc_rdoc I, [2024-05-06T21:48:15.003073 #4074263] INFO -- : [452/885] 4115144=test_rdoc_markdown_test I, [2024-05-06T21:48:16.115931 #4074263] INFO -- : [453/885] 4115144=test_io_timeout I, [2024-05-06T21:48:16.129512 #4074263] INFO -- : [454/885] 4115144=test_rdoc_normal_module I, [2024-05-06T21:48:16.163085 #4074263] INFO -- : [455/885] 4115144=test_type_completor I, [2024-05-06T21:48:16.173958 #4074263] INFO -- : [456/885] 4115144=test_gem_config_file I, [2024-05-06T21:48:16.395806 #4074263] INFO -- : [457/885] 4115144=json_string_matching_test I, [2024-05-06T21:48:16.405334 #4074263] INFO -- : [458/885] 4115144=test_comparable I, [2024-05-06T21:48:16.412604 #4074263] INFO -- : [459/885] 4115144=test_ldap I, [2024-05-06T21:48:16.422441 #4074263] INFO -- : [460/885] 4115144=test_kdf I, [2024-05-06T21:48:16.494776 #4074263] INFO -- : [461/885] 4115144=test_nowrite I, [2024-05-06T21:48:16.521765 #4074263] INFO -- : [462/885] 4115144=test_passing_block I, [2024-05-06T21:48:16.538270 #4074263] INFO -- : [463/885] 4115144=test_defined I, [2024-05-06T21:48:16.625827 #4074263] INFO -- : [464/885] 4115144=test_thread_queue I, [2024-05-06T21:48:17.771215 #4074263] INFO -- : [465/885] 4115143=test_io_buffer I, [2024-05-06T21:48:17.869588 #4074263] INFO -- : [466/885] 4115143=test_gem_commands_exec_command I, [2024-05-06T21:48:19.113537 #4074263] INFO -- : [467/885] 4115143=unescape_test I, [2024-05-06T21:48:20.413540 #4074263] INFO -- : [468/885] 4115143=test_color_printer I, [2024-05-06T21:48:20.423234 #4074263] INFO -- : [469/885] 4115143=test_super I, [2024-05-06T21:48:21.723317 #4074263] INFO -- : [470/885] 4115143=test_gem_source_vendor I, [2024-05-06T21:48:21.743067 #4074263] INFO -- : [471/885] 4115143=test_gem_resolver I, [2024-05-06T21:48:22.054287 #4074263] INFO -- : [472/885] 4115143=test_object I, [2024-05-06T21:48:22.368119 #4074263] INFO -- : [473/885] 4115143=test_dln I, [2024-05-06T21:48:22.425717 #4074263] INFO -- : [474/885] 4115143=test_func I, [2024-05-06T21:48:23.200903 #4074263] INFO -- : [475/885] 4115144=test_config I, [2024-05-06T21:48:23.239150 #4074263] INFO -- : [476/885] 4115144=json_encoding_test I, [2024-05-06T21:48:23.241103 #4074263] INFO -- : [477/885] 4115144=test_vm_dump I, [2024-05-06T21:48:23.250344 #4074263] INFO -- : [478/885] 4115144=test_pkg_config I, [2024-05-06T21:48:23.267960 #4074263] INFO -- : [479/885] 4115144=test_gem_available_set I, [2024-05-06T21:48:23.373125 #4074263] INFO -- : [480/885] 4115144=test_modify_expand I, [2024-05-06T21:48:24.416622 #4074263] INFO -- : [481/885] 4115144=test_convertible I, [2024-05-06T21:48:26.473782 #4074263] INFO -- : [482/885] 4115143=errors_test I, [2024-05-06T21:48:26.611595 #4074263] INFO -- : [483/885] 4115143=test_insns_leaf I, [2024-05-06T21:48:26.721576 #4074263] INFO -- : [484/885] 4115143=test_allocation I, [2024-05-06T21:48:26.888695 #4074263] INFO -- : [485/885] 4115146=test_ifunless I, [2024-05-06T21:48:26.899990 #4074263] INFO -- : [486/885] 4115146=test_gem_console_ui I, [2024-05-06T21:48:26.909005 #4074263] INFO -- : [487/885] 4115146=test_x509req I, [2024-05-06T21:48:26.986595 #4074263] INFO -- : [488/885] 4115146=test_readpartial I, [2024-05-06T21:48:27.075690 #4074263] INFO -- : [489/885] 4115144=test_httpresponse I, [2024-05-06T21:48:27.118375 #4074263] INFO -- : [490/885] 4115144=test_rdoc_parser_ruby I, [2024-05-06T21:48:27.332693 #4074263] INFO -- : [491/885] 4115146=test_refinement I, [2024-05-06T21:48:27.863120 #4074263] INFO -- : [492/885] 4115144=test_transcode I, [2024-05-06T21:48:28.052281 #4074263] INFO -- : [493/885] 4115144=test_debug I, [2024-05-06T21:48:28.078808 #4074263] INFO -- : [494/885] 4115144=test_gem_commands_cleanup_command I, [2024-05-06T21:48:28.751862 #4074263] INFO -- : [495/885] 4115144=test_class2name I, [2024-05-06T21:48:28.759563 #4074263] INFO -- : [496/885] 4115144=test_pattern_key_name_check I, [2024-05-06T21:48:28.768641 #4074263] INFO -- : [497/885] 4115144=test_profile_frames I, [2024-05-06T21:48:28.945848 #4074263] INFO -- : [498/885] 4115144=test_rdoc_markup_heading I, [2024-05-06T21:48:28.946899 #4074263] INFO -- : [499/885] 4115144=test_flip I, [2024-05-06T21:48:28.980336 #4074263] INFO -- : [500/885] 4115144=test_io_console I, [2024-05-06T21:48:29.139478 #4074263] INFO -- : [501/885] 4115143=test_c_union_entity I, [2024-05-06T21:48:29.224151 #4074263] INFO -- : [502/885] 4115143=test_notimplement I, [2024-05-06T21:48:29.236219 #4074263] INFO -- : [503/885] 4115143=test_cgi_session I, [2024-05-06T21:48:29.250430 #4074263] INFO -- : [504/885] 4115143=test_dns I, [2024-05-06T21:48:29.705304 #4074263] INFO -- : [505/885] 4115143=test_x509crl I, [2024-05-06T21:48:29.797577 #4074263] INFO -- : [506/885] 4115143=test_win32ole_event I, [2024-05-06T21:48:29.827675 #4074263] INFO -- : [507/885] 4115143=test_gem_commands_uninstall_command I, [2024-05-06T21:48:30.597955 #4074263] INFO -- : [508/885] 4115143=test_rdoc_markup_formatter I, [2024-05-06T21:48:30.615868 #4074263] INFO -- : [509/885] 4115143=test_compile_prism I, [2024-05-06T21:48:30.887286 #4074263] INFO -- : [510/885] 4115143=test_helper I, [2024-05-06T21:48:30.905003 #4074263] INFO -- : [511/885] 4115143=test_getopts I, [2024-05-06T21:48:30.926483 #4074263] INFO -- : [512/885] 4115143=test_fips I, [2024-05-06T21:48:31.091908 #4074263] INFO -- : [513/885] 4115146=test_alias I, [2024-05-06T21:48:31.173466 #4074263] INFO -- : [514/885] 4115143=test_emitter I, [2024-05-06T21:48:31.202574 #4074263] INFO -- : [515/885] 4115143=test_gem_ext_cmake_builder I, [2024-05-06T21:48:31.213115 #4074263] INFO -- : [516/885] 4115143=test_digest_extend I, [2024-05-06T21:48:31.220915 #4074263] INFO -- : [517/885] 4115143=test_last_thread I, [2024-05-06T21:48:31.227160 #4074263] INFO -- : [518/885] 4115146=test_thread_fd_close I, [2024-05-06T21:48:31.238079 #4074263] INFO -- : [519/885] 4115146=test_gem_path_support I, [2024-05-06T21:48:31.327155 #4074263] INFO -- : [520/885] 4115146=test_arity I, [2024-05-06T21:48:31.332953 #4074263] INFO -- : [521/885] 4115146=test_win32ole_type_event I, [2024-05-06T21:48:31.353920 #4074263] INFO -- : [522/885] 4115146=test_keyword I, [2024-05-06T21:48:31.625012 #4074263] INFO -- : [523/885] 4115144=test_trace I, [2024-05-06T21:48:31.632838 #4074263] INFO -- : [524/885] 4115144=test_scalar_scanner I, [2024-05-06T21:48:31.644545 #4074263] INFO -- : [525/885] 4115144=test_lambda I, [2024-05-06T21:48:31.699984 #4074263] INFO -- : [526/885] 4115144=test_rb_str_dup I, [2024-05-06T21:48:31.718118 #4074263] INFO -- : [527/885] 4115144=test_file I, [2024-05-06T21:48:31.977554 #4074263] INFO -- : [528/885] 4115146=test_config I, [2024-05-06T21:48:32.272519 #4074263] INFO -- : [529/885] 4115146=test_summary I, [2024-05-06T21:48:32.277722 #4074263] INFO -- : [530/885] 4115143=test_helper_method I, [2024-05-06T21:48:32.330377 #4074263] INFO -- : [531/885] 4115143=bom_test I, [2024-05-06T21:48:32.339667 #4074263] INFO -- : [532/885] 4115146=test_x509ext I, [2024-05-06T21:48:32.341543 #4074263] INFO -- : [533/885] 4115146=test_emitter I, [2024-05-06T21:48:32.346599 #4074263] INFO -- : [534/885] 4115143=test_foreach I, [2024-05-06T21:48:32.349692 #4074263] INFO -- : [535/885] 4115146=test_rdoc_markup_to_html I, [2024-05-06T21:48:32.357888 #4074263] INFO -- : [536/885] 4115143=test_gem_resolver_installer_set I, [2024-05-06T21:48:32.451202 #4074263] INFO -- : [537/885] 4115146=test_append I, [2024-05-06T21:48:32.451708 #4074263] INFO -- : [538/885] 4115146=test_helper I, [2024-05-06T21:48:32.463100 #4074263] INFO -- : [539/885] 4115146=test_gem_resolver_api_set I, [2024-05-06T21:48:32.548417 #4074263] INFO -- : [540/885] 4115146=test_duplicate I, [2024-05-06T21:48:32.552425 #4074263] INFO -- : [541/885] 4115146=format_errors_test I, [2024-05-06T21:48:32.559441 #4074263] INFO -- : [542/885] 4115146=test_cgi_header I, [2024-05-06T21:48:32.570445 #4074263] INFO -- : [543/885] 4115146=test_case_options I, [2024-05-06T21:48:32.578138 #4074263] INFO -- : [544/885] 4115146=test_kill_ring I, [2024-05-06T21:48:32.581041 #4074263] INFO -- : [545/885] 4115146=test_addr I, [2024-05-06T21:48:32.596552 #4074263] INFO -- : [546/885] 4115146=test_mailto I, [2024-05-06T21:48:32.603478 #4074263] INFO -- : [547/885] 4115146=test_object I, [2024-05-06T21:48:32.608868 #4074263] INFO -- : [548/885] 4115146=test_member I, [2024-05-06T21:48:32.610297 #4074263] INFO -- : [549/885] 4115146=test_nofree I, [2024-05-06T21:48:32.619216 #4074263] INFO -- : [550/885] 4115146=test_whileuntil I, [2024-05-06T21:48:32.630028 #4074263] INFO -- : [551/885] 4115146=test_regexp I, [2024-05-06T21:48:32.683579 #4074263] INFO -- : [552/885] 4115143=test_rdoc_normal_class I, [2024-05-06T21:48:32.741601 #4074263] INFO -- : [553/885] 4115143=test_within_pipe I, [2024-05-06T21:48:32.811624 #4074263] INFO -- : [554/885] 4115143=test_pointer I, [2024-05-06T21:48:34.198094 #4074263] INFO -- : [555/885] 4115143=test_beginendblock I, [2024-05-06T21:48:34.504143 #4074263] INFO -- : [556/885] 4115143=test_monitor I, [2024-05-06T21:48:34.769402 #4074263] INFO -- : [557/885] 4115143=test_eval I, [2024-05-06T21:48:35.062355 #4074263] INFO -- : [558/885] 4115143=test_arith_seq_extract I, [2024-05-06T21:48:35.165346 #4074263] INFO -- : [559/885] 4115143=compiler_test I, [2024-05-06T21:48:35.171683 #4074263] INFO -- : [560/885] 4115143=test_ruby_lex I, [2024-05-06T21:48:35.291734 #4074263] INFO -- : [561/885] 4115143=test_object_references I, [2024-05-06T21:48:35.332801 #4074263] INFO -- : [562/885] 4115143=test_gem_source_subpath_problem I, [2024-05-06T21:48:35.445329 #4074263] INFO -- : [563/885] 4115143=test_gem_installer I, [2024-05-06T21:48:37.905068 #4074263] INFO -- : [564/885] 4115144=test_bug_reporter I, [2024-05-06T21:48:38.179220 #4074263] INFO -- : [565/885] 4115144=test_ossl I, [2024-05-06T21:48:40.318414 #4074263] INFO -- : [566/885] 4115143=test_buffered_io I, [2024-05-06T21:48:40.329902 #4074263] INFO -- : [567/885] 4115143=test_socket I, [2024-05-06T21:48:40.670917 #4074263] INFO -- : .Leaked thread: TestSocket#test_accept_loop: # I, [2024-05-06T21:48:40.672195 #4074263] INFO -- : Finished thread: TestSocket#test_unix: # I, [2024-05-06T21:48:41.294317 #4074263] INFO -- : [568/885] 4115143=test_terminfo I, [2024-05-06T21:48:41.300243 #4074263] INFO -- : [569/885] 4115143=test_inlinecache I, [2024-05-06T21:48:41.360377 #4074263] INFO -- : [570/885] 4115143=test_thread I, [2024-05-06T21:48:45.372401 #4074263] INFO -- : [571/885] 4115144=test_data I, [2024-05-06T21:48:45.438751 #4074263] INFO -- : [572/885] 4115144=test_bug-14834 I, [2024-05-06T21:48:45.447767 #4074263] INFO -- : [573/885] 4115144=test_addrinfo I, [2024-05-06T21:48:45.503671 #4074263] INFO -- : [574/885] 4115144=test_to_ruby I, [2024-05-06T21:48:45.528041 #4074263] INFO -- : [575/885] 4115144=test_time_tz I, [2024-05-06T21:48:45.588670 #4074263] INFO -- : [576/885] 4115144=test_gem_ext_builder I, [2024-05-06T21:48:46.657664 #4074263] INFO -- : [577/885] 4115144=test_history I, [2024-05-06T21:48:47.378604 #4074263] INFO -- : [578/885] 4115144=test_to_ary_concat I, [2024-05-06T21:48:49.748099 #4074263] INFO -- : [579/885] 4115144=test_windows_1251 I, [2024-05-06T21:48:49.782980 #4074263] INFO -- : [580/885] 4115144=test_gem_commands_build_command I, [2024-05-06T21:48:50.109140 #4074263] INFO -- : [581/885] 4115144=test_ellipsize I, [2024-05-06T21:48:50.141744 #4074263] INFO -- : [582/885] 4115144=test_call I, [2024-05-06T21:48:50.187754 #4074263] INFO -- : [583/885] 4115143=test_reline I, [2024-05-06T21:48:50.315510 #4074263] INFO -- : [584/885] 4115143=location_test I, [2024-05-06T21:48:50.384882 #4074263] INFO -- : [585/885] 4115144=test_chilled I, [2024-05-06T21:48:50.394035 #4074263] INFO -- : [586/885] 4115143=test_delegate I, [2024-05-06T21:48:50.452887 #4074263] INFO -- : [587/885] 4115144=test_project_sanity I, [2024-05-06T21:48:50.463105 #4074263] INFO -- : [588/885] 4115143=test_symbol I, [2024-05-06T21:48:50.470523 #4074263] INFO -- : [589/885] 4115144=test_alias_and_anchor I, [2024-05-06T21:48:50.472892 #4074263] INFO -- : [590/885] 4115144=test_popen_deadlock I, [2024-05-06T21:48:50.484024 #4074263] INFO -- : [591/885] 4115143=test_time I, [2024-05-06T21:48:50.655425 #4074263] INFO -- : [592/885] 4115143=test_ensured I, [2024-05-06T21:48:50.695155 #4074263] INFO -- : [593/885] 4115143=test_rdoc_markup I, [2024-05-06T21:48:50.707450 #4074263] INFO -- : [594/885] 4115143=test_key_stroke I, [2024-05-06T21:48:50.728385 #4074263] INFO -- : [595/885] 4115143=test_euc_jp I, [2024-05-06T21:48:50.759821 #4074263] INFO -- : [596/885] 4115143=test_sleep I, [2024-05-06T21:48:51.039089 #4074263] INFO -- : [597/885] 4115144=test_webauthn_listener_response I, [2024-05-06T21:48:51.068277 #4074263] INFO -- : [598/885] 4115144=ruby_api_test I, [2024-05-06T21:48:51.223811 #4074263] INFO -- : [599/885] 4115144=test_gem_resolver_index_set I, [2024-05-06T21:48:51.372206 #4074263] INFO -- : [600/885] 4115144=test_gc I, [2024-05-06T21:48:55.749694 #4074263] INFO -- : [601/885] 4115143=test_gem_request_set I, [2024-05-06T21:48:56.328628 #4074263] INFO -- : [602/885] 4115143=test_gem_bundler_version_finder I, [2024-05-06T21:48:56.369183 #4074263] INFO -- : [603/885] 4115143=test_folderitem2_invokeverb I, [2024-05-06T21:48:56.379226 #4074263] INFO -- : [604/885] 4115143=test_set_len I, [2024-05-06T21:48:56.390878 #4074263] INFO -- : [605/885] 4115143=constant_path_node_test I, [2024-05-06T21:48:56.398779 #4074263] INFO -- : [606/885] 4115143=test_interned_str I, [2024-05-06T21:48:56.424405 #4074263] INFO -- : [607/885] 4115143=test_pattern_matching I, [2024-05-06T21:48:56.443561 #4074263] INFO -- : [608/885] 4115143=test_date_new I, [2024-05-06T21:48:56.522038 #4074263] INFO -- : [609/885] 4115143=test_gem_commands_list_command I, [2024-05-06T21:48:56.539534 #4074263] INFO -- : [610/885] 4115143=test_gem_resolver_local_specification I, [2024-05-06T21:48:56.571811 #4074263] INFO -- : [611/885] 4115143=test_configuration I, [2024-05-06T21:48:56.735566 #4074263] INFO -- : [612/885] 4115143=test_date_marshal I, [2024-05-06T21:48:56.756402 #4074263] INFO -- : [613/885] 4115143=test_have_func I, [2024-05-06T21:48:57.996587 #4074263] INFO -- : [614/885] 4115143=test_unix I, [2024-05-06T21:48:58.044643 #4074263] INFO -- : [615/885] 4115143=test_integer I, [2024-05-06T21:48:59.218650 #4074263] INFO -- : [616/885] 4115146=test_symbol I, [2024-05-06T21:49:00.295894 #4074263] INFO -- : [617/885] 4115144=test_gem_commands_search_command I, [2024-05-06T21:49:00.307457 #4074263] INFO -- : [618/885] 4115144=test_rdoc_servlet I, [2024-05-06T21:49:00.405363 #4074263] INFO -- : [619/885] 4115144=test_coder I, [2024-05-06T21:49:00.428978 #4074263] INFO -- : [620/885] 4115144=test_gem_commands_contents_command I, [2024-05-06T21:49:00.548076 #4074263] INFO -- : [621/885] 4115144=test_context I, [2024-05-06T21:49:00.562260 #4074263] INFO -- : [622/885] 4115143=test_udp I, [2024-05-06T21:49:00.569822 #4074263] INFO -- : [623/885] 4115143=test_formatter I, [2024-05-06T21:49:00.584023 #4074263] INFO -- : [624/885] 4115143=test_range I, [2024-05-06T21:49:00.671003 #4074263] INFO -- : [625/885] 4115144=test_gem_commands_signin_command I, [2024-05-06T21:49:00.870109 #4074263] INFO -- : [626/885] 4115144=test_extlibs I, [2024-05-06T21:49:01.384564 #4074263] INFO -- : [627/885] 4115143=test_iter_break I, [2024-05-06T21:49:01.391936 #4074263] INFO -- : [628/885] 4115143=test_rdoc_markup_include I, [2024-05-06T21:49:01.404450 #4074263] INFO -- : [629/885] 4115143=test_enum I, [2024-05-06T21:49:02.401348 #4074263] INFO -- : [630/885] 4115144=test_recursion I, [2024-05-06T21:49:02.405959 #4074263] INFO -- : [631/885] 4115144=test_require I, [2024-05-06T21:49:02.423325 #4074263] INFO -- : [632/885] 4115143=test_rbconfig I, [2024-05-06T21:49:02.436953 #4074263] INFO -- : [633/885] 4115143=test_num2int I, [2024-05-06T21:49:02.447994 #4074263] INFO -- : [634/885] 4115143=test_locale I, [2024-05-06T21:49:02.474608 #4074263] INFO -- : [635/885] 4115143=test_ts I, [2024-05-06T21:49:02.758859 #4074263] INFO -- : [636/885] 4115143=test_stream I, [2024-05-06T21:49:02.780555 #4074263] INFO -- : [637/885] 4115143=test_trick I, [2024-05-06T21:49:03.843768 #4074263] INFO -- : [638/885] 4115144=test_ractor I, [2024-05-06T21:49:03.871987 #4074263] INFO -- : [639/885] 4115144=test_address_resolve I, [2024-05-06T21:49:03.898255 #4074263] INFO -- : [640/885] 4115144=test_rdoc_attr I, [2024-05-06T21:49:03.916782 #4074263] INFO -- : [641/885] 4115144=test_ansi_without_terminfo I, [2024-05-06T21:49:03.929375 #4074263] INFO -- : [642/885] 4115144=json_generator_test I, [2024-05-06T21:49:04.045713 #4074263] INFO -- : [643/885] 4115144=test_ractor I, [2024-05-06T21:49:04.047970 #4074263] INFO -- : [644/885] 4115144=test_registry I, [2024-05-06T21:49:04.067838 #4074263] INFO -- : [645/885] 4115144=test_gem I, [2024-05-06T21:49:04.316282 #4074263] INFO -- : [646/885] 4115146=test_gem_resolver_best_set I, [2024-05-06T21:49:04.412748 #4074263] INFO -- : [647/885] 4115146=test_cgi_core I, [2024-05-06T21:49:04.419038 #4074263] INFO -- : [648/885] 4115146=test_parser I, [2024-05-06T21:49:04.441464 #4074263] INFO -- : [649/885] 4115146=test_rdoc_markup_to_label I, [2024-05-06T21:49:04.500380 #4074263] INFO -- : [650/885] 4115146=test_rdoc_markup_hard_break I, [2024-05-06T21:49:04.519064 #4074263] INFO -- : [651/885] 4115146=test_nesting_parser I, [2024-05-06T21:49:04.532511 #4074263] INFO -- : [652/885] 4115146=test_marshal I, [2024-05-06T21:49:05.200757 #4074263] INFO -- : [653/885] 4115143=test_ancdata I, [2024-05-06T21:49:05.259592 #4074263] INFO -- : [654/885] 4115143=ractor_test I, [2024-05-06T21:49:05.265916 #4074263] INFO -- : [655/885] 4115143=test_enc_str_buf_cat I, [2024-05-06T21:49:05.275320 #4074263] INFO -- : [656/885] 4115143=test_bignum I, [2024-05-06T21:49:05.738940 #4074263] INFO -- : [657/885] 4115146=newline_test I, [2024-05-06T21:49:05.835810 #4074263] INFO -- : [658/885] 4115146=test_ssl I, [2024-05-06T21:49:06.004302 #4074263] INFO -- : [659/885] 4115146=test_gem_commands_help_command I, [2024-05-06T21:49:06.082685 #4074263] INFO -- : [660/885] 4115146=test_scheduler I, [2024-05-06T21:49:06.239710 #4074263] INFO -- : [661/885] 4115146=test_gem_resolver_conflict I, [2024-05-06T21:49:06.279739 #4074263] INFO -- : [662/885] 4115146=test_ractor I, [2024-05-06T21:49:06.429951 #4074263] INFO -- : [663/885] 4115144=test_gem_gem_runner I, [2024-05-06T21:49:06.518582 #4074263] INFO -- : [664/885] 4115144=test_require_lib I, [2024-05-06T21:49:06.606289 #4074263] INFO -- : [665/885] 4115146=test_metaclass I, [2024-05-06T21:49:06.618502 #4074263] INFO -- : [666/885] 4115146=test_x509store I, [2024-05-06T21:49:07.139845 #4074263] INFO -- : [667/885] 4115146=test_rdoc_rd_block_parser I, [2024-05-06T21:49:07.197677 #4074263] INFO -- : [668/885] 4115146=test_rdoc_markup_to_markdown I, [2024-05-06T21:49:07.251125 #4074263] INFO -- : [669/885] 4115146=test_rdoc_markup_to_joined_paragraph I, [2024-05-06T21:49:07.257800 #4074263] INFO -- : [670/885] 4115146=test_rdoc_generator_pot I, [2024-05-06T21:49:07.269957 #4074263] INFO -- : [671/885] 4115146=test_rdoc_rd I, [2024-05-06T21:49:07.279610 #4074263] INFO -- : [672/885] 4115146=test_cgi_cookie I, [2024-05-06T21:49:07.286156 #4074263] INFO -- : [673/885] 4115146=test_not I, [2024-05-06T21:49:07.297949 #4074263] INFO -- : [674/885] 4115146=test_tracer I, [2024-05-06T21:49:07.304523 #4074263] INFO -- : [675/885] 4115146=test_wss I, [2024-05-06T21:49:07.316052 #4074263] INFO -- : [676/885] 4115146=test_rdoc_markup_attribute_manager I, [2024-05-06T21:49:07.426423 #4074263] INFO -- : [677/885] 4115146=test_option I, [2024-05-06T21:49:07.468421 #4074263] INFO -- : [678/885] 4115146=test_require I, [2024-05-06T21:49:08.897924 #4074263] INFO -- : [679/885] 4115143=test_objectspace I, [2024-05-06T21:49:09.484128 #4074263] INFO -- : [680/885] 4115144=test_gem_resolver_composed_set I, [2024-05-06T21:49:09.501220 #4074263] INFO -- : [681/885] 4115144=test_my_integer I, [2024-05-06T21:49:09.516365 #4074263] INFO -- : [682/885] 4115144=test_debugger_integration I, [2024-05-06T21:49:09.523683 #4074263] INFO -- : [683/885] 4115144=test_update I, [2024-05-06T21:49:09.539450 #4074263] INFO -- : [684/885] 4115144=test_cipher I, [2024-05-06T21:49:09.612850 #4074263] INFO -- : [685/885] 4115144=test_new I, [2024-05-06T21:49:09.625471 #4074263] INFO -- : [686/885] 4115144=test_gem_source_lock I, [2024-05-06T21:49:09.685122 #4074263] INFO -- : [687/885] 4115144=test_load I, [2024-05-06T21:49:09.690676 #4074263] INFO -- : [688/885] 4115144=test_win32ole_type I, [2024-05-06T21:49:09.697750 #4074263] INFO -- : [689/885] 4115144=test_rdoc_rd_inline_parser I, [2024-05-06T21:49:09.768776 #4074263] INFO -- : [690/885] 4115144=test_cparser I, [2024-05-06T21:49:09.881687 #4074263] INFO -- : [691/885] 4115143=test_rubyvm I, [2024-05-06T21:49:09.892615 #4074263] INFO -- : [692/885] 4115143=fuzzer_test I, [2024-05-06T21:49:09.918363 #4074263] INFO -- : [693/885] 4115143=test_c_struct_entry I, [2024-05-06T21:49:10.039729 #4074263] INFO -- : [694/885] 4115146=static_inspect_test I, [2024-05-06T21:49:10.054137 #4074263] INFO -- : [695/885] 4115146=test_struct I, [2024-05-06T21:49:10.061656 #4074263] INFO -- : [696/885] 4115146=test_custom_command I, [2024-05-06T21:49:10.071199 #4074263] INFO -- : [697/885] 4115146=test_rdoc_parser_markdown I, [2024-05-06T21:49:10.088758 #4074263] INFO -- : [698/885] 4115146=test_depth_first I, [2024-05-06T21:49:10.093717 #4074263] INFO -- : [699/885] 4115146=test_change_word I, [2024-05-06T21:49:10.107332 #4074263] INFO -- : [700/885] 4115146=test_config I, [2024-05-06T21:49:10.169491 #4074263] INFO -- : [701/885] 4115146=test_ostruct I, [2024-05-06T21:49:10.306054 #4074263] INFO -- : [702/885] 4115146=test_load I, [2024-05-06T21:49:10.310471 #4074263] INFO -- : Leaked file descriptor: TestOptionParserLoad#test_load_nothing: 11 # I, [2024-05-06T21:49:10.349201 #4074263] INFO -- : COMMAND PID USER FD TYPE DEVICE SIZE/OFF NODE NAME I, [2024-05-06T21:49:10.349331 #4074263] INFO -- : ruby 4115146 opc 11r REG 252,0 9253600 13705411 /var/lib/sss/mc/passwd I, [2024-05-06T21:49:10.413092 #4074263] INFO -- : [703/885] 4115146=test_bundled_ca I, [2024-05-06T21:49:10.797576 #4074263] INFO -- : [704/885] 4115143=test_integer_comb I, [2024-05-06T21:49:11.884792 #4074263] INFO -- : [705/885] 4115144=test_abi I, [2024-05-06T21:49:12.087144 #4074263] INFO -- : [706/885] 4115144=test_ssl I, [2024-05-06T21:49:12.876549 #4074263] INFO -- : [707/885] 4115146=test_module I, [2024-05-06T21:49:13.486090 #4074263] INFO -- : [708/885] 4115143=test_erb_command I, [2024-05-06T21:49:13.535928 #4074263] INFO -- : [709/885] 4115143=test_gem_security_trust_dir I, [2024-05-06T21:49:13.609884 #4074263] INFO -- : [710/885] 4115143=test_gem_source_installed I, [2024-05-06T21:49:13.623033 #4074263] INFO -- : [711/885] 4115143=test_gem_validator I, [2024-05-06T21:49:13.687844 #4074263] INFO -- : [712/885] 4115143=test_usrmarshal I, [2024-05-06T21:49:13.841631 #4074263] INFO -- : [713/885] 4115143=test_key_error I, [2024-05-06T21:49:13.852728 #4074263] INFO -- : [714/885] 4115143=test_win32ole_param I, [2024-05-06T21:49:13.859421 #4074263] INFO -- : [715/885] 4115143=test_gem_commands_mirror I, [2024-05-06T21:49:13.876165 #4074263] INFO -- : [716/885] 4115143=test_fiber I, [2024-05-06T21:49:15.770283 #4074263] INFO -- : [717/885] 4115146=test_engine I, [2024-05-06T21:49:16.168553 #4074263] INFO -- : [718/885] 4115146=test_lock_native_thread I, [2024-05-06T21:49:16.429692 #4074263] INFO -- : [719/885] 4115146=test_gem_package_task I, [2024-05-06T21:49:16.441942 #4074263] INFO -- : [720/885] 4115146=test_resize I, [2024-05-06T21:49:16.452893 #4074263] INFO -- : [721/885] 4115146=test_gem_ext_cargo_builder_link_flag_converter I, [2024-05-06T21:49:16.534235 #4074263] INFO -- : [722/885] 4115146=test_gem_local_remote_options I, [2024-05-06T21:49:16.593742 #4074263] INFO -- : [723/885] 4115146=test_rdoc_single_class I, [2024-05-06T21:49:16.599444 #4074263] INFO -- : [724/885] 4115146=test_dup I, [2024-05-06T21:49:16.749204 #4074263] INFO -- : [725/885] 4115146=test_acceptable I, [2024-05-06T21:49:16.806905 #4074263] INFO -- : [726/885] 4115146=test_tmpdir I, [2024-05-06T21:49:16.882119 #4074263] INFO -- : [727/885] 4115146=test_struct I, [2024-05-06T21:49:17.391827 #4074263] INFO -- : [728/885] 4115146=test_rdoc_token_stream I, [2024-05-06T21:49:17.456671 #4074263] INFO -- : [729/885] 4115146=test_mutex I, [2024-05-06T21:49:18.532082 #4074263] INFO -- : [730/885] 4115146=test_type I, [2024-05-06T21:49:18.543525 #4074263] INFO -- : [731/885] 4115146=heredoc_dedent_test I, [2024-05-06T21:49:18.550244 #4074263] INFO -- : [732/885] 4115146=json_generic_object_test I, [2024-05-06T21:49:18.607811 #4074263] INFO -- : [733/885] 4115146=test_fiddle I, [2024-05-06T21:49:18.769626 #4074263] INFO -- : [734/885] 4115146=test_date_arith I, [2024-05-06T21:49:18.781470 #4074263] INFO -- : [735/885] 4115146=test_gem_resolver_vendor_specification I, [2024-05-06T21:49:18.816974 #4074263] INFO -- : [736/885] 4115146=test_exception_at_throwing I, [2024-05-06T21:49:18.875366 #4074263] INFO -- : [737/885] 4115146=test_gem_resolver_installed_specification I, [2024-05-06T21:49:18.908574 #4074263] INFO -- : [738/885] 4115146=test_ractor I, [2024-05-06T21:49:18.975023 #4074263] INFO -- : [739/885] 4115146=test_stringscanner I, [2024-05-06T21:49:19.040022 #4074263] INFO -- : [740/885] 4115146=test_gem_commands_check_command I, [2024-05-06T21:49:19.073338 #4074263] INFO -- : [741/885] 4115146=test_gem_resolver_git_set I, [2024-05-06T21:49:19.842430 #4074263] INFO -- : [742/885] 4115146=test_signedness I, [2024-05-06T21:49:20.046565 #4074263] INFO -- : [743/885] 4115143=test_digest I, [2024-05-06T21:49:20.843702 #4074263] INFO -- : [744/885] 4115143=test_gem_safe_marshal I, [2024-05-06T21:49:21.575785 #4074263] INFO -- : [745/885] 4115146=test_sexp I, [2024-05-06T21:49:21.604111 #4074263] INFO -- : [746/885] 4115146=test_httpheader I, [2024-05-06T21:49:21.628373 #4074263] INFO -- : [747/885] 4115146=test_ractor I, [2024-05-06T21:49:21.684511 #4074263] INFO -- : [748/885] 4115146=test_rdoc_ri_driver I, [2024-05-06T21:49:21.806858 #4074263] INFO -- : [749/885] 4115143=test_gem_request_set_gem_dependency_api I, [2024-05-06T21:49:22.085372 #4074263] INFO -- : [750/885] 4115146=test_name_error_extension I, [2024-05-06T21:49:22.096840 #4074263] INFO -- : [751/885] 4115146=test_weakkeymap I, [2024-05-06T21:49:22.259116 #4074263] INFO -- : [752/885] 4115143=test_files_test I, [2024-05-06T21:49:22.268366 #4074263] INFO -- : [753/885] 4115143=test_protocol I, [2024-05-06T21:49:22.494993 #4074263] INFO -- : [754/885] 4115144=test_evaluation I, [2024-05-06T21:49:22.503242 #4074263] INFO -- : [755/885] 4115144=test_rdoc_markup_to_ansi I, [2024-05-06T21:49:22.532949 #4074263] INFO -- : [756/885] 4115146=test_object_create_start I, [2024-05-06T21:49:22.536847 #4074263] INFO -- : [757/885] 4115146=test_https I, [2024-05-06T21:49:22.556179 #4074263] INFO -- : [758/885] 4115144=test_gem_commands_info_command I, [2024-05-06T21:49:22.570994 #4074263] INFO -- : [759/885] 4115144=test_logdevice I, [2024-05-06T21:49:22.575226 #4074263] INFO -- : [760/885] 4115143=test_ast I, [2024-05-06T21:49:22.762554 #4074263] INFO -- : [761/885] 4115146=test_x509cert I, [2024-05-06T21:49:22.918655 #4074263] INFO -- : [762/885] 4115146=test_rdoc_markup_paragraph I, [2024-05-06T21:49:22.921541 #4074263] INFO -- : [763/885] 4115146=test_irb I, [2024-05-06T21:49:23.211957 #4074263] INFO -- : [764/885] 4115146=test_bn I, [2024-05-06T21:49:23.229930 #4074263] INFO -- : [765/885] 4115146=test_variable_name_check I, [2024-05-06T21:49:23.351912 #4074263] INFO -- : [766/885] 4115146=test_require_path_check I, [2024-05-06T21:49:23.519367 #4074263] INFO -- : [767/885] 4115146=test_case_comprehensive I, [2024-05-06T21:49:23.552851 #4074263] INFO -- : [768/885] 4115144=test_logperiod I, [2024-05-06T21:49:23.595330 #4074263] INFO -- : [769/885] 4115144=test_rational2 I, [2024-05-06T21:49:23.643703 #4074263] INFO -- : [770/885] 4115144=test_placearg I, [2024-05-06T21:49:23.720582 #4074263] INFO -- : [771/885] 4115144=test_gem_package_tar_header I, [2024-05-06T21:49:23.799987 #4074263] INFO -- : [772/885] 4115144=test_ssl_session I, [2024-05-06T21:49:24.676339 #4074263] INFO -- : [773/885] 4115144=test_io_wait_uncommon I, [2024-05-06T21:49:24.696241 #4074263] INFO -- : [774/885] 4115144=test_signal I, [2024-05-06T21:49:26.784177 #4074263] INFO -- : [775/885] 4115144=test_gem_silent_ui I, [2024-05-06T21:49:26.839488 #4074263] INFO -- : [776/885] 4115144=test_fixnum I, [2024-05-06T21:49:26.854878 #4074263] INFO -- : [777/885] 4115144=test_continuation I, [2024-05-06T21:49:26.874836 #4074263] INFO -- : [778/885] 4115144=test_gem_ci_detector I, [2024-05-06T21:49:26.887034 #4074263] INFO -- : [779/885] 4115144=test_completion I, [2024-05-06T21:49:28.123479 #4074263] INFO -- : [780/885] 4115144=test_file_exhaustive I, [2024-05-06T21:49:39.042545 #4074263] INFO -- : [781/885] 4115144=test_delete I, [2024-05-06T21:49:39.060151 #4074263] INFO -- : [782/885] 4115144=test_rdoc_markup_document I, [2024-05-06T21:49:39.082857 #4074263] INFO -- : [783/885] 4115144=test_gem_security_policy I, [2024-05-06T21:49:39.563065 #4074263] INFO -- : [784/885] 4115144=test_handle I, [2024-05-06T21:49:40.556647 #4074263] INFO -- : [785/885] 4115144=parse_stream_test I, [2024-05-06T21:49:40.560747 #4074263] INFO -- : [786/885] 4115144=test_history I, [2024-05-06T21:49:40.600795 #4074263] INFO -- : [787/885] 4115144=test_gem_commands_setup_command I, [2024-05-06T21:49:41.439710 #4074263] INFO -- : [788/885] 4115144=test_gem_safe_yaml I, [2024-05-06T21:49:41.448587 #4074263] INFO -- : [789/885] 4115144=test_eval I, [2024-05-06T21:49:41.467068 #4074263] INFO -- : [790/885] 4115144=test_document I, [2024-05-06T21:49:41.470229 #4074263] INFO -- : [791/885] 4115144=test_singleton_function I, [2024-05-06T21:49:41.479656 #4074263] INFO -- : [792/885] 4115144=command_line_test I, [2024-05-06T21:49:41.487903 #4074263] INFO -- : [793/885] 4115144=test_env I, [2024-05-06T21:49:44.094876 #4074263] INFO -- : [794/885] 4115144=test_gem_commands_signout_command I, [2024-05-06T21:49:44.132028 #4074263] INFO -- : [795/885] 4115144=test_gem_package_tar_reader I, [2024-05-06T21:49:44.200976 #4074263] INFO -- : [796/885] 4115144=test_pair I, [2024-05-06T21:49:44.288062 #4074263] INFO -- : [797/885] 4115146=test_win32ole_variant_m I, [2024-05-06T21:49:44.289996 #4074263] INFO -- : [798/885] 4115146=test_primitive I, [2024-05-06T21:49:44.312645 #4074263] INFO -- : [799/885] 4115146=test_rdoc_ri_paths I, [2024-05-06T21:49:44.337137 #4074263] INFO -- : [800/885] 4115146=test_parser I, [2024-05-06T21:49:44.374624 #4074263] INFO -- : [801/885] 4115146=test_iseq I, [2024-05-06T21:49:44.946026 #4074263] INFO -- : [802/885] 4115146=integer_parse_test I, [2024-05-06T21:49:44.962579 #4074263] INFO -- : [803/885] 4115146=test_autoconf I, [2024-05-06T21:49:44.979611 #4074263] INFO -- : [804/885] 4115146=test_arithmetic_sequence I, [2024-05-06T21:49:45.025172 #4074263] INFO -- : [805/885] 4115146=test_ractor_compatibility I, [2024-05-06T21:49:45.368825 #4074263] INFO -- : [806/885] 4115146=test_find_executable I, [2024-05-06T21:49:45.372952 #4074263] INFO -- : [807/885] 4115146=test_lazy_enumerator I, [2024-05-06T21:49:45.884167 #4074263] INFO -- : [808/885] 4115146=test_cgi_multipart I, [2024-05-06T21:49:46.012203 #4074263] INFO -- : [809/885] 4115146=test_gem_request_set_lockfile_tokenizer I, [2024-05-06T21:49:46.116347 #4074263] INFO -- : [810/885] 4115146=test_gem_source_fetch_problem I, [2024-05-06T21:49:46.128213 #4074263] INFO -- : [811/885] 4115146=test_rdoc_comment I, [2024-05-06T21:49:46.183424 #4074263] INFO -- : [812/885] 4115146=test_encoding I, [2024-05-06T21:49:46.247509 #4074263] INFO -- : [813/885] 4115146=test_install I, [2024-05-06T21:49:46.378114 #4074263] INFO -- : [814/885] 4115146=test_ftp I, [2024-05-06T21:49:46.387460 #4074263] INFO -- : [815/885] 4115146=test_sockopt I, [2024-05-06T21:49:46.408958 #4074263] INFO -- : [816/885] 4115146=test_gem_package I, [2024-05-06T21:49:47.205035 #4074263] INFO -- : [817/885] 4115146=test_array I, [2024-05-06T21:49:49.574229 #4074263] INFO -- : [818/885] 4115144=test_autoload I, [2024-05-06T21:49:53.831442 #4074263] INFO -- : [819/885] 4115144=test_gem_source I, [2024-05-06T21:49:54.258290 #4074263] INFO -- : [820/885] 4115144=test_mkmf I, [2024-05-06T21:49:54.380250 #4074263] INFO -- : [821/885] 4115144=test_have_macro I, [2024-05-06T21:49:54.582467 #4074263] INFO -- : [822/885] 4115144=test_class I, [2024-05-06T21:49:54.593968 #4074263] INFO -- : [823/885] 4115144=test_benchmark I, [2024-05-06T21:49:56.317208 #4074263] INFO -- : [824/885] 4115144=test_at_exit I, [2024-05-06T21:49:56.321622 #4074263] INFO -- : [825/885] 4115144=test_assembler I, [2024-05-06T21:49:56.332385 #4074263] INFO -- : [826/885] 4115144=test_stringio I, [2024-05-06T21:49:56.457466 #4074263] INFO -- : [827/885] 4115144=test_thread_cv I, [2024-05-06T21:49:57.076646 #4074263] INFO -- : [828/885] 4115144=test_files_ext I, [2024-05-06T21:49:57.090714 #4074263] INFO -- : [829/885] 4115144=test_random I, [2024-05-06T21:49:57.126808 #4074263] INFO -- : [830/885] 4115144=test_regex_casefold I, [2024-05-06T21:49:57.541856 #4074263] INFO -- : [831/885] 4115144=test_lexer I, [2024-05-06T21:49:57.552644 #4074263] INFO -- : [832/885] 4115144=test_win32ole_method I, [2024-05-06T21:49:57.554724 #4074263] INFO -- : [833/885] 4115144=test_gem_source_git I, [2024-05-06T21:49:58.608861 #4074263] INFO -- : [834/885] 4115144=test_ripper I, [2024-05-06T21:49:58.956808 #4074263] INFO -- : [835/885] 4115144=dispatcher_test I, [2024-05-06T21:49:58.960051 #4074263] INFO -- : [836/885] 4115144=test_eval_history I, [2024-05-06T21:49:58.987327 #4074263] INFO -- : [837/885] 4115144=test_unicode I, [2024-05-06T21:49:59.013714 #4074263] INFO -- : [838/885] 4115144=test_color I, [2024-05-06T21:49:59.094712 #4074263] INFO -- : [839/885] 4115144=test_rdoc_top_level I, [2024-05-06T21:49:59.412160 #4074263] INFO -- : [840/885] 4115144=test_io_m17n I, [2024-05-06T21:50:00.727413 #4074263] INFO -- : [841/885] 4115144=test_gem_stub_specification I, [2024-05-06T21:50:00.934021 #4074263] INFO -- : [842/885] 4115144=test_float I, [2024-05-06T21:50:02.990901 #4074263] INFO -- : [843/885] 4115144=test_cmethod I, [2024-05-06T21:50:03.000309 #4074263] INFO -- : [844/885] 4115144=test_unicode_normalize I, [2024-05-06T21:50:07.226994 #4074263] INFO -- : [845/885] 4115144=test_rdoc_generator_ri I, [2024-05-06T21:50:07.258903 #4074263] INFO -- : [846/885] 4115144=test_gem_stream_ui I, [2024-05-06T21:50:07.409635 #4074263] INFO -- : [847/885] 4115144=test_gb18030 I, [2024-05-06T21:50:07.411879 #4074263] INFO -- : [848/885] 4115144=test_propertyputref I, [2024-05-06T21:50:07.421074 #4074263] INFO -- : [849/885] 4115144=test_reline_key I, [2024-05-06T21:50:07.468943 #4074263] INFO -- : [850/885] 4115144=test_gem_commands_lock_command I, [2024-05-06T21:50:07.506377 #4074263] INFO -- : [851/885] 4115144=test_mul I, [2024-05-06T21:50:07.524910 #4074263] INFO -- : [852/885] 4115144=test_shellwords I, [2024-05-06T21:50:07.536581 #4074263] INFO -- : [853/885] 4115144=test_rdoc_generator_pot_po I, [2024-05-06T21:50:07.549026 #4074263] INFO -- : [854/885] 4115144=test_ipaddr I, [2024-05-06T21:50:07.593681 #4074263] INFO -- : [855/885] 4115144=test_ocsp I, [2024-05-06T21:50:07.693943 #4074263] INFO -- : [856/885] 4115144=test_scanner_events I, [2024-05-06T21:50:07.734844 #4074263] INFO -- : [857/885] 4115144=test_date_strptime I, [2024-05-06T21:50:07.759138 #4074263] INFO -- : [858/885] 4115143=test_omap I, [2024-05-06T21:50:07.775646 #4074263] INFO -- : [859/885] 4115143=test_nonblock I, [2024-05-06T21:50:07.800260 #4074263] INFO -- : [860/885] 4115143=test_rdoc_parser_simple I, [2024-05-06T21:50:07.840598 #4074263] INFO -- : [861/885] 4115143=json_ext_parser_test I, [2024-05-06T21:50:07.856186 #4074263] INFO -- : [862/885] 4115143=test_gem_ext_configure_builder I, [2024-05-06T21:50:07.864012 #4074263] INFO -- : [863/885] 4115144=test_cgi_modruby I, [2024-05-06T21:50:07.882540 #4074263] INFO -- : [864/885] 4115144=test_win32ole_variant I, [2024-05-06T21:50:07.887106 #4074263] INFO -- : [865/885] 4115144=magic_comment_test I, [2024-05-06T21:50:07.899545 #4074263] INFO -- : [866/885] 4115144=test_x509attr I, [2024-05-06T21:50:07.905860 #4074263] INFO -- : [867/885] 4115143=test_printf I, [2024-05-06T21:50:07.912727 #4074263] INFO -- : [868/885] 4115144=test_workspace I, [2024-05-06T21:50:07.944969 #4074263] INFO -- : [869/885] 4115143=test_etc I, [2024-05-06T21:50:08.055210 #4074263] INFO -- : [870/885] 4115143=test_nomethod_error I, [2024-05-06T21:50:08.083343 #4074263] INFO -- : [871/885] 4115144=test_gem_commands_rebuild_command I, [2024-05-06T21:50:08.096609 #4074263] INFO -- : [872/885] 4115143=test_stat I, [2024-05-06T21:50:08.102465 #4074263] INFO -- : [873/885] 4115143=test_win32ole_param_event I, [2024-05-06T21:50:08.112036 #4074263] INFO -- : [874/885] 4115143=test_rdoc_parser I, [2024-05-06T21:50:08.149105 #4074263] INFO -- : [875/885] 4115143=test_https_proxy I, [2024-05-06T21:50:08.154909 #4074263] INFO -- : [876/885] 4115143=test_digest I, [2024-05-06T21:50:08.163061 #4074263] INFO -- : [877/885] 4115144=test_path I, [2024-05-06T21:50:08.172657 #4074263] INFO -- : [878/885] 4115143=test_rdoc_rd_inline I, [2024-05-06T21:50:08.174474 #4074263] INFO -- : [879/885] 4115143=test_dir I, [2024-05-06T21:50:08.178114 #4074263] INFO -- : [880/885] 4115144=test_files_test_1 I, [2024-05-06T21:50:08.189506 #4074263] INFO -- : [881/885] 4115144=test_resolve_symbol I, [2024-05-06T21:50:08.259014 #4074263] INFO -- : [882/885] 4115144=test_rubygems I, [2024-05-06T21:50:08.495866 #4074263] INFO -- : [883/885] 4115144=test_closure I, [2024-05-06T21:50:08.552118 #4074263] INFO -- : [884/885] 4115143=test_io I, [2024-05-06T21:50:09.611145 #4074263] INFO -- : [885/885] 4115146=test_uncorrectable_name_check I, [2024-05-06T21:50:20.198132 #4074263] INFO -- : Finished tests in 209.306279s, 125.5242 tests/s, 44662.8216 assertions/s. E, [2024-05-06T21:50:20.198293 #4074263] ERROR -- : Children under /tmp/rubytest.pwkpul: E, [2024-05-06T21:50:20.199555 #4074263] ERROR -- : * drwx------ 4 28 2024-05-06 21:50:08 +0000 gem_rebuild20240506-4115144-st26va/ E, [2024-05-06T21:50:20.199603 #4074263] ERROR -- : * drwxrwxr-x 2 40 2024-05-06 21:50:08 +0000 old/ E, [2024-05-06T21:50:20.199620 #4074263] ERROR -- : * -rw-rw-r-- 1 4096 2024-05-06 21:50:08 +0000 rebuild_test_gem-1.0.0.gem E, [2024-05-06T21:50:20.199772 #4074263] ERROR -- : * drwxrwxr-x 2 40 2024-05-06 21:50:08 +0000 new/ E, [2024-05-06T21:50:20.199790 #4074263] ERROR -- : * -rw-rw-r-- 1 4096 2024-05-06 21:50:08 +0000 rebuild_test_gem-1.0.0.gem I, [2024-05-06T21:50:20.205744 #4074263] INFO -- : 26273 tests, 9348209 assertions, 0 failures, 0 errors, 320 skips I, [2024-05-06T21:50:20.205771 #4074263] INFO -- : I, [2024-05-06T21:50:20.205781 #4074263] INFO -- : ruby -v: ruby 3.4.0dev (2024-05-06T17:06:50Z master 00b1553dc6) [aarch64-linux] I, [2024-05-06T21:50:20.206725 #4074263] INFO -- : $$$[end] "make yes-test-all TESTOPTS='--stderr-on-failure' TESTS='-j3'" exit with 0. I, [2024-05-06T21:50:20.206870 #4074263] INFO -- : $$$[beg] make yes-test-rubyspec MSPECOPT='--error-output stderr --debug -j' TESTS='-j3' I, [2024-05-06T21:50:20.331408 #4074263] INFO -- : BASERUBY = /usr/local/bin/ruby --disable=gems I, [2024-05-06T21:50:20.331486 #4074263] INFO -- : CC = gcc I, [2024-05-06T21:50:20.331499 #4074263] INFO -- : LD = ld I, [2024-05-06T21:50:20.331508 #4074263] INFO -- : LDSHARED = gcc -shared I, [2024-05-06T21:50:20.331520 #4074263] INFO -- : CFLAGS = -O3 -fno-fast-math -ggdb3 -Wall -Wextra -Wdeprecated-declarations -Wdiv-by-zero -Wduplicated-cond -Wimplicit-function-declaration -Wimplicit-int -Wpointer-arith -Wwrite-strings -Wold-style-definition -Wimplicit-fallthrough=0 -Wmissing-noreturn -Wno-cast-function-type -Wno-constant-logical-operand -Wno-long-long -Wno-missing-field-initializers -Wno-overlength-strings -Wno-packed-bitfield-compat -Wno-parentheses-equality -Wno-self-assign -Wno-tautological-compare -Wno-unused-parameter -Wno-unused-value -Wsuggest-attribute=format -Wsuggest-attribute=noreturn -Wunused-variable -Wmisleading-indentation -Wundef I, [2024-05-06T21:50:20.331530 #4074263] INFO -- : XCFLAGS = -U_FORTIFY_SOURCE -D_FORTIFY_SOURCE=2 -fstack-protector-strong -msign-return-address=all -fno-strict-overflow -fvisibility=hidden -fexcess-precision=standard -DRUBY_EXPORT -fPIE -I. -I.ext/include/aarch64-linux -I/home/opc/ruby/src/master/include -I/home/opc/ruby/src/master -I/home/opc/ruby/src/master/prism -I/home/opc/ruby/src/master/enc/unicode/15.0.0 I, [2024-05-06T21:50:20.331539 #4074263] INFO -- : CPPFLAGS = I, [2024-05-06T21:50:20.331547 #4074263] INFO -- : DLDFLAGS = -Wl,--compress-debug-sections=zlib -fstack-protector-strong -pie I, [2024-05-06T21:50:20.331557 #4074263] INFO -- : SOLIBS = -lz -lrt -lrt -ldl -lcrypt -lm -lpthread I, [2024-05-06T21:50:20.331565 #4074263] INFO -- : LANG = en_US.UTF-8 I, [2024-05-06T21:50:20.331573 #4074263] INFO -- : LC_ALL = I, [2024-05-06T21:50:20.331582 #4074263] INFO -- : LC_CTYPE = I, [2024-05-06T21:50:20.331590 #4074263] INFO -- : MFLAGS = I, [2024-05-06T21:50:20.331598 #4074263] INFO -- : RUSTC = rustc I, [2024-05-06T21:50:20.331606 #4074263] INFO -- : YJIT_RUSTC_ARGS = --crate-name=yjit --crate-type=staticlib --edition=2021 -g -C lto=thin -C opt-level=3 -C overflow-checks=on '--out-dir=/home/opc/ruby/build/master/yjit/target/release/' /home/opc/ruby/src/master/yjit/src/lib.rs I, [2024-05-06T21:50:20.332244 #4074263] INFO -- : gcc (GCC) 8.5.0 20210514 (Red Hat 8.5.0-10.1.0.1) I, [2024-05-06T21:50:20.332267 #4074263] INFO -- : Copyright (C) 2018 Free Software Foundation, Inc. I, [2024-05-06T21:50:20.332276 #4074263] INFO -- : This is free software; see the source for copying conditions. There is NO I, [2024-05-06T21:50:20.332285 #4074263] INFO -- : warranty; not even for MERCHANTABILITY or FITNESS FOR A PARTICULAR PURPOSE. I, [2024-05-06T21:50:20.332294 #4074263] INFO -- : I, [2024-05-06T21:50:20.334451 #4074263] INFO -- : generating enc.mk I, [2024-05-06T21:50:20.568534 #4074263] INFO -- : making enc I, [2024-05-06T21:50:20.595698 #4074263] INFO -- : make[1]: Entering directory '/home/opc/ruby/build/master' I, [2024-05-06T21:50:20.595779 #4074263] INFO -- : make[1]: Nothing to be done for 'enc'. I, [2024-05-06T21:50:20.595791 #4074263] INFO -- : make[1]: Leaving directory '/home/opc/ruby/build/master' I, [2024-05-06T21:50:20.596598 #4074263] INFO -- : making srcs under enc I, [2024-05-06T21:50:20.638242 #4074263] INFO -- : make[1]: Entering directory '/home/opc/ruby/build/master' I, [2024-05-06T21:50:20.638309 #4074263] INFO -- : make[1]: Nothing to be done for 'srcs'. I, [2024-05-06T21:50:20.638320 #4074263] INFO -- : make[1]: Leaving directory '/home/opc/ruby/build/master' I, [2024-05-06T21:50:20.639375 #4074263] INFO -- : generating transdb.h I, [2024-05-06T21:50:20.781895 #4074263] INFO -- : transdb.h unchanged I, [2024-05-06T21:50:20.783183 #4074263] INFO -- : making trans I, [2024-05-06T21:50:20.831272 #4074263] INFO -- : make[1]: Entering directory '/home/opc/ruby/build/master' I, [2024-05-06T21:50:20.831359 #4074263] INFO -- : make[1]: Nothing to be done for 'trans'. I, [2024-05-06T21:50:20.831378 #4074263] INFO -- : make[1]: Leaving directory '/home/opc/ruby/build/master' I, [2024-05-06T21:50:20.832091 #4074263] INFO -- : making encs I, [2024-05-06T21:50:20.884267 #4074263] INFO -- : make[1]: Entering directory '/home/opc/ruby/build/master' I, [2024-05-06T21:50:20.884339 #4074263] INFO -- : make[1]: Nothing to be done for 'encs'. I, [2024-05-06T21:50:20.884357 #4074263] INFO -- : make[1]: Leaving directory '/home/opc/ruby/build/master' I, [2024-05-06T21:50:20.886376 #4074263] INFO -- : generating makefiles ext/configure-ext.mk I, [2024-05-06T21:50:20.925926 #4074263] INFO -- : ext/configure-ext.mk updated I, [2024-05-06T21:50:20.928974 #4074263] INFO -- : make[1]: Entering directory '/home/opc/ruby/build/master' I, [2024-05-06T21:50:22.931735 #4074263] INFO -- : make[1]: Leaving directory '/home/opc/ruby/build/master' I, [2024-05-06T21:50:22.932447 #4074263] INFO -- : generating makefile exts.mk I, [2024-05-06T21:50:22.990372 #4074263] INFO -- : exts.mk unchanged I, [2024-05-06T21:50:22.995103 #4074263] INFO -- : make[1]: Entering directory '/home/opc/ruby/build/master' I, [2024-05-06T21:50:23.293700 #4074263] INFO -- : make[2]: Entering directory '/home/opc/ruby/build/master/ext/coverage' I, [2024-05-06T21:50:23.298414 #4074263] INFO -- : make[2]: Leaving directory '/home/opc/ruby/build/master/ext/coverage' I, [2024-05-06T21:50:23.303989 #4074263] INFO -- : make[2]: Entering directory '/home/opc/ruby/build/master/ext/date' I, [2024-05-06T21:50:23.309225 #4074263] INFO -- : make[2]: Leaving directory '/home/opc/ruby/build/master/ext/date' I, [2024-05-06T21:50:23.312890 #4074263] INFO -- : make[2]: Entering directory '/home/opc/ruby/build/master/ext/digest' I, [2024-05-06T21:50:23.321796 #4074263] INFO -- : make[2]: Leaving directory '/home/opc/ruby/build/master/ext/digest' I, [2024-05-06T21:50:23.345296 #4074263] INFO -- : make[2]: Entering directory '/home/opc/ruby/build/master/ext/digest/sha2' I, [2024-05-06T21:50:23.350162 #4074263] INFO -- : make[2]: Leaving directory '/home/opc/ruby/build/master/ext/digest/sha2' I, [2024-05-06T21:50:23.368526 #4074263] INFO -- : make[2]: Entering directory '/home/opc/ruby/build/master/ext/fiddle' I, [2024-05-06T21:50:23.378780 #4074263] INFO -- : make[2]: Leaving directory '/home/opc/ruby/build/master/ext/fiddle' I, [2024-05-06T21:50:23.383073 #4074263] INFO -- : make[2]: Entering directory '/home/opc/ruby/build/master/ext/io/console' I, [2024-05-06T21:50:23.387411 #4074263] INFO -- : make[2]: Leaving directory '/home/opc/ruby/build/master/ext/io/console' I, [2024-05-06T21:50:23.398248 #4074263] INFO -- : make[2]: Entering directory '/home/opc/ruby/build/master/ext/json' I, [2024-05-06T21:50:23.407648 #4074263] INFO -- : make[2]: Leaving directory '/home/opc/ruby/build/master/ext/json' I, [2024-05-06T21:50:23.420528 #4074263] INFO -- : make[2]: Entering directory '/home/opc/ruby/build/master/ext/monitor' I, [2024-05-06T21:50:23.424746 #4074263] INFO -- : make[2]: Leaving directory '/home/opc/ruby/build/master/ext/monitor' I, [2024-05-06T21:50:23.430723 #4074263] INFO -- : make[2]: Entering directory '/home/opc/ruby/build/master/ext/objspace' I, [2024-05-06T21:50:23.436734 #4074263] INFO -- : make[2]: Leaving directory '/home/opc/ruby/build/master/ext/objspace' I, [2024-05-06T21:50:23.455673 #4074263] INFO -- : make[2]: Entering directory '/home/opc/ruby/build/master/ext/openssl' I, [2024-05-06T21:50:23.477489 #4074263] INFO -- : make[2]: Leaving directory '/home/opc/ruby/build/master/ext/openssl' I, [2024-05-06T21:50:23.481777 #4074263] INFO -- : make[2]: Entering directory '/home/opc/ruby/build/master/ext/pathname' I, [2024-05-06T21:50:23.486080 #4074263] INFO -- : make[2]: Leaving directory '/home/opc/ruby/build/master/ext/pathname' I, [2024-05-06T21:50:23.492281 #4074263] INFO -- : make[2]: Entering directory '/home/opc/ruby/build/master/ext/psych' I, [2024-05-06T21:50:23.513609 #4074263] INFO -- : make[2]: Leaving directory '/home/opc/ruby/build/master/ext/psych' I, [2024-05-06T21:50:23.518068 #4074263] INFO -- : make[2]: Entering directory '/home/opc/ruby/build/master/ext/pty' I, [2024-05-06T21:50:23.522530 #4074263] INFO -- : make[2]: Leaving directory '/home/opc/ruby/build/master/ext/pty' I, [2024-05-06T21:50:23.535912 #4074263] INFO -- : make[2]: Entering directory '/home/opc/ruby/build/master/ext/ripper' I, [2024-05-06T21:50:23.543661 #4074263] INFO -- : make[2]: Leaving directory '/home/opc/ruby/build/master/ext/ripper' I, [2024-05-06T21:50:23.545701 #4074263] INFO -- : make[2]: Entering directory '/home/opc/ruby/build/master/ext/rubyvm' I, [2024-05-06T21:50:23.549088 #4074263] INFO -- : make[2]: Leaving directory '/home/opc/ruby/build/master/ext/rubyvm' I, [2024-05-06T21:50:23.561051 #4074263] INFO -- : make[2]: Entering directory '/home/opc/ruby/build/master/ext/socket' I, [2024-05-06T21:50:23.571729 #4074263] INFO -- : make[2]: Leaving directory '/home/opc/ruby/build/master/ext/socket' I, [2024-05-06T21:50:23.587269 #4074263] INFO -- : make[2]: Entering directory '/home/opc/ruby/build/master/.bundle/gems/bigdecimal-3.1.7/ext/bigdecimal' I, [2024-05-06T21:50:23.618115 #4074263] INFO -- : make[2]: Leaving directory '/home/opc/ruby/build/master/.bundle/gems/bigdecimal-3.1.7/ext/bigdecimal' I, [2024-05-06T21:50:23.620797 #4074263] INFO -- : make[2]: Entering directory '/home/opc/ruby/build/master/.bundle/gems/debug-1.9.2/ext/debug' I, [2024-05-06T21:50:23.651303 #4074263] INFO -- : make[2]: Leaving directory '/home/opc/ruby/build/master/.bundle/gems/debug-1.9.2/ext/debug' I, [2024-05-06T21:50:23.653847 #4074263] INFO -- : make[2]: Entering directory '/home/opc/ruby/build/master/.bundle/gems/nkf-0.2.0/ext/nkf' I, [2024-05-06T21:50:23.684250 #4074263] INFO -- : make[2]: Leaving directory '/home/opc/ruby/build/master/.bundle/gems/nkf-0.2.0/ext/nkf' I, [2024-05-06T21:50:23.686832 #4074263] INFO -- : make[2]: Entering directory '/home/opc/ruby/build/master/.bundle/gems/racc-1.7.3/ext/racc/cparse' I, [2024-05-06T21:50:23.717173 #4074263] INFO -- : make[2]: Leaving directory '/home/opc/ruby/build/master/.bundle/gems/racc-1.7.3/ext/racc/cparse' I, [2024-05-06T21:50:23.720457 #4074263] INFO -- : make[2]: Entering directory '/home/opc/ruby/build/master/.bundle/gems/rbs-3.4.4/ext/rbs_extension' I, [2024-05-06T21:50:23.751829 #4074263] INFO -- : make[2]: Leaving directory '/home/opc/ruby/build/master/.bundle/gems/rbs-3.4.4/ext/rbs_extension' I, [2024-05-06T21:50:23.754487 #4074263] INFO -- : make[2]: Entering directory '/home/opc/ruby/build/master/.bundle/gems/syslog-0.1.2/ext/syslog' I, [2024-05-06T21:50:23.784704 #4074263] INFO -- : make[2]: Leaving directory '/home/opc/ruby/build/master/.bundle/gems/syslog-0.1.2/ext/syslog' I, [2024-05-06T21:50:23.823137 #4074263] INFO -- : make[2]: Entering directory '/home/opc/ruby/build/master' I, [2024-05-06T21:50:23.907854 #4074263] INFO -- : make[2]: 'ruby' is up to date. I, [2024-05-06T21:50:23.907936 #4074263] INFO -- : make[2]: Leaving directory '/home/opc/ruby/build/master' I, [2024-05-06T21:50:23.908059 #4074263] INFO -- : make[1]: Leaving directory '/home/opc/ruby/build/master' I, [2024-05-06T21:50:23.912383 #4074263] INFO -- : make[1]: Entering directory '/home/opc/ruby/build/master' I, [2024-05-06T21:50:23.912415 #4074263] INFO -- : make[1]: Nothing to be done for 'note'. I, [2024-05-06T21:50:23.912426 #4074263] INFO -- : make[1]: Leaving directory '/home/opc/ruby/build/master' E, [2024-05-06T21:50:23.987134 #4074263] ERROR -- : $ /home/opc/ruby/build/master/miniruby -I/home/opc/ruby/src/master/lib /home/opc/ruby/src/master/tool/runruby.rb --archdir=/home/opc/ruby/build/master --extout=.ext -- /home/opc/ruby/src/master/spec/mspec/bin/mspec-run -B /home/opc/ruby/src/master/spec/default.mspec --error-output stderr --debug -fy -o /tmp/rubytest.3lkzot/1-mspec-multi-0 E, [2024-05-06T21:50:23.987491 #4074263] ERROR -- : $ /home/opc/ruby/build/master/miniruby -I/home/opc/ruby/src/master/lib /home/opc/ruby/src/master/tool/runruby.rb --archdir=/home/opc/ruby/build/master --extout=.ext -- /home/opc/ruby/src/master/spec/mspec/bin/mspec-run -B /home/opc/ruby/src/master/spec/default.mspec --error-output stderr --debug -fy -o /tmp/rubytest.3lkzot/2-mspec-multi-1 E, [2024-05-06T21:50:23.987751 #4074263] ERROR -- : $ /home/opc/ruby/build/master/miniruby -I/home/opc/ruby/src/master/lib /home/opc/ruby/src/master/tool/runruby.rb --archdir=/home/opc/ruby/build/master --extout=.ext -- /home/opc/ruby/src/master/spec/mspec/bin/mspec-run -B /home/opc/ruby/src/master/spec/default.mspec --error-output stderr --debug -fy -o /tmp/rubytest.3lkzot/3-mspec-multi-2 I, [2024-05-06T21:50:24.119368 #4074263] INFO -- : ruby 3.4.0dev (2024-05-06T17:06:50Z master 00b1553dc6) [aarch64-linux] I, [2024-05-06T21:50:29.637641 #4074263] INFO -- : 0 ......................................................................... I, [2024-05-06T21:50:32.038860 #4074263] INFO -- : 73 ......................................................................... I, [2024-05-06T21:50:32.217398 #4074263] INFO -- : 146 ......................................................................... I, [2024-05-06T21:50:32.513063 #4074263] INFO -- : 219 ......................................................................... I, [2024-05-06T21:50:32.667412 #4074263] INFO -- : 292 ......................................................................... I, [2024-05-06T21:50:32.914470 #4074263] INFO -- : 365 ......................................................................... I, [2024-05-06T21:50:33.041048 #4074263] INFO -- : 438 ......................................................................... I, [2024-05-06T21:50:33.101656 #4074263] INFO -- : 511 ......................................................................... I, [2024-05-06T21:50:33.165597 #4074263] INFO -- : 584 ......................................................................... I, [2024-05-06T21:50:33.770835 #4074263] INFO -- : 657 ......................................................................... I, [2024-05-06T21:50:33.877740 #4074263] INFO -- : 730 ......................................................................... I, [2024-05-06T21:50:33.928817 #4074263] INFO -- : 803 ......................................................................... I, [2024-05-06T21:50:34.135827 #4074263] INFO -- : 876 ......................................................................... I, [2024-05-06T21:50:34.243956 #4074263] INFO -- : 949 ......................................................................... I, [2024-05-06T21:50:34.851352 #4074263] INFO -- : 1022 ......................................................................... I, [2024-05-06T21:50:37.133853 #4074263] INFO -- : 1095 ......................................................................... I, [2024-05-06T21:50:37.967387 #4074263] INFO -- : 1168 ......................................................................... I, [2024-05-06T21:50:38.140550 #4074263] INFO -- : 1241 ......................................................................... I, [2024-05-06T21:50:38.310281 #4074263] INFO -- : 1314 ......................................................................... I, [2024-05-06T21:50:38.403139 #4074263] INFO -- : 1387 ......................................................................... I, [2024-05-06T21:50:40.469904 #4074263] INFO -- : 1460 ......................................................................... I, [2024-05-06T21:50:43.846797 #4074263] INFO -- : 1533 ......................................................................... I, [2024-05-06T21:50:44.002829 #4074263] INFO -- : 1606 ......................................................................... I, [2024-05-06T21:50:44.835192 #4074263] INFO -- : 1679 ......................................................................... I, [2024-05-06T21:50:45.181242 #4074263] INFO -- : 1752 ......................................................................... I, [2024-05-06T21:50:45.453058 #4074263] INFO -- : 1825 ......................................................................... I, [2024-05-06T21:50:45.764257 #4074263] INFO -- : 1898 ......................................................................... I, [2024-05-06T21:50:46.183714 #4074263] INFO -- : 1971 ......................................................................... I, [2024-05-06T21:50:46.679471 #4074263] INFO -- : 2044 ......................................................................... I, [2024-05-06T21:50:46.755984 #4074263] INFO -- : 2117 ......................................................................... I, [2024-05-06T21:50:46.820965 #4074263] INFO -- : 2190 ......................................................................... I, [2024-05-06T21:50:46.869928 #4074263] INFO -- : 2263 ......................................................................... I, [2024-05-06T21:50:46.917159 #4074263] INFO -- : 2336 ......................................................................... I, [2024-05-06T21:50:47.010021 #4074263] INFO -- : 2409 ......................................................................... I, [2024-05-06T21:50:47.285766 #4074263] INFO -- : 2482 ......................................................................... I, [2024-05-06T21:50:47.425087 #4074263] INFO -- : 2555 ......................................................................... I, [2024-05-06T21:50:48.752855 #4074263] INFO -- : 2628 ......................................................................... I, [2024-05-06T21:50:48.966241 #4074263] INFO -- : 2701 ......................................................................... I, [2024-05-06T21:50:49.105727 #4074263] INFO -- : 2774 ......................................................................... I, [2024-05-06T21:50:49.427942 #4074263] INFO -- : 2847 ......................................................................... I, [2024-05-06T21:50:49.693866 #4074263] INFO -- : 2920 ......................................................................... I, [2024-05-06T21:50:49.812450 #4074263] INFO -- : 2993 ......................................................................... I, [2024-05-06T21:50:49.883731 #4074263] INFO -- : 3066 ......................................................................... I, [2024-05-06T21:50:49.927773 #4074263] INFO -- : 3139 ......................................................................... I, [2024-05-06T21:50:49.995215 #4074263] INFO -- : 3212 ......................................................................... I, [2024-05-06T21:50:50.071514 #4074263] INFO -- : 3285 ......................................................................... I, [2024-05-06T21:50:53.909614 #4074263] INFO -- : 3358 ........................................................................ I, [2024-05-06T21:50:53.909687 #4074263] INFO -- : I, [2024-05-06T21:50:53.909699 #4074263] INFO -- : Finished in 29.922389 seconds I, [2024-05-06T21:50:53.909708 #4074263] INFO -- : I, [2024-05-06T21:50:53.909717 #4074263] INFO -- : 3429 files, 32606 examples, 184598 expectations, 0 failures, 0 errors, 0 tagged I, [2024-05-06T21:50:53.911020 #4074263] INFO -- : $$$[end] "make yes-test-rubyspec MSPECOPT='--error-output stderr --debug -j' TESTS='-j3'" exit with 0.