# Logfile created on 2024-05-05 15:55:54 +0000 by logger.rb/v1.5.3 I, [2024-05-05T15:55:54.249043 #823650] INFO -- : #, @formatter=nil, @logdev=#, @binmode=false, @mon_data=#, @mon_data_owner_object_id=860>>> I, [2024-05-05T15:55:54.249328 #823650] INFO -- : $$$[beg] make update-unicode -j3 I, [2024-05-05T15:55:54.339389 #823650] INFO -- : Downloading Unicode emoji 15.0 files... I, [2024-05-05T15:55:54.339458 #823650] INFO -- : Downloading Unicode emoji 15.0 files... I, [2024-05-05T15:55:54.339760 #823650] INFO -- : Downloading Unicode emoji 15.0 files... I, [2024-05-05T15:55:54.416927 #823650] INFO -- : made symlink emoji/15.0/emoji-sequences.txt to /home/opc/ruby/src/master/.downloaded-cache/emoji/15.0/emoji-sequences.txt I, [2024-05-05T15:55:54.419724 #823650] INFO -- : downloading emoji/15.0/emoji-test.txt ... /home/opc/ruby/src/master/enc/unicode/data/emoji/15.0/emoji-sequences.txt already exists I, [2024-05-05T15:55:54.421358 #823650] INFO -- : downloading emoji/15.0/emoji-test.txt ... /home/opc/ruby/src/master/enc/unicode/data/emoji/15.0/emoji-sequences.txt already exists E, [2024-05-05T15:55:54.902978 #823650] ERROR -- : /home/opc/ruby/src/master/tool/downloader.rb:302:in `rescue in download': failed to download emoji/15.0/emoji-test.txt (RuntimeError) E, [2024-05-05T15:55:54.903042 #823650] ERROR -- : OpenURI::HTTPError: 403 Forbidden: https://www.unicode.org/Public/emoji/15.0/emoji-test.txt E, [2024-05-05T15:55:54.903053 #823650] ERROR -- : from /home/opc/ruby/src/master/tool/downloader.rb:201:in `download' E, [2024-05-05T15:55:54.903062 #823650] ERROR -- : from /home/opc/ruby/src/master/tool/downloader.rb:136:in `download' E, [2024-05-05T15:55:54.903071 #823650] ERROR -- : from /home/opc/ruby/src/master/tool/downloader.rb:482:in `block in
' E, [2024-05-05T15:55:54.903079 #823650] ERROR -- : from /home/opc/ruby/src/master/tool/downloader.rb:465:in `each' E, [2024-05-05T15:55:54.903088 #823650] ERROR -- : from /home/opc/ruby/src/master/tool/downloader.rb:465:in `
' E, [2024-05-05T15:55:54.903096 #823650] ERROR -- : /usr/local/lib/ruby/3.2.0/open-uri.rb:369:in `open_http': 403 Forbidden (OpenURI::HTTPError) E, [2024-05-05T15:55:54.903104 #823650] ERROR -- : from /usr/local/lib/ruby/3.2.0/open-uri.rb:760:in `buffer_open' E, [2024-05-05T15:55:54.903113 #823650] ERROR -- : from /usr/local/lib/ruby/3.2.0/open-uri.rb:214:in `block in open_loop' E, [2024-05-05T15:55:54.903121 #823650] ERROR -- : from /usr/local/lib/ruby/3.2.0/open-uri.rb:212:in `catch' E, [2024-05-05T15:55:54.903129 #823650] ERROR -- : from /usr/local/lib/ruby/3.2.0/open-uri.rb:212:in `open_loop' E, [2024-05-05T15:55:54.903137 #823650] ERROR -- : from /usr/local/lib/ruby/3.2.0/open-uri.rb:153:in `open_uri' E, [2024-05-05T15:55:54.903145 #823650] ERROR -- : from /usr/local/lib/ruby/3.2.0/open-uri.rb:740:in `open' E, [2024-05-05T15:55:54.903156 #823650] ERROR -- : from /usr/local/lib/ruby/3.2.0/open-uri.rb:748:in `read' E, [2024-05-05T15:55:54.903165 #823650] ERROR -- : from /home/opc/ruby/src/master/tool/downloader.rb:247:in `block in download' E, [2024-05-05T15:55:54.903173 #823650] ERROR -- : from /home/opc/ruby/src/master/tool/downloader.rb:378:in `with_retry' E, [2024-05-05T15:55:54.903181 #823650] ERROR -- : from /home/opc/ruby/src/master/tool/downloader.rb:246:in `download' E, [2024-05-05T15:55:54.903189 #823650] ERROR -- : from /home/opc/ruby/src/master/tool/downloader.rb:136:in `download' E, [2024-05-05T15:55:54.903197 #823650] ERROR -- : from /home/opc/ruby/src/master/tool/downloader.rb:482:in `block in
' E, [2024-05-05T15:55:54.903205 #823650] ERROR -- : from /home/opc/ruby/src/master/tool/downloader.rb:465:in `each' E, [2024-05-05T15:55:54.903213 #823650] ERROR -- : from /home/opc/ruby/src/master/tool/downloader.rb:465:in `
' E, [2024-05-05T15:55:54.906011 #823650] ERROR -- : make: *** [uncommon.mk:1787: /home/opc/ruby/src/master/enc/unicode/data/emoji/15.0/emoji-test.txt] Error 1 E, [2024-05-05T15:55:54.906063 #823650] ERROR -- : make: *** Waiting for unfinished jobs.... E, [2024-05-05T15:55:54.939627 #823650] ERROR -- : /home/opc/ruby/src/master/tool/downloader.rb:302:in `rescue in download': failed to download emoji/15.0/emoji-test.txt (RuntimeError) E, [2024-05-05T15:55:54.939678 #823650] ERROR -- : OpenURI::HTTPError: 403 Forbidden: https://www.unicode.org/Public/emoji/15.0/emoji-test.txt E, [2024-05-05T15:55:54.939692 #823650] ERROR -- : from /home/opc/ruby/src/master/tool/downloader.rb:201:in `download' E, [2024-05-05T15:55:54.939702 #823650] ERROR -- : from /home/opc/ruby/src/master/tool/downloader.rb:136:in `download' E, [2024-05-05T15:55:54.939711 #823650] ERROR -- : from /home/opc/ruby/src/master/tool/downloader.rb:482:in `block in
' E, [2024-05-05T15:55:54.939719 #823650] ERROR -- : from /home/opc/ruby/src/master/tool/downloader.rb:465:in `each' E, [2024-05-05T15:55:54.939727 #823650] ERROR -- : from /home/opc/ruby/src/master/tool/downloader.rb:465:in `
' E, [2024-05-05T15:55:54.939735 #823650] ERROR -- : /usr/local/lib/ruby/3.2.0/open-uri.rb:369:in `open_http': 403 Forbidden (OpenURI::HTTPError) E, [2024-05-05T15:55:54.939743 #823650] ERROR -- : from /usr/local/lib/ruby/3.2.0/open-uri.rb:760:in `buffer_open' E, [2024-05-05T15:55:54.939751 #823650] ERROR -- : from /usr/local/lib/ruby/3.2.0/open-uri.rb:214:in `block in open_loop' E, [2024-05-05T15:55:54.939759 #823650] ERROR -- : from /usr/local/lib/ruby/3.2.0/open-uri.rb:212:in `catch' E, [2024-05-05T15:55:54.939767 #823650] ERROR -- : from /usr/local/lib/ruby/3.2.0/open-uri.rb:212:in `open_loop' E, [2024-05-05T15:55:54.939775 #823650] ERROR -- : from /usr/local/lib/ruby/3.2.0/open-uri.rb:153:in `open_uri' E, [2024-05-05T15:55:54.939783 #823650] ERROR -- : from /usr/local/lib/ruby/3.2.0/open-uri.rb:740:in `open' E, [2024-05-05T15:55:54.939791 #823650] ERROR -- : from /usr/local/lib/ruby/3.2.0/open-uri.rb:748:in `read' E, [2024-05-05T15:55:54.939799 #823650] ERROR -- : from /home/opc/ruby/src/master/tool/downloader.rb:247:in `block in download' E, [2024-05-05T15:55:54.939807 #823650] ERROR -- : from /home/opc/ruby/src/master/tool/downloader.rb:378:in `with_retry' E, [2024-05-05T15:55:54.939816 #823650] ERROR -- : from /home/opc/ruby/src/master/tool/downloader.rb:246:in `download' E, [2024-05-05T15:55:54.939824 #823650] ERROR -- : from /home/opc/ruby/src/master/tool/downloader.rb:136:in `download' E, [2024-05-05T15:55:54.939832 #823650] ERROR -- : from /home/opc/ruby/src/master/tool/downloader.rb:482:in `block in
' E, [2024-05-05T15:55:54.939840 #823650] ERROR -- : from /home/opc/ruby/src/master/tool/downloader.rb:465:in `each' E, [2024-05-05T15:55:54.939848 #823650] ERROR -- : from /home/opc/ruby/src/master/tool/downloader.rb:465:in `
' E, [2024-05-05T15:55:54.942724 #823650] ERROR -- : make: *** [uncommon.mk:1787: /home/opc/ruby/src/master/enc/unicode/data/emoji/15.0/emoji-sequences.txt] Error 1 E, [2024-05-05T15:55:54.942766 #823650] ERROR -- : make: *** Deleting file '/home/opc/ruby/src/master/enc/unicode/data/emoji/15.0/emoji-sequences.txt' E, [2024-05-05T15:55:55.016503 #823650] ERROR -- : /home/opc/ruby/src/master/tool/downloader.rb:302:in `rescue in download': failed to download emoji/15.0/emoji-test.txt (RuntimeError) E, [2024-05-05T15:55:55.016561 #823650] ERROR -- : OpenURI::HTTPError: 403 Forbidden: https://www.unicode.org/Public/emoji/15.0/emoji-test.txt E, [2024-05-05T15:55:55.016572 #823650] ERROR -- : from /home/opc/ruby/src/master/tool/downloader.rb:201:in `download' E, [2024-05-05T15:55:55.016581 #823650] ERROR -- : from /home/opc/ruby/src/master/tool/downloader.rb:136:in `download' E, [2024-05-05T15:55:55.016590 #823650] ERROR -- : from /home/opc/ruby/src/master/tool/downloader.rb:482:in `block in
' E, [2024-05-05T15:55:55.016598 #823650] ERROR -- : from /home/opc/ruby/src/master/tool/downloader.rb:465:in `each' E, [2024-05-05T15:55:55.016606 #823650] ERROR -- : from /home/opc/ruby/src/master/tool/downloader.rb:465:in `
' E, [2024-05-05T15:55:55.016614 #823650] ERROR -- : /usr/local/lib/ruby/3.2.0/open-uri.rb:369:in `open_http': 403 Forbidden (OpenURI::HTTPError) E, [2024-05-05T15:55:55.016622 #823650] ERROR -- : from /usr/local/lib/ruby/3.2.0/open-uri.rb:760:in `buffer_open' E, [2024-05-05T15:55:55.016630 #823650] ERROR -- : from /usr/local/lib/ruby/3.2.0/open-uri.rb:214:in `block in open_loop' E, [2024-05-05T15:55:55.016638 #823650] ERROR -- : from /usr/local/lib/ruby/3.2.0/open-uri.rb:212:in `catch' E, [2024-05-05T15:55:55.016646 #823650] ERROR -- : from /usr/local/lib/ruby/3.2.0/open-uri.rb:212:in `open_loop' E, [2024-05-05T15:55:55.016655 #823650] ERROR -- : from /usr/local/lib/ruby/3.2.0/open-uri.rb:153:in `open_uri' E, [2024-05-05T15:55:55.016662 #823650] ERROR -- : from /usr/local/lib/ruby/3.2.0/open-uri.rb:740:in `open' E, [2024-05-05T15:55:55.016670 #823650] ERROR -- : from /usr/local/lib/ruby/3.2.0/open-uri.rb:748:in `read' E, [2024-05-05T15:55:55.016679 #823650] ERROR -- : from /home/opc/ruby/src/master/tool/downloader.rb:247:in `block in download' E, [2024-05-05T15:55:55.016687 #823650] ERROR -- : from /home/opc/ruby/src/master/tool/downloader.rb:378:in `with_retry' E, [2024-05-05T15:55:55.016695 #823650] ERROR -- : from /home/opc/ruby/src/master/tool/downloader.rb:246:in `download' E, [2024-05-05T15:55:55.016704 #823650] ERROR -- : from /home/opc/ruby/src/master/tool/downloader.rb:136:in `download' E, [2024-05-05T15:55:55.016712 #823650] ERROR -- : from /home/opc/ruby/src/master/tool/downloader.rb:482:in `block in
' E, [2024-05-05T15:55:55.016720 #823650] ERROR -- : from /home/opc/ruby/src/master/tool/downloader.rb:465:in `each' E, [2024-05-05T15:55:55.016728 #823650] ERROR -- : from /home/opc/ruby/src/master/tool/downloader.rb:465:in `
' E, [2024-05-05T15:55:55.019569 #823650] ERROR -- : make: *** [uncommon.mk:1787: /home/opc/ruby/src/master/enc/unicode/data/emoji/15.0/emoji-zwj-sequences.txt] Error 1 I, [2024-05-05T15:55:55.019640 #823650] INFO -- : downloading emoji/15.0/emoji-test.txt ... I, [2024-05-05T15:55:55.019787 #823650] INFO -- : $$$[end] "make update-unicode -j3" exit with 512. I, [2024-05-05T15:55:55.019816 #823650] INFO -- : $$$[beg] make update-download -j3 I, [2024-05-05T15:55:55.184212 #823650] INFO -- : tool/config.guess already exists I, [2024-05-05T15:55:55.184282 #823650] INFO -- : tool/config.sub already exists I, [2024-05-05T15:55:55.187061 #823650] INFO -- : Update minitest to ea9caafc0754b1d6236a490d59e624b53209734a I, [2024-05-05T15:55:55.187189 #823650] INFO -- : Update power_assert to 84e85124c5014a139af39161d484156cfe87a9ed I, [2024-05-05T15:55:55.187353 #823650] INFO -- : Update rbs to ba7872795d5de04adb8ff500c0e6afdc81a041dd I, [2024-05-05T15:55:55.190454 #823650] INFO -- : echo ea9caafc0754b1d6236a490d59e624b53209734a | /bin/sh /home/opc/ruby/src/master/tool/ifchange /home/opc/ruby/src/master/.bundle/.timestamp/minitest.revision - I, [2024-05-05T15:55:55.190876 #823650] INFO -- : echo 84e85124c5014a139af39161d484156cfe87a9ed | /bin/sh /home/opc/ruby/src/master/tool/ifchange /home/opc/ruby/src/master/.bundle/.timestamp/power_assert.revision - I, [2024-05-05T15:55:55.190990 #823650] INFO -- : echo ba7872795d5de04adb8ff500c0e6afdc81a041dd | /bin/sh /home/opc/ruby/src/master/tool/ifchange /home/opc/ruby/src/master/.bundle/.timestamp/rbs.revision - I, [2024-05-05T15:55:55.196561 #823650] INFO -- : /home/opc/ruby/src/master/.bundle/.timestamp/power_assert.revision unchanged I, [2024-05-05T15:55:55.196616 #823650] INFO -- : /home/opc/ruby/src/master/.bundle/.timestamp/rbs.revision unchanged I, [2024-05-05T15:55:55.197229 #823650] INFO -- : /home/opc/ruby/src/master/.bundle/.timestamp/minitest.revision unchanged I, [2024-05-05T15:55:55.199182 #823650] INFO -- : Update typeprof to b19a6416da3a05d57fadd6ffdadb382b6d236ca5 I, [2024-05-05T15:55:55.202395 #823650] INFO -- : echo b19a6416da3a05d57fadd6ffdadb382b6d236ca5 | /bin/sh /home/opc/ruby/src/master/tool/ifchange /home/opc/ruby/src/master/.bundle/.timestamp/typeprof.revision - I, [2024-05-05T15:55:55.210001 #823650] INFO -- : /home/opc/ruby/src/master/.bundle/.timestamp/typeprof.revision unchanged I, [2024-05-05T15:55:55.286616 #823650] INFO -- : Building power_assert@84e85124c5014a139af39161d484156cfe87a9ed to /home/opc/ruby/src/master/gems/power_assert-2.0.3.gem I, [2024-05-05T15:55:55.398461 #823650] INFO -- : Successfully built RubyGem I, [2024-05-05T15:55:55.398517 #823650] INFO -- : Name: power_assert I, [2024-05-05T15:55:55.398528 #823650] INFO -- : Version: 2.0.4dev I, [2024-05-05T15:55:55.398536 #823650] INFO -- : File: power_assert-2.0.4dev.gem I, [2024-05-05T15:55:55.478908 #823650] INFO -- : $$$[end] "make update-download -j3" exit with 0. I, [2024-05-05T15:55:55.478980 #823650] INFO -- : $$$[beg] make update-rubyspec -j3 I, [2024-05-05T15:55:55.569090 #823650] INFO -- : make: Nothing to be done for 'update-rubyspec'. I, [2024-05-05T15:55:55.569250 #823650] INFO -- : $$$[end] "make update-rubyspec -j3" exit with 0. I, [2024-05-05T15:55:55.569296 #823650] INFO -- : $$$[beg] make update-src -j3 I, [2024-05-05T15:55:56.511804 #823650] INFO -- : Already up to date. I, [2024-05-05T15:55:56.526670 #823650] INFO -- : Latest commit hash = 6747fbe77d I, [2024-05-05T15:55:56.527283 #823650] INFO -- : $$$[end] "make update-src -j3" exit with 0. I, [2024-05-05T15:55:56.527322 #823650] INFO -- : $$$[beg] make after-update -j3 I, [2024-05-05T15:55:56.631004 #823650] INFO -- : generating /home/opc/ruby/src/master/ext/ripper/eventids2table.c I, [2024-05-05T15:55:56.637658 #823650] INFO -- : make[1]: Entering directory '/home/opc/ruby/src/master/ext/ripper' I, [2024-05-05T15:55:56.637711 #823650] INFO -- : make[1]: Nothing to be done for 'src'. I, [2024-05-05T15:55:56.637787 #823650] INFO -- : make[1]: Leaving directory '/home/opc/ruby/src/master/ext/ripper' I, [2024-05-05T15:55:56.664571 #823650] INFO -- : /home/opc/ruby/src/master/revision.h updated I, [2024-05-05T15:55:56.665762 #823650] INFO -- : generating aarch64-linux-fake.rb I, [2024-05-05T15:55:56.723586 #823650] INFO -- : aarch64-linux-fake.rb updated I, [2024-05-05T15:55:56.725332 #823650] INFO -- : generating enc.mk I, [2024-05-05T15:55:56.959770 #823650] INFO -- : making srcs under enc I, [2024-05-05T15:55:57.002140 #823650] INFO -- : make[1]: Entering directory '/home/opc/ruby/build/master' I, [2024-05-05T15:55:57.002212 #823650] INFO -- : make[1]: Nothing to be done for 'srcs'. I, [2024-05-05T15:55:57.002224 #823650] INFO -- : make[1]: Leaving directory '/home/opc/ruby/build/master' I, [2024-05-05T15:55:57.083962 #823650] INFO -- : Update minitest to ea9caafc0754b1d6236a490d59e624b53209734a I, [2024-05-05T15:55:57.084052 #823650] INFO -- : Update power_assert to 84e85124c5014a139af39161d484156cfe87a9ed I, [2024-05-05T15:55:57.084343 #823650] INFO -- : Update rbs to ba7872795d5de04adb8ff500c0e6afdc81a041dd I, [2024-05-05T15:55:57.087527 #823650] INFO -- : echo ea9caafc0754b1d6236a490d59e624b53209734a | /bin/sh /home/opc/ruby/src/master/tool/ifchange /home/opc/ruby/src/master/.bundle/.timestamp/minitest.revision - I, [2024-05-05T15:55:57.087614 #823650] INFO -- : echo 84e85124c5014a139af39161d484156cfe87a9ed | /bin/sh /home/opc/ruby/src/master/tool/ifchange /home/opc/ruby/src/master/.bundle/.timestamp/power_assert.revision - I, [2024-05-05T15:55:57.087819 #823650] INFO -- : echo ba7872795d5de04adb8ff500c0e6afdc81a041dd | /bin/sh /home/opc/ruby/src/master/tool/ifchange /home/opc/ruby/src/master/.bundle/.timestamp/rbs.revision - I, [2024-05-05T15:55:57.093648 #823650] INFO -- : /home/opc/ruby/src/master/.bundle/.timestamp/power_assert.revision unchanged I, [2024-05-05T15:55:57.094190 #823650] INFO -- : /home/opc/ruby/src/master/.bundle/.timestamp/minitest.revision unchanged I, [2024-05-05T15:55:57.094751 #823650] INFO -- : /home/opc/ruby/src/master/.bundle/.timestamp/rbs.revision unchanged I, [2024-05-05T15:55:57.097772 #823650] INFO -- : Update typeprof to b19a6416da3a05d57fadd6ffdadb382b6d236ca5 I, [2024-05-05T15:55:57.101117 #823650] INFO -- : echo b19a6416da3a05d57fadd6ffdadb382b6d236ca5 | /bin/sh /home/opc/ruby/src/master/tool/ifchange /home/opc/ruby/src/master/.bundle/.timestamp/typeprof.revision - I, [2024-05-05T15:55:57.106396 #823650] INFO -- : /home/opc/ruby/src/master/.bundle/.timestamp/typeprof.revision unchanged I, [2024-05-05T15:55:57.183669 #823650] INFO -- : Building power_assert@84e85124c5014a139af39161d484156cfe87a9ed to /home/opc/ruby/src/master/gems/power_assert-2.0.3.gem I, [2024-05-05T15:55:57.294108 #823650] INFO -- : Successfully built RubyGem I, [2024-05-05T15:55:57.294165 #823650] INFO -- : Name: power_assert I, [2024-05-05T15:55:57.294176 #823650] INFO -- : Version: 2.0.4dev I, [2024-05-05T15:55:57.294185 #823650] INFO -- : File: power_assert-2.0.4dev.gem I, [2024-05-05T15:55:57.296541 #823650] INFO -- : Extracting bundle gem power_assert-2.0.3... I, [2024-05-05T15:55:57.393853 #823650] INFO -- : Try with hash version of bundled gems instead of gems/power_assert-2.0.3.gem. We don't use this gem with release version of Ruby. I, [2024-05-05T15:55:57.404273 #823650] INFO -- : Unpacked gems/power_assert-2.0.4dev.gem I, [2024-05-05T15:55:57.406064 #823650] INFO -- : $$$[end] "make after-update -j3" exit with 0. I, [2024-05-05T15:55:57.406207 #823650] INFO -- : $$$[beg] make miniruby -j3 I, [2024-05-05T15:55:57.494619 #823650] INFO -- : BASERUBY = /usr/local/bin/ruby --disable=gems I, [2024-05-05T15:55:57.494684 #823650] INFO -- : CC = gcc I, [2024-05-05T15:55:57.494695 #823650] INFO -- : LD = ld I, [2024-05-05T15:55:57.494704 #823650] INFO -- : LDSHARED = gcc -shared I, [2024-05-05T15:55:57.494715 #823650] INFO -- : CFLAGS = -O3 -fno-fast-math -ggdb3 -Wall -Wextra -Wdeprecated-declarations -Wdiv-by-zero -Wduplicated-cond -Wimplicit-function-declaration -Wimplicit-int -Wpointer-arith -Wwrite-strings -Wold-style-definition -Wimplicit-fallthrough=0 -Wmissing-noreturn -Wno-cast-function-type -Wno-constant-logical-operand -Wno-long-long -Wno-missing-field-initializers -Wno-overlength-strings -Wno-packed-bitfield-compat -Wno-parentheses-equality -Wno-self-assign -Wno-tautological-compare -Wno-unused-parameter -Wno-unused-value -Wsuggest-attribute=format -Wsuggest-attribute=noreturn -Wunused-variable -Wmisleading-indentation -Wundef I, [2024-05-05T15:55:57.494725 #823650] INFO -- : XCFLAGS = -U_FORTIFY_SOURCE -D_FORTIFY_SOURCE=2 -fstack-protector-strong -msign-return-address=all -fno-strict-overflow -fvisibility=hidden -fexcess-precision=standard -DRUBY_EXPORT -fPIE -I. -I.ext/include/aarch64-linux -I/home/opc/ruby/src/master/include -I/home/opc/ruby/src/master -I/home/opc/ruby/src/master/prism -I/home/opc/ruby/src/master/enc/unicode/15.0.0 I, [2024-05-05T15:55:57.494733 #823650] INFO -- : CPPFLAGS = I, [2024-05-05T15:55:57.494763 #823650] INFO -- : DLDFLAGS = -Wl,--compress-debug-sections=zlib -fstack-protector-strong -pie I, [2024-05-05T15:55:57.494772 #823650] INFO -- : SOLIBS = -lz -lrt -lrt -ldl -lcrypt -lm -lpthread I, [2024-05-05T15:55:57.494780 #823650] INFO -- : LANG = en_US.UTF-8 I, [2024-05-05T15:55:57.494791 #823650] INFO -- : LC_ALL = I, [2024-05-05T15:55:57.494799 #823650] INFO -- : LC_CTYPE = I, [2024-05-05T15:55:57.494807 #823650] INFO -- : MFLAGS = -j3 --jobserver-auth=4,5 I, [2024-05-05T15:55:57.494815 #823650] INFO -- : RUSTC = rustc I, [2024-05-05T15:55:57.494823 #823650] INFO -- : YJIT_RUSTC_ARGS = --crate-name=yjit --crate-type=staticlib --edition=2021 -g -C lto=thin -C opt-level=3 -C overflow-checks=on '--out-dir=/home/opc/ruby/build/master/yjit/target/release/' /home/opc/ruby/src/master/yjit/src/lib.rs I, [2024-05-05T15:55:57.495666 #823650] INFO -- : gcc (GCC) 8.5.0 20210514 (Red Hat 8.5.0-10.1.0.1) I, [2024-05-05T15:55:57.495700 #823650] INFO -- : Copyright (C) 2018 Free Software Foundation, Inc. I, [2024-05-05T15:55:57.495710 #823650] INFO -- : This is free software; see the source for copying conditions. There is NO I, [2024-05-05T15:55:57.495720 #823650] INFO -- : warranty; not even for MERCHANTABILITY or FITNESS FOR A PARTICULAR PURPOSE. I, [2024-05-05T15:55:57.495728 #823650] INFO -- : I, [2024-05-05T15:55:57.520630 #823650] INFO -- : compiling /home/opc/ruby/src/master/version.c I, [2024-05-05T15:55:57.665294 #823650] INFO -- : linking miniruby I, [2024-05-05T15:55:58.558400 #823650] INFO -- : $$$[end] "make miniruby -j3" exit with 0. I, [2024-05-05T15:55:58.558570 #823650] INFO -- : $$$[beg] make ruby -j3 I, [2024-05-05T15:55:58.648417 #823650] INFO -- : BASERUBY = /usr/local/bin/ruby --disable=gems I, [2024-05-05T15:55:58.648482 #823650] INFO -- : CC = gcc I, [2024-05-05T15:55:58.648531 #823650] INFO -- : LD = ld I, [2024-05-05T15:55:58.648542 #823650] INFO -- : LDSHARED = gcc -shared I, [2024-05-05T15:55:58.648554 #823650] INFO -- : CFLAGS = -O3 -fno-fast-math -ggdb3 -Wall -Wextra -Wdeprecated-declarations -Wdiv-by-zero -Wduplicated-cond -Wimplicit-function-declaration -Wimplicit-int -Wpointer-arith -Wwrite-strings -Wold-style-definition -Wimplicit-fallthrough=0 -Wmissing-noreturn -Wno-cast-function-type -Wno-constant-logical-operand -Wno-long-long -Wno-missing-field-initializers -Wno-overlength-strings -Wno-packed-bitfield-compat -Wno-parentheses-equality -Wno-self-assign -Wno-tautological-compare -Wno-unused-parameter -Wno-unused-value -Wsuggest-attribute=format -Wsuggest-attribute=noreturn -Wunused-variable -Wmisleading-indentation -Wundef I, [2024-05-05T15:55:58.648563 #823650] INFO -- : XCFLAGS = -U_FORTIFY_SOURCE -D_FORTIFY_SOURCE=2 -fstack-protector-strong -msign-return-address=all -fno-strict-overflow -fvisibility=hidden -fexcess-precision=standard -DRUBY_EXPORT -fPIE -I. -I.ext/include/aarch64-linux -I/home/opc/ruby/src/master/include -I/home/opc/ruby/src/master -I/home/opc/ruby/src/master/prism -I/home/opc/ruby/src/master/enc/unicode/15.0.0 I, [2024-05-05T15:55:58.648572 #823650] INFO -- : CPPFLAGS = I, [2024-05-05T15:55:58.648580 #823650] INFO -- : DLDFLAGS = -Wl,--compress-debug-sections=zlib -fstack-protector-strong -pie I, [2024-05-05T15:55:58.648589 #823650] INFO -- : SOLIBS = -lz -lrt -lrt -ldl -lcrypt -lm -lpthread I, [2024-05-05T15:55:58.648597 #823650] INFO -- : LANG = en_US.UTF-8 I, [2024-05-05T15:55:58.648604 #823650] INFO -- : LC_ALL = I, [2024-05-05T15:55:58.648612 #823650] INFO -- : LC_CTYPE = I, [2024-05-05T15:55:58.648620 #823650] INFO -- : MFLAGS = -j3 --jobserver-auth=4,5 I, [2024-05-05T15:55:58.648628 #823650] INFO -- : RUSTC = rustc I, [2024-05-05T15:55:58.648636 #823650] INFO -- : YJIT_RUSTC_ARGS = --crate-name=yjit --crate-type=staticlib --edition=2021 -g -C lto=thin -C opt-level=3 -C overflow-checks=on '--out-dir=/home/opc/ruby/build/master/yjit/target/release/' /home/opc/ruby/src/master/yjit/src/lib.rs I, [2024-05-05T15:55:58.649393 #823650] INFO -- : gcc (GCC) 8.5.0 20210514 (Red Hat 8.5.0-10.1.0.1) I, [2024-05-05T15:55:58.649429 #823650] INFO -- : Copyright (C) 2018 Free Software Foundation, Inc. I, [2024-05-05T15:55:58.649439 #823650] INFO -- : This is free software; see the source for copying conditions. There is NO I, [2024-05-05T15:55:58.649452 #823650] INFO -- : warranty; not even for MERCHANTABILITY or FITNESS FOR A PARTICULAR PURPOSE. I, [2024-05-05T15:55:58.649460 #823650] INFO -- : I, [2024-05-05T15:55:58.830873 #823650] INFO -- : builtin_binary.inc updated I, [2024-05-05T15:55:58.834215 #823650] INFO -- : c5234a9416e4f20f175185e840b25b0f08674d14078ed7083f37e655458e3ca9 builtin_binary.inc I, [2024-05-05T15:55:58.835143 #823650] INFO -- : compiling /home/opc/ruby/src/master/builtin.c I, [2024-05-05T15:55:59.160660 #823650] INFO -- : linking static-library libruby-static.a I, [2024-05-05T15:56:01.865176 #823650] INFO -- : linking ruby I, [2024-05-05T15:56:02.773280 #823650] INFO -- : $$$[end] "make ruby -j3" exit with 0. I, [2024-05-05T15:56:02.773446 #823650] INFO -- : $$$[beg] make all -j3 I, [2024-05-05T15:56:02.861680 #823650] INFO -- : BASERUBY = /usr/local/bin/ruby --disable=gems I, [2024-05-05T15:56:02.861749 #823650] INFO -- : CC = gcc I, [2024-05-05T15:56:02.861760 #823650] INFO -- : LD = ld I, [2024-05-05T15:56:02.861769 #823650] INFO -- : LDSHARED = gcc -shared I, [2024-05-05T15:56:02.861779 #823650] INFO -- : CFLAGS = -O3 -fno-fast-math -ggdb3 -Wall -Wextra -Wdeprecated-declarations -Wdiv-by-zero -Wduplicated-cond -Wimplicit-function-declaration -Wimplicit-int -Wpointer-arith -Wwrite-strings -Wold-style-definition -Wimplicit-fallthrough=0 -Wmissing-noreturn -Wno-cast-function-type -Wno-constant-logical-operand -Wno-long-long -Wno-missing-field-initializers -Wno-overlength-strings -Wno-packed-bitfield-compat -Wno-parentheses-equality -Wno-self-assign -Wno-tautological-compare -Wno-unused-parameter -Wno-unused-value -Wsuggest-attribute=format -Wsuggest-attribute=noreturn -Wunused-variable -Wmisleading-indentation -Wundef I, [2024-05-05T15:56:02.861790 #823650] INFO -- : XCFLAGS = -U_FORTIFY_SOURCE -D_FORTIFY_SOURCE=2 -fstack-protector-strong -msign-return-address=all -fno-strict-overflow -fvisibility=hidden -fexcess-precision=standard -DRUBY_EXPORT -fPIE -I. -I.ext/include/aarch64-linux -I/home/opc/ruby/src/master/include -I/home/opc/ruby/src/master -I/home/opc/ruby/src/master/prism -I/home/opc/ruby/src/master/enc/unicode/15.0.0 I, [2024-05-05T15:56:02.861799 #823650] INFO -- : CPPFLAGS = I, [2024-05-05T15:56:02.861807 #823650] INFO -- : DLDFLAGS = -Wl,--compress-debug-sections=zlib -fstack-protector-strong -pie I, [2024-05-05T15:56:02.861815 #823650] INFO -- : SOLIBS = -lz -lrt -lrt -ldl -lcrypt -lm -lpthread I, [2024-05-05T15:56:02.861824 #823650] INFO -- : LANG = en_US.UTF-8 I, [2024-05-05T15:56:02.861831 #823650] INFO -- : LC_ALL = I, [2024-05-05T15:56:02.861839 #823650] INFO -- : LC_CTYPE = I, [2024-05-05T15:56:02.861847 #823650] INFO -- : MFLAGS = -j3 --jobserver-auth=4,5 I, [2024-05-05T15:56:02.861855 #823650] INFO -- : RUSTC = rustc I, [2024-05-05T15:56:02.861862 #823650] INFO -- : YJIT_RUSTC_ARGS = --crate-name=yjit --crate-type=staticlib --edition=2021 -g -C lto=thin -C opt-level=3 -C overflow-checks=on '--out-dir=/home/opc/ruby/build/master/yjit/target/release/' /home/opc/ruby/src/master/yjit/src/lib.rs I, [2024-05-05T15:56:02.862604 #823650] INFO -- : gcc (GCC) 8.5.0 20210514 (Red Hat 8.5.0-10.1.0.1) I, [2024-05-05T15:56:02.862639 #823650] INFO -- : Copyright (C) 2018 Free Software Foundation, Inc. I, [2024-05-05T15:56:02.862650 #823650] INFO -- : This is free software; see the source for copying conditions. There is NO I, [2024-05-05T15:56:02.862659 #823650] INFO -- : warranty; not even for MERCHANTABILITY or FITNESS FOR A PARTICULAR PURPOSE. I, [2024-05-05T15:56:02.862668 #823650] INFO -- : I, [2024-05-05T15:56:02.896305 #823650] INFO -- : generating enc.mk I, [2024-05-05T15:56:03.131932 #823650] INFO -- : making srcs under enc I, [2024-05-05T15:56:03.131999 #823650] INFO -- : making enc I, [2024-05-05T15:56:03.159943 #823650] INFO -- : make[1]: Entering directory '/home/opc/ruby/build/master' I, [2024-05-05T15:56:03.160010 #823650] INFO -- : make[1]: Nothing to be done for 'enc'. I, [2024-05-05T15:56:03.160021 #823650] INFO -- : make[1]: Leaving directory '/home/opc/ruby/build/master' I, [2024-05-05T15:56:03.174477 #823650] INFO -- : make[1]: Entering directory '/home/opc/ruby/build/master' I, [2024-05-05T15:56:03.174517 #823650] INFO -- : make[1]: Nothing to be done for 'srcs'. I, [2024-05-05T15:56:03.174527 #823650] INFO -- : make[1]: Leaving directory '/home/opc/ruby/build/master' I, [2024-05-05T15:56:03.175257 #823650] INFO -- : generating transdb.h I, [2024-05-05T15:56:03.320370 #823650] INFO -- : transdb.h unchanged I, [2024-05-05T15:56:03.321879 #823650] INFO -- : generating makefiles ext/configure-ext.mk I, [2024-05-05T15:56:03.321996 #823650] INFO -- : making trans I, [2024-05-05T15:56:03.361891 #823650] INFO -- : ext/configure-ext.mk updated I, [2024-05-05T15:56:03.365285 #823650] INFO -- : make[1]: Entering directory '/home/opc/ruby/build/master' I, [2024-05-05T15:56:03.370683 #823650] INFO -- : make[1]: Entering directory '/home/opc/ruby/build/master' I, [2024-05-05T15:56:03.370749 #823650] INFO -- : make[1]: Nothing to be done for 'trans'. I, [2024-05-05T15:56:03.370760 #823650] INFO -- : make[1]: Leaving directory '/home/opc/ruby/build/master' I, [2024-05-05T15:56:03.491883 #823650] INFO -- : making encs I, [2024-05-05T15:56:03.544430 #823650] INFO -- : make[1]: Entering directory '/home/opc/ruby/build/master' I, [2024-05-05T15:56:03.544539 #823650] INFO -- : make[1]: Nothing to be done for 'encs'. I, [2024-05-05T15:56:03.544576 #823650] INFO -- : make[1]: Leaving directory '/home/opc/ruby/build/master' I, [2024-05-05T15:56:04.098500 #823650] INFO -- : make[1]: Leaving directory '/home/opc/ruby/build/master' I, [2024-05-05T15:56:04.099232 #823650] INFO -- : generating makefile exts.mk I, [2024-05-05T15:56:04.159141 #823650] INFO -- : exts.mk unchanged I, [2024-05-05T15:56:04.164056 #823650] INFO -- : make[1]: Entering directory '/home/opc/ruby/build/master' I, [2024-05-05T15:56:04.270427 #823650] INFO -- : make[2]: Entering directory '/home/opc/ruby/build/master/ext/coverage' I, [2024-05-05T15:56:04.270867 #823650] INFO -- : make[2]: Entering directory '/home/opc/ruby/build/master/ext/digest' I, [2024-05-05T15:56:04.272172 #823650] INFO -- : make[2]: Entering directory '/home/opc/ruby/build/master/ext/date' I, [2024-05-05T15:56:04.275461 #823650] INFO -- : make[2]: Leaving directory '/home/opc/ruby/build/master/ext/coverage' I, [2024-05-05T15:56:04.277909 #823650] INFO -- : make[2]: Leaving directory '/home/opc/ruby/build/master/ext/date' I, [2024-05-05T15:56:04.280990 #823650] INFO -- : make[2]: Leaving directory '/home/opc/ruby/build/master/ext/digest' I, [2024-05-05T15:56:04.286589 #823650] INFO -- : make[2]: Entering directory '/home/opc/ruby/build/master/ext/io/console' I, [2024-05-05T15:56:04.288387 #823650] INFO -- : make[2]: Entering directory '/home/opc/ruby/build/master/ext/fiddle' I, [2024-05-05T15:56:04.290809 #823650] INFO -- : make[2]: Leaving directory '/home/opc/ruby/build/master/ext/io/console' I, [2024-05-05T15:56:04.296122 #823650] INFO -- : make[2]: Entering directory '/home/opc/ruby/build/master/ext/json' I, [2024-05-05T15:56:04.297058 #823650] INFO -- : make[2]: Leaving directory '/home/opc/ruby/build/master/ext/fiddle' I, [2024-05-05T15:56:04.298898 #823650] INFO -- : make[2]: Entering directory '/home/opc/ruby/build/master/ext/monitor' I, [2024-05-05T15:56:04.302953 #823650] INFO -- : make[2]: Leaving directory '/home/opc/ruby/build/master/ext/monitor' I, [2024-05-05T15:56:04.303277 #823650] INFO -- : make[2]: Leaving directory '/home/opc/ruby/build/master/ext/json' I, [2024-05-05T15:56:04.305499 #823650] INFO -- : make[2]: Entering directory '/home/opc/ruby/build/master/ext/objspace' I, [2024-05-05T15:56:04.307440 #823650] INFO -- : make[2]: Entering directory '/home/opc/ruby/build/master/ext/pathname' I, [2024-05-05T15:56:04.311446 #823650] INFO -- : make[2]: Leaving directory '/home/opc/ruby/build/master/ext/pathname' I, [2024-05-05T15:56:04.312180 #823650] INFO -- : make[2]: Leaving directory '/home/opc/ruby/build/master/ext/objspace' I, [2024-05-05T15:56:04.316375 #823650] INFO -- : make[2]: Entering directory '/home/opc/ruby/build/master/ext/pty' I, [2024-05-05T15:56:04.318198 #823650] INFO -- : make[2]: Entering directory '/home/opc/ruby/build/master/ext/psych' I, [2024-05-05T15:56:04.322132 #823650] INFO -- : make[2]: Entering directory '/home/opc/ruby/build/master/ext/openssl' I, [2024-05-05T15:56:04.332209 #823650] INFO -- : make[2]: Leaving directory '/home/opc/ruby/build/master/ext/pty' I, [2024-05-05T15:56:04.332565 #823650] INFO -- : make[2]: Leaving directory '/home/opc/ruby/build/master/ext/psych' I, [2024-05-05T15:56:04.339817 #823650] INFO -- : make[2]: Entering directory '/home/opc/ruby/build/master/ext/rubyvm' I, [2024-05-05T15:56:04.340473 #823650] INFO -- : make[2]: Entering directory '/home/opc/ruby/build/master/ext/ripper' I, [2024-05-05T15:56:04.343842 #823650] INFO -- : make[2]: Leaving directory '/home/opc/ruby/build/master/ext/openssl' I, [2024-05-05T15:56:04.345511 #823650] INFO -- : make[2]: Leaving directory '/home/opc/ruby/build/master/ext/rubyvm' I, [2024-05-05T15:56:04.348613 #823650] INFO -- : make[2]: Leaving directory '/home/opc/ruby/build/master/ext/ripper' I, [2024-05-05T15:56:04.355440 #823650] INFO -- : make[2]: Entering directory '/home/opc/ruby/build/master/.bundle/gems/bigdecimal-3.1.7/ext/bigdecimal' I, [2024-05-05T15:56:04.355913 #823650] INFO -- : make[2]: Entering directory '/home/opc/ruby/build/master/ext/socket' I, [2024-05-05T15:56:04.357205 #823650] INFO -- : make[2]: Entering directory '/home/opc/ruby/build/master/.bundle/gems/debug-1.9.2/ext/debug' I, [2024-05-05T15:56:04.367748 #823650] INFO -- : make[2]: Leaving directory '/home/opc/ruby/build/master/ext/socket' I, [2024-05-05T15:56:04.370298 #823650] INFO -- : make[2]: Entering directory '/home/opc/ruby/build/master/.bundle/gems/nkf-0.2.0/ext/nkf' I, [2024-05-05T15:56:04.386139 #823650] INFO -- : make[2]: Leaving directory '/home/opc/ruby/build/master/.bundle/gems/bigdecimal-3.1.7/ext/bigdecimal' I, [2024-05-05T15:56:04.388580 #823650] INFO -- : make[2]: Entering directory '/home/opc/ruby/build/master/.bundle/gems/racc-1.7.3/ext/racc/cparse' I, [2024-05-05T15:56:04.389395 #823650] INFO -- : make[2]: Leaving directory '/home/opc/ruby/build/master/.bundle/gems/debug-1.9.2/ext/debug' I, [2024-05-05T15:56:04.392237 #823650] INFO -- : make[2]: Entering directory '/home/opc/ruby/build/master/.bundle/gems/rbs-3.4.4/ext/rbs_extension' I, [2024-05-05T15:56:04.402553 #823650] INFO -- : make[2]: Leaving directory '/home/opc/ruby/build/master/.bundle/gems/nkf-0.2.0/ext/nkf' I, [2024-05-05T15:56:04.405397 #823650] INFO -- : make[2]: Entering directory '/home/opc/ruby/build/master/.bundle/gems/syslog-0.1.2/ext/syslog' I, [2024-05-05T15:56:04.419527 #823650] INFO -- : make[2]: Leaving directory '/home/opc/ruby/build/master/.bundle/gems/racc-1.7.3/ext/racc/cparse' I, [2024-05-05T15:56:04.424351 #823650] INFO -- : make[2]: Leaving directory '/home/opc/ruby/build/master/.bundle/gems/rbs-3.4.4/ext/rbs_extension' I, [2024-05-05T15:56:04.434566 #823650] INFO -- : make[2]: Entering directory '/home/opc/ruby/build/master/ext/digest/sha2' I, [2024-05-05T15:56:04.436263 #823650] INFO -- : make[2]: Leaving directory '/home/opc/ruby/build/master/.bundle/gems/syslog-0.1.2/ext/syslog' I, [2024-05-05T15:56:04.440626 #823650] INFO -- : make[2]: Leaving directory '/home/opc/ruby/build/master/ext/digest/sha2' I, [2024-05-05T15:56:04.478596 #823650] INFO -- : make[2]: Entering directory '/home/opc/ruby/build/master' I, [2024-05-05T15:56:04.561429 #823650] INFO -- : make[2]: 'ruby' is up to date. I, [2024-05-05T15:56:04.561503 #823650] INFO -- : make[2]: Leaving directory '/home/opc/ruby/build/master' I, [2024-05-05T15:56:04.561649 #823650] INFO -- : make[1]: Leaving directory '/home/opc/ruby/build/master' I, [2024-05-05T15:56:04.566202 #823650] INFO -- : make[1]: Entering directory '/home/opc/ruby/build/master' I, [2024-05-05T15:56:04.566271 #823650] INFO -- : make[1]: Nothing to be done for 'note'. I, [2024-05-05T15:56:04.566284 #823650] INFO -- : make[1]: Leaving directory '/home/opc/ruby/build/master' I, [2024-05-05T15:56:04.566560 #823650] INFO -- : $$$[end] "make all -j3" exit with 0. I, [2024-05-05T15:56:04.566690 #823650] INFO -- : $$$[beg] make install -j3 I, [2024-05-05T15:56:04.660023 #823650] INFO -- : Update minitest to ea9caafc0754b1d6236a490d59e624b53209734a I, [2024-05-05T15:56:04.660112 #823650] INFO -- : Update power_assert to 84e85124c5014a139af39161d484156cfe87a9ed I, [2024-05-05T15:56:04.660421 #823650] INFO -- : Update rbs to ba7872795d5de04adb8ff500c0e6afdc81a041dd I, [2024-05-05T15:56:04.663737 #823650] INFO -- : echo ea9caafc0754b1d6236a490d59e624b53209734a | /bin/sh /home/opc/ruby/src/master/tool/ifchange /home/opc/ruby/src/master/.bundle/.timestamp/minitest.revision - I, [2024-05-05T15:56:04.663868 #823650] INFO -- : echo 84e85124c5014a139af39161d484156cfe87a9ed | /bin/sh /home/opc/ruby/src/master/tool/ifchange /home/opc/ruby/src/master/.bundle/.timestamp/power_assert.revision - I, [2024-05-05T15:56:04.664077 #823650] INFO -- : echo ba7872795d5de04adb8ff500c0e6afdc81a041dd | /bin/sh /home/opc/ruby/src/master/tool/ifchange /home/opc/ruby/src/master/.bundle/.timestamp/rbs.revision - I, [2024-05-05T15:56:04.669765 #823650] INFO -- : /home/opc/ruby/src/master/.bundle/.timestamp/rbs.revision unchanged I, [2024-05-05T15:56:04.670482 #823650] INFO -- : /home/opc/ruby/src/master/.bundle/.timestamp/power_assert.revision unchanged I, [2024-05-05T15:56:04.670728 #823650] INFO -- : /home/opc/ruby/src/master/.bundle/.timestamp/minitest.revision unchanged I, [2024-05-05T15:56:04.672947 #823650] INFO -- : Update typeprof to b19a6416da3a05d57fadd6ffdadb382b6d236ca5 I, [2024-05-05T15:56:04.675108 #823650] INFO -- : BASERUBY = /usr/local/bin/ruby --disable=gems I, [2024-05-05T15:56:04.675145 #823650] INFO -- : CC = gcc I, [2024-05-05T15:56:04.675156 #823650] INFO -- : LD = ld I, [2024-05-05T15:56:04.675165 #823650] INFO -- : LDSHARED = gcc -shared I, [2024-05-05T15:56:04.675176 #823650] INFO -- : CFLAGS = -O3 -fno-fast-math -ggdb3 -Wall -Wextra -Wdeprecated-declarations -Wdiv-by-zero -Wduplicated-cond -Wimplicit-function-declaration -Wimplicit-int -Wpointer-arith -Wwrite-strings -Wold-style-definition -Wimplicit-fallthrough=0 -Wmissing-noreturn -Wno-cast-function-type -Wno-constant-logical-operand -Wno-long-long -Wno-missing-field-initializers -Wno-overlength-strings -Wno-packed-bitfield-compat -Wno-parentheses-equality -Wno-self-assign -Wno-tautological-compare -Wno-unused-parameter -Wno-unused-value -Wsuggest-attribute=format -Wsuggest-attribute=noreturn -Wunused-variable -Wmisleading-indentation -Wundef I, [2024-05-05T15:56:04.675210 #823650] INFO -- : XCFLAGS = -U_FORTIFY_SOURCE -D_FORTIFY_SOURCE=2 -fstack-protector-strong -msign-return-address=all -fno-strict-overflow -fvisibility=hidden -fexcess-precision=standard -DRUBY_EXPORT -fPIE -I. -I.ext/include/aarch64-linux -I/home/opc/ruby/src/master/include -I/home/opc/ruby/src/master -I/home/opc/ruby/src/master/prism -I/home/opc/ruby/src/master/enc/unicode/15.0.0 I, [2024-05-05T15:56:04.675222 #823650] INFO -- : CPPFLAGS = I, [2024-05-05T15:56:04.675230 #823650] INFO -- : DLDFLAGS = -Wl,--compress-debug-sections=zlib -fstack-protector-strong -pie I, [2024-05-05T15:56:04.675239 #823650] INFO -- : SOLIBS = -lz -lrt -lrt -ldl -lcrypt -lm -lpthread I, [2024-05-05T15:56:04.675247 #823650] INFO -- : LANG = en_US.UTF-8 I, [2024-05-05T15:56:04.675255 #823650] INFO -- : LC_ALL = I, [2024-05-05T15:56:04.675263 #823650] INFO -- : LC_CTYPE = I, [2024-05-05T15:56:04.675270 #823650] INFO -- : MFLAGS = -j3 --jobserver-auth=4,5 I, [2024-05-05T15:56:04.675278 #823650] INFO -- : RUSTC = rustc I, [2024-05-05T15:56:04.675286 #823650] INFO -- : YJIT_RUSTC_ARGS = --crate-name=yjit --crate-type=staticlib --edition=2021 -g -C lto=thin -C opt-level=3 -C overflow-checks=on '--out-dir=/home/opc/ruby/build/master/yjit/target/release/' /home/opc/ruby/src/master/yjit/src/lib.rs I, [2024-05-05T15:56:04.706142 #823650] INFO -- : echo b19a6416da3a05d57fadd6ffdadb382b6d236ca5 | /bin/sh /home/opc/ruby/src/master/tool/ifchange /home/opc/ruby/src/master/.bundle/.timestamp/typeprof.revision - I, [2024-05-05T15:56:04.707151 #823650] INFO -- : gcc (GCC) 8.5.0 20210514 (Red Hat 8.5.0-10.1.0.1) I, [2024-05-05T15:56:04.707191 #823650] INFO -- : Copyright (C) 2018 Free Software Foundation, Inc. I, [2024-05-05T15:56:04.707201 #823650] INFO -- : This is free software; see the source for copying conditions. There is NO I, [2024-05-05T15:56:04.707211 #823650] INFO -- : warranty; not even for MERCHANTABILITY or FITNESS FOR A PARTICULAR PURPOSE. I, [2024-05-05T15:56:04.707220 #823650] INFO -- : I, [2024-05-05T15:56:04.707597 #823650] INFO -- : generating enc.mk I, [2024-05-05T15:56:04.711700 #823650] INFO -- : /home/opc/ruby/src/master/.bundle/.timestamp/typeprof.revision unchanged I, [2024-05-05T15:56:04.811424 #823650] INFO -- : Building power_assert@84e85124c5014a139af39161d484156cfe87a9ed to /home/opc/ruby/src/master/gems/power_assert-2.0.3.gem I, [2024-05-05T15:56:04.931131 #823650] INFO -- : Successfully built RubyGem I, [2024-05-05T15:56:04.931192 #823650] INFO -- : Name: power_assert I, [2024-05-05T15:56:04.931203 #823650] INFO -- : Version: 2.0.4dev I, [2024-05-05T15:56:04.931212 #823650] INFO -- : File: power_assert-2.0.4dev.gem I, [2024-05-05T15:56:04.933545 #823650] INFO -- : Extracting bundle gem power_assert-2.0.3... I, [2024-05-05T15:56:04.951916 #823650] INFO -- : making srcs under enc I, [2024-05-05T15:56:04.952185 #823650] INFO -- : making enc I, [2024-05-05T15:56:04.980448 #823650] INFO -- : make[1]: Entering directory '/home/opc/ruby/build/master' I, [2024-05-05T15:56:04.981371 #823650] INFO -- : make[1]: Nothing to be done for 'enc'. I, [2024-05-05T15:56:04.981417 #823650] INFO -- : make[1]: Leaving directory '/home/opc/ruby/build/master' I, [2024-05-05T15:56:04.994147 #823650] INFO -- : make[1]: Entering directory '/home/opc/ruby/build/master' I, [2024-05-05T15:56:04.994194 #823650] INFO -- : make[1]: Nothing to be done for 'srcs'. I, [2024-05-05T15:56:04.994206 #823650] INFO -- : make[1]: Leaving directory '/home/opc/ruby/build/master' I, [2024-05-05T15:56:04.994982 #823650] INFO -- : generating transdb.h I, [2024-05-05T15:56:05.032286 #823650] INFO -- : Try with hash version of bundled gems instead of gems/power_assert-2.0.3.gem. We don't use this gem with release version of Ruby. I, [2024-05-05T15:56:05.042725 #823650] INFO -- : Unpacked gems/power_assert-2.0.4dev.gem I, [2024-05-05T15:56:05.139691 #823650] INFO -- : transdb.h unchanged I, [2024-05-05T15:56:05.141101 #823650] INFO -- : generating makefiles ext/configure-ext.mk I, [2024-05-05T15:56:05.141186 #823650] INFO -- : making trans I, [2024-05-05T15:56:05.180737 #823650] INFO -- : ext/configure-ext.mk unchanged I, [2024-05-05T15:56:05.183779 #823650] INFO -- : make[1]: Entering directory '/home/opc/ruby/build/master' I, [2024-05-05T15:56:05.189621 #823650] INFO -- : make[1]: Entering directory '/home/opc/ruby/build/master' I, [2024-05-05T15:56:05.189673 #823650] INFO -- : make[1]: Nothing to be done for 'trans'. I, [2024-05-05T15:56:05.189684 #823650] INFO -- : make[1]: Leaving directory '/home/opc/ruby/build/master' I, [2024-05-05T15:56:05.870500 #823650] INFO -- : making encs I, [2024-05-05T15:56:05.892478 #823650] INFO -- : make[1]: Leaving directory '/home/opc/ruby/build/master' I, [2024-05-05T15:56:05.893176 #823650] INFO -- : generating makefile exts.mk I, [2024-05-05T15:56:05.928602 #823650] INFO -- : make[1]: Entering directory '/home/opc/ruby/build/master' I, [2024-05-05T15:56:05.928673 #823650] INFO -- : make[1]: Nothing to be done for 'encs'. I, [2024-05-05T15:56:05.928685 #823650] INFO -- : make[1]: Leaving directory '/home/opc/ruby/build/master' I, [2024-05-05T15:56:05.951217 #823650] INFO -- : exts.mk unchanged I, [2024-05-05T15:56:05.956085 #823650] INFO -- : make[1]: Entering directory '/home/opc/ruby/build/master' I, [2024-05-05T15:56:06.059036 #823650] INFO -- : make[2]: Entering directory '/home/opc/ruby/build/master/ext/coverage' I, [2024-05-05T15:56:06.061477 #823650] INFO -- : make[2]: Entering directory '/home/opc/ruby/build/master/ext/digest' I, [2024-05-05T15:56:06.062518 #823650] INFO -- : make[2]: Entering directory '/home/opc/ruby/build/master/ext/date' I, [2024-05-05T15:56:06.063504 #823650] INFO -- : make[2]: Leaving directory '/home/opc/ruby/build/master/ext/coverage' I, [2024-05-05T15:56:06.067944 #823650] INFO -- : make[2]: Leaving directory '/home/opc/ruby/build/master/ext/date' I, [2024-05-05T15:56:06.069340 #823650] INFO -- : make[2]: Leaving directory '/home/opc/ruby/build/master/ext/digest' I, [2024-05-05T15:56:06.075815 #823650] INFO -- : make[2]: Entering directory '/home/opc/ruby/build/master/ext/io/console' I, [2024-05-05T15:56:06.076403 #823650] INFO -- : make[2]: Entering directory '/home/opc/ruby/build/master/ext/fiddle' I, [2024-05-05T15:56:06.080201 #823650] INFO -- : make[2]: Leaving directory '/home/opc/ruby/build/master/ext/io/console' I, [2024-05-05T15:56:06.082535 #823650] INFO -- : make[2]: Entering directory '/home/opc/ruby/build/master/ext/json' I, [2024-05-05T15:56:06.086839 #823650] INFO -- : make[2]: Leaving directory '/home/opc/ruby/build/master/ext/fiddle' I, [2024-05-05T15:56:06.090408 #823650] INFO -- : make[2]: Entering directory '/home/opc/ruby/build/master/ext/monitor' I, [2024-05-05T15:56:06.090450 #823650] INFO -- : make[2]: Leaving directory '/home/opc/ruby/build/master/ext/json' I, [2024-05-05T15:56:06.094111 #823650] INFO -- : make[2]: Leaving directory '/home/opc/ruby/build/master/ext/monitor' I, [2024-05-05T15:56:06.094888 #823650] INFO -- : make[2]: Entering directory '/home/opc/ruby/build/master/ext/objspace' I, [2024-05-05T15:56:06.098204 #823650] INFO -- : make[2]: Entering directory '/home/opc/ruby/build/master/ext/pathname' I, [2024-05-05T15:56:06.104334 #823650] INFO -- : make[2]: Leaving directory '/home/opc/ruby/build/master/ext/objspace' I, [2024-05-05T15:56:06.104759 #823650] INFO -- : make[2]: Leaving directory '/home/opc/ruby/build/master/ext/pathname' I, [2024-05-05T15:56:06.108979 #823650] INFO -- : make[2]: Entering directory '/home/opc/ruby/build/master/ext/pty' I, [2024-05-05T15:56:06.110188 #823650] INFO -- : make[2]: Entering directory '/home/opc/ruby/build/master/ext/openssl' I, [2024-05-05T15:56:06.110551 #823650] INFO -- : make[2]: Entering directory '/home/opc/ruby/build/master/ext/psych' I, [2024-05-05T15:56:06.113251 #823650] INFO -- : make[2]: Leaving directory '/home/opc/ruby/build/master/ext/pty' I, [2024-05-05T15:56:06.127105 #823650] INFO -- : make[2]: Entering directory '/home/opc/ruby/build/master/ext/ripper' I, [2024-05-05T15:56:06.132072 #823650] INFO -- : make[2]: Leaving directory '/home/opc/ruby/build/master/ext/psych' I, [2024-05-05T15:56:06.132130 #823650] INFO -- : make[2]: Leaving directory '/home/opc/ruby/build/master/ext/openssl' I, [2024-05-05T15:56:06.133822 #823650] INFO -- : make[2]: Entering directory '/home/opc/ruby/build/master/ext/rubyvm' I, [2024-05-05T15:56:06.135171 #823650] INFO -- : make[2]: Leaving directory '/home/opc/ruby/build/master/ext/ripper' I, [2024-05-05T15:56:06.137274 #823650] INFO -- : make[2]: Leaving directory '/home/opc/ruby/build/master/ext/rubyvm' I, [2024-05-05T15:56:06.143775 #823650] INFO -- : make[2]: Entering directory '/home/opc/ruby/build/master/.bundle/gems/bigdecimal-3.1.7/ext/bigdecimal' I, [2024-05-05T15:56:06.144185 #823650] INFO -- : make[2]: Entering directory '/home/opc/ruby/build/master/ext/socket' I, [2024-05-05T15:56:06.147237 #823650] INFO -- : make[2]: Entering directory '/home/opc/ruby/build/master/.bundle/gems/debug-1.9.2/ext/debug' I, [2024-05-05T15:56:06.154789 #823650] INFO -- : make[2]: Leaving directory '/home/opc/ruby/build/master/ext/socket' I, [2024-05-05T15:56:06.157484 #823650] INFO -- : make[2]: Entering directory '/home/opc/ruby/build/master/.bundle/gems/nkf-0.2.0/ext/nkf' I, [2024-05-05T15:56:06.175705 #823650] INFO -- : make[2]: Leaving directory '/home/opc/ruby/build/master/.bundle/gems/bigdecimal-3.1.7/ext/bigdecimal' I, [2024-05-05T15:56:06.178236 #823650] INFO -- : make[2]: Entering directory '/home/opc/ruby/build/master/.bundle/gems/racc-1.7.3/ext/racc/cparse' I, [2024-05-05T15:56:06.179305 #823650] INFO -- : make[2]: Leaving directory '/home/opc/ruby/build/master/.bundle/gems/debug-1.9.2/ext/debug' I, [2024-05-05T15:56:06.182076 #823650] INFO -- : make[2]: Entering directory '/home/opc/ruby/build/master/.bundle/gems/rbs-3.4.4/ext/rbs_extension' I, [2024-05-05T15:56:06.191425 #823650] INFO -- : make[2]: Leaving directory '/home/opc/ruby/build/master/.bundle/gems/nkf-0.2.0/ext/nkf' I, [2024-05-05T15:56:06.197681 #823650] INFO -- : make[2]: Entering directory '/home/opc/ruby/build/master/.bundle/gems/syslog-0.1.2/ext/syslog' I, [2024-05-05T15:56:06.209858 #823650] INFO -- : make[2]: Leaving directory '/home/opc/ruby/build/master/.bundle/gems/racc-1.7.3/ext/racc/cparse' I, [2024-05-05T15:56:06.214320 #823650] INFO -- : make[2]: Leaving directory '/home/opc/ruby/build/master/.bundle/gems/rbs-3.4.4/ext/rbs_extension' I, [2024-05-05T15:56:06.226243 #823650] INFO -- : make[2]: Entering directory '/home/opc/ruby/build/master/ext/digest/sha2' I, [2024-05-05T15:56:06.229593 #823650] INFO -- : make[2]: Leaving directory '/home/opc/ruby/build/master/.bundle/gems/syslog-0.1.2/ext/syslog' I, [2024-05-05T15:56:06.231679 #823650] INFO -- : make[2]: Leaving directory '/home/opc/ruby/build/master/ext/digest/sha2' I, [2024-05-05T15:56:06.270457 #823650] INFO -- : make[2]: Entering directory '/home/opc/ruby/build/master' I, [2024-05-05T15:56:06.354186 #823650] INFO -- : make[2]: 'ruby' is up to date. I, [2024-05-05T15:56:06.354258 #823650] INFO -- : make[2]: Leaving directory '/home/opc/ruby/build/master' I, [2024-05-05T15:56:06.354407 #823650] INFO -- : make[1]: Leaving directory '/home/opc/ruby/build/master' I, [2024-05-05T15:56:06.358823 #823650] INFO -- : make[1]: Entering directory '/home/opc/ruby/build/master' I, [2024-05-05T15:56:06.358877 #823650] INFO -- : make[1]: Nothing to be done for 'note'. I, [2024-05-05T15:56:06.358888 #823650] INFO -- : make[1]: Leaving directory '/home/opc/ruby/build/master' I, [2024-05-05T15:56:06.359043 #823650] INFO -- : ./miniruby -I/home/opc/ruby/src/master/lib -I. -I.ext/common /home/opc/ruby/src/master/tool/runruby.rb --extout=.ext -- --disable-gems -r./aarch64-linux-fake /home/opc/ruby/src/master/tool/rbinstall.rb --make="make" --dest-dir="" --extout=".ext" --ext-build-dir="./ext" --mflags="-j3 --jobserver-auth=4,5" --make-flags=" -j3 --jobserver-auth=4,5" --data-mode=0644 --prog-mode=0755 --installed-list .installed.list --mantype="doc" --gnumake --install=all --exclude=doc I, [2024-05-05T15:56:06.504625 #823650] INFO -- : Installing to I, [2024-05-05T15:56:06.504694 #823650] INFO -- : installing binary commands: /home/opc/ruby/install/master/bin I, [2024-05-05T15:56:06.516409 #823650] INFO -- : installing base libraries: /home/opc/ruby/install/master/lib I, [2024-05-05T15:56:06.516938 #823650] INFO -- : installing arch files: /home/opc/ruby/install/master/lib/ruby/3.4.0+0/aarch64-linux I, [2024-05-05T15:56:06.517079 #823650] INFO -- : installing pkgconfig data: /home/opc/ruby/install/master/lib/pkgconfig I, [2024-05-05T15:56:06.517147 #823650] INFO -- : installing extension objects: /home/opc/ruby/install/master/lib/ruby/3.4.0+0/aarch64-linux I, [2024-05-05T15:56:06.529618 #823650] INFO -- : installing extension objects: /home/opc/ruby/install/master/lib/ruby/site_ruby/3.4.0+0/aarch64-linux I, [2024-05-05T15:56:06.529657 #823650] INFO -- : installing extension objects: /home/opc/ruby/install/master/lib/ruby/vendor_ruby/3.4.0+0/aarch64-linux I, [2024-05-05T15:56:06.529757 #823650] INFO -- : installing extension headers: /home/opc/ruby/install/master/include/ruby-3.4.0+0/aarch64-linux I, [2024-05-05T15:56:06.530034 #823650] INFO -- : installing extension scripts: /home/opc/ruby/install/master/lib/ruby/3.4.0+0 I, [2024-05-05T15:56:06.538366 #823650] INFO -- : installing extension scripts: /home/opc/ruby/install/master/lib/ruby/site_ruby/3.4.0+0 I, [2024-05-05T15:56:06.538392 #823650] INFO -- : installing extension scripts: /home/opc/ruby/install/master/lib/ruby/vendor_ruby/3.4.0+0 I, [2024-05-05T15:56:06.538404 #823650] INFO -- : installing extension headers: /home/opc/ruby/install/master/include/ruby-3.4.0+0/ruby I, [2024-05-05T15:56:06.538536 #823650] INFO -- : installing command scripts: /home/opc/ruby/install/master/bin I, [2024-05-05T15:56:06.538667 #823650] INFO -- : installing library scripts: /home/opc/ruby/install/master/lib/ruby/3.4.0+0 I, [2024-05-05T15:56:06.622576 #823650] INFO -- : installing common headers: /home/opc/ruby/install/master/include/ruby-3.4.0+0 I, [2024-05-05T15:56:06.637822 #823650] INFO -- : installing manpages: /home/opc/ruby/install/master/share/man/man1 I, [2024-05-05T15:56:06.638106 #823650] INFO -- : installing default gems from lib: /home/opc/ruby/install/master/lib/ruby/gems/3.4.0+0 I, [2024-05-05T15:56:06.677831 #823650] INFO -- : benchmark 0.3.0 I, [2024-05-05T15:56:06.691435 #823650] INFO -- : bundler 2.6.0.dev I, [2024-05-05T15:56:06.696522 #823650] INFO -- : cgi 0.4.1 I, [2024-05-05T15:56:06.697746 #823650] INFO -- : delegate 0.3.1 I, [2024-05-05T15:56:06.698820 #823650] INFO -- : did_you_mean 1.6.3 I, [2024-05-05T15:56:06.699948 #823650] INFO -- : english 0.8.0 I, [2024-05-05T15:56:06.701101 #823650] INFO -- : erb 4.0.4 I, [2024-05-05T15:56:06.703798 #823650] INFO -- : error_highlight 0.6.0 I, [2024-05-05T15:56:06.704910 #823650] INFO -- : fileutils 1.7.2 I, [2024-05-05T15:56:06.706040 #823650] INFO -- : find 0.2.0 I, [2024-05-05T15:56:06.707131 #823650] INFO -- : forwardable 1.3.3 I, [2024-05-05T15:56:06.708213 #823650] INFO -- : ipaddr 1.2.6 I, [2024-05-05T15:56:06.709363 #823650] INFO -- : irb 1.13.1 I, [2024-05-05T15:56:06.712022 #823650] INFO -- : logger 1.6.0 I, [2024-05-05T15:56:06.713238 #823650] INFO -- : net-http 0.4.1 I, [2024-05-05T15:56:06.716334 #823650] INFO -- : net-protocol 0.2.2 I, [2024-05-05T15:56:06.717559 #823650] INFO -- : open-uri 0.4.1 I, [2024-05-05T15:56:06.718708 #823650] INFO -- : open3 0.2.1 I, [2024-05-05T15:56:06.719804 #823650] INFO -- : optparse 0.5.0 I, [2024-05-05T15:56:06.720967 #823650] INFO -- : ostruct 0.6.0 I, [2024-05-05T15:56:06.722088 #823650] INFO -- : pp 0.5.0 I, [2024-05-05T15:56:06.723238 #823650] INFO -- : prettyprint 0.2.0 I, [2024-05-05T15:56:06.724359 #823650] INFO -- : prism 0.27.0 I, [2024-05-05T15:56:06.725606 #823650] INFO -- : pstore 0.1.3 I, [2024-05-05T15:56:06.726705 #823650] INFO -- : rdoc 6.6.3.1 I, [2024-05-05T15:56:06.730976 #823650] INFO -- : readline 0.0.4 I, [2024-05-05T15:56:06.732074 #823650] INFO -- : reline 0.5.5 I, [2024-05-05T15:56:06.733332 #823650] INFO -- : resolv 0.4.0 I, [2024-05-05T15:56:06.734451 #823650] INFO -- : ruby2_keywords 0.0.5 I, [2024-05-05T15:56:06.735565 #823650] INFO -- : securerandom 0.3.1 I, [2024-05-05T15:56:06.736704 #823650] INFO -- : set 1.1.0 I, [2024-05-05T15:56:06.737878 #823650] INFO -- : shellwords 0.2.0 I, [2024-05-05T15:56:06.739180 #823650] INFO -- : singleton 0.2.0 I, [2024-05-05T15:56:06.740284 #823650] INFO -- : syntax_suggest 2.0.0 I, [2024-05-05T15:56:06.744638 #823650] INFO -- : tempfile 0.2.1 I, [2024-05-05T15:56:06.745839 #823650] INFO -- : time 0.3.0 I, [2024-05-05T15:56:06.746988 #823650] INFO -- : timeout 0.4.1 I, [2024-05-05T15:56:06.748098 #823650] INFO -- : tmpdir 0.2.0 I, [2024-05-05T15:56:06.749310 #823650] INFO -- : tsort 0.2.0 I, [2024-05-05T15:56:06.750440 #823650] INFO -- : un 0.3.0 I, [2024-05-05T15:56:06.751546 #823650] INFO -- : uri 0.13.0 I, [2024-05-05T15:56:06.752734 #823650] INFO -- : weakref 0.1.3 I, [2024-05-05T15:56:06.753918 #823650] INFO -- : yaml 0.3.0 I, [2024-05-05T15:56:06.754824 #823650] INFO -- : installing default gems from ext: /home/opc/ruby/install/master/lib/ruby/gems/3.4.0+0 I, [2024-05-05T15:56:06.764348 #823650] INFO -- : date 3.3.4 I, [2024-05-05T15:56:06.767189 #823650] INFO -- : digest 3.1.1 I, [2024-05-05T15:56:06.768281 #823650] INFO -- : etc 1.4.3 I, [2024-05-05T15:56:06.769558 #823650] INFO -- : fcntl 1.1.0 I, [2024-05-05T15:56:06.770659 #823650] INFO -- : fiddle 1.1.3 I, [2024-05-05T15:56:06.771780 #823650] INFO -- : io-console 0.7.2 I, [2024-05-05T15:56:06.772908 #823650] INFO -- : io-nonblock 0.3.0 I, [2024-05-05T15:56:06.774047 #823650] INFO -- : io-wait 0.3.1 I, [2024-05-05T15:56:06.775114 #823650] INFO -- : json 2.7.2 I, [2024-05-05T15:56:06.776328 #823650] INFO -- : openssl 3.2.0 I, [2024-05-05T15:56:06.777585 #823650] INFO -- : pathname 0.3.0 I, [2024-05-05T15:56:06.779152 #823650] INFO -- : psych 5.1.2 I, [2024-05-05T15:56:06.780575 #823650] INFO -- : stringio 3.1.1 I, [2024-05-05T15:56:06.781802 #823650] INFO -- : strscan 3.1.1 I, [2024-05-05T15:56:06.782901 #823650] INFO -- : zlib 3.1.0 I, [2024-05-05T15:56:06.783826 #823650] INFO -- : installing bundled gems: /home/opc/ruby/install/master/lib/ruby/gems/3.4.0+0 I, [2024-05-05T15:56:06.784455 #823650] INFO -- : minitest 5.22.3 I, [2024-05-05T15:56:06.798677 #823650] INFO -- : rake 13.2.1 I, [2024-05-05T15:56:06.812191 #823650] INFO -- : test-unit 3.6.2 I, [2024-05-05T15:56:06.828587 #823650] INFO -- : rexml 3.2.6 I, [2024-05-05T15:56:06.842332 #823650] INFO -- : rss 0.3.0 I, [2024-05-05T15:56:06.852157 #823650] INFO -- : net-ftp 0.3.4 I, [2024-05-05T15:56:06.855728 #823650] INFO -- : net-imap 0.4.10 I, [2024-05-05T15:56:06.866067 #823650] INFO -- : net-pop 0.1.2 I, [2024-05-05T15:56:06.870483 #823650] INFO -- : net-smtp 0.5.0 I, [2024-05-05T15:56:06.873713 #823650] INFO -- : matrix 0.4.2 I, [2024-05-05T15:56:06.879366 #823650] INFO -- : prime 0.1.2 I, [2024-05-05T15:56:06.889705 #823650] INFO -- : rbs 3.4.4 I, [2024-05-05T15:56:06.984264 #823650] INFO -- : typeprof 0.21.11 I, [2024-05-05T15:56:07.006869 #823650] INFO -- : debug 1.9.2 I, [2024-05-05T15:56:07.016626 #823650] INFO -- : racc 1.7.3 I, [2024-05-05T15:56:07.026528 #823650] INFO -- : mutex_m 0.2.0 I, [2024-05-05T15:56:07.029383 #823650] INFO -- : getoptlong 0.2.1 I, [2024-05-05T15:56:07.034898 #823650] INFO -- : base64 0.2.0 I, [2024-05-05T15:56:07.037537 #823650] INFO -- : bigdecimal 3.1.7 I, [2024-05-05T15:56:07.043684 #823650] INFO -- : observer 0.1.2 I, [2024-05-05T15:56:07.046736 #823650] INFO -- : abbrev 0.1.2 I, [2024-05-05T15:56:07.049668 #823650] INFO -- : resolv-replace 0.1.1 I, [2024-05-05T15:56:07.052637 #823650] INFO -- : rinda 0.2.0 I, [2024-05-05T15:56:07.055949 #823650] INFO -- : drb 2.2.1 I, [2024-05-05T15:56:07.060327 #823650] INFO -- : nkf 0.2.0 I, [2024-05-05T15:56:07.067809 #823650] INFO -- : syslog 0.1.2 I, [2024-05-05T15:56:07.072234 #823650] INFO -- : csv 3.3.0 I, [2024-05-05T15:56:07.081416 #823650] INFO -- : installing bundled gem cache: /home/opc/ruby/install/master/lib/ruby/gems/3.4.0+0/cache I, [2024-05-05T15:56:07.083215 #823650] INFO -- : skipped bundled gems: I, [2024-05-05T15:56:07.083238 #823650] INFO -- : power_assert-2.0.4dev.gem not found in bundled_gems I, [2024-05-05T15:56:07.086203 #823650] INFO -- : $$$[end] "make install -j3" exit with 0. I, [2024-05-05T15:56:07.086351 #823650] INFO -- : $$$[beg] make yes-btest TESTOPTS='-q -j3' I, [2024-05-05T15:56:29.236370 #823650] INFO -- : PASS all 1936 tests E, [2024-05-05T15:56:29.238154 #823650] ERROR -- : I, [2024-05-05T15:56:29.238336 #823650] INFO -- : $$$[end] "make yes-btest TESTOPTS='-q -j3'" exit with 0. I, [2024-05-05T15:56:29.238480 #823650] INFO -- : $$$[beg] make yes-test-basic TESTS='-j3' I, [2024-05-05T15:56:29.330372 #823650] INFO -- : BASERUBY = /usr/local/bin/ruby --disable=gems I, [2024-05-05T15:56:29.330446 #823650] INFO -- : CC = gcc I, [2024-05-05T15:56:29.330457 #823650] INFO -- : LD = ld I, [2024-05-05T15:56:29.330465 #823650] INFO -- : LDSHARED = gcc -shared I, [2024-05-05T15:56:29.330477 #823650] INFO -- : CFLAGS = -O3 -fno-fast-math -ggdb3 -Wall -Wextra -Wdeprecated-declarations -Wdiv-by-zero -Wduplicated-cond -Wimplicit-function-declaration -Wimplicit-int -Wpointer-arith -Wwrite-strings -Wold-style-definition -Wimplicit-fallthrough=0 -Wmissing-noreturn -Wno-cast-function-type -Wno-constant-logical-operand -Wno-long-long -Wno-missing-field-initializers -Wno-overlength-strings -Wno-packed-bitfield-compat -Wno-parentheses-equality -Wno-self-assign -Wno-tautological-compare -Wno-unused-parameter -Wno-unused-value -Wsuggest-attribute=format -Wsuggest-attribute=noreturn -Wunused-variable -Wmisleading-indentation -Wundef I, [2024-05-05T15:56:29.330487 #823650] INFO -- : XCFLAGS = -U_FORTIFY_SOURCE -D_FORTIFY_SOURCE=2 -fstack-protector-strong -msign-return-address=all -fno-strict-overflow -fvisibility=hidden -fexcess-precision=standard -DRUBY_EXPORT -fPIE -I. -I.ext/include/aarch64-linux -I/home/opc/ruby/src/master/include -I/home/opc/ruby/src/master -I/home/opc/ruby/src/master/prism -I/home/opc/ruby/src/master/enc/unicode/15.0.0 I, [2024-05-05T15:56:29.330495 #823650] INFO -- : CPPFLAGS = I, [2024-05-05T15:56:29.331909 #823650] INFO -- : DLDFLAGS = -Wl,--compress-debug-sections=zlib -fstack-protector-strong -pie I, [2024-05-05T15:56:29.331924 #823650] INFO -- : SOLIBS = -lz -lrt -lrt -ldl -lcrypt -lm -lpthread I, [2024-05-05T15:56:29.331932 #823650] INFO -- : LANG = en_US.UTF-8 I, [2024-05-05T15:56:29.331956 #823650] INFO -- : LC_ALL = I, [2024-05-05T15:56:29.331964 #823650] INFO -- : LC_CTYPE = I, [2024-05-05T15:56:29.331972 #823650] INFO -- : MFLAGS = I, [2024-05-05T15:56:29.331980 #823650] INFO -- : RUSTC = rustc I, [2024-05-05T15:56:29.331988 #823650] INFO -- : YJIT_RUSTC_ARGS = --crate-name=yjit --crate-type=staticlib --edition=2021 -g -C lto=thin -C opt-level=3 -C overflow-checks=on '--out-dir=/home/opc/ruby/build/master/yjit/target/release/' /home/opc/ruby/src/master/yjit/src/lib.rs I, [2024-05-05T15:56:29.332277 #823650] INFO -- : gcc (GCC) 8.5.0 20210514 (Red Hat 8.5.0-10.1.0.1) I, [2024-05-05T15:56:29.332294 #823650] INFO -- : Copyright (C) 2018 Free Software Foundation, Inc. I, [2024-05-05T15:56:29.332303 #823650] INFO -- : This is free software; see the source for copying conditions. There is NO I, [2024-05-05T15:56:29.332311 #823650] INFO -- : warranty; not even for MERCHANTABILITY or FITNESS FOR A PARTICULAR PURPOSE. I, [2024-05-05T15:56:29.332319 #823650] INFO -- : I, [2024-05-05T15:56:29.489597 #823650] INFO -- : Checking leaked global symbols...none I, [2024-05-05T15:56:29.544171 #823650] INFO -- : /home/opc/ruby/src/master/basictest/test.rb:assignment ....................................................................................................................................................................................................................................................................................................................................................................................OK 372 I, [2024-05-05T15:56:29.544255 #823650] INFO -- : /home/opc/ruby/src/master/basictest/test.rb:condition ..OK 2 I, [2024-05-05T15:56:29.544280 #823650] INFO -- : /home/opc/ruby/src/master/basictest/test.rb:if/unless ...OK 3 I, [2024-05-05T15:56:29.544334 #823650] INFO -- : /home/opc/ruby/src/master/basictest/test.rb:case .....OK 5 I, [2024-05-05T15:56:29.544981 #823650] INFO -- : /home/opc/ruby/src/master/basictest/test.rb:while/until ........OK 8 I, [2024-05-05T15:56:29.545145 #823650] INFO -- : /home/opc/ruby/src/master/basictest/test.rb:exception ..........OK 10 I, [2024-05-05T15:56:29.545802 #823650] INFO -- : /home/opc/ruby/src/master/basictest/test.rb:array .......................................OK 39 I, [2024-05-05T15:56:29.546075 #823650] INFO -- : /home/opc/ruby/src/master/basictest/test.rb:hash ...........................OK 27 I, [2024-05-05T15:56:29.547795 #823650] INFO -- : /home/opc/ruby/src/master/basictest/test.rb:iterator ...........................................................................................................OK 107 I, [2024-05-05T15:56:29.548592 #823650] INFO -- : /home/opc/ruby/src/master/basictest/test.rb:float ................................................................................OK 80 I, [2024-05-05T15:56:29.552113 #823650] INFO -- : /home/opc/ruby/src/master/basictest/test.rb:bignum ...............................OK 31 I, [2024-05-05T15:56:29.553825 #823650] INFO -- : /home/opc/ruby/src/master/basictest/test.rb:string & char ..............................................................OK 62 I, [2024-05-05T15:56:29.553902 #823650] INFO -- : /home/opc/ruby/src/master/basictest/test.rb:assignment ..........OK 10 I, [2024-05-05T15:56:29.553978 #823650] INFO -- : /home/opc/ruby/src/master/basictest/test.rb:call ......OK 6 I, [2024-05-05T15:56:29.554115 #823650] INFO -- : /home/opc/ruby/src/master/basictest/test.rb:proc .........OK 9 I, [2024-05-05T15:56:29.654356 #823650] INFO -- : /home/opc/ruby/src/master/basictest/test.rb:signal ..OK 2 I, [2024-05-05T15:56:29.655805 #823650] INFO -- : /home/opc/ruby/src/master/basictest/test.rb:eval ...........................OK 27 I, [2024-05-05T15:56:29.789141 #823650] INFO -- : /home/opc/ruby/src/master/basictest/test.rb:system ........OK 8 I, [2024-05-05T15:56:29.789220 #823650] INFO -- : /home/opc/ruby/src/master/basictest/test.rb:const .....OK 5 I, [2024-05-05T15:56:29.789327 #823650] INFO -- : /home/opc/ruby/src/master/basictest/test.rb:clone .....OK 5 I, [2024-05-05T15:56:29.789516 #823650] INFO -- : /home/opc/ruby/src/master/basictest/test.rb:marshal ....OK 4 I, [2024-05-05T15:56:29.789595 #823650] INFO -- : /home/opc/ruby/src/master/basictest/test.rb:pack ....OK 4 I, [2024-05-05T15:56:29.789628 #823650] INFO -- : /home/opc/ruby/src/master/basictest/test.rb:math ..OK 2 I, [2024-05-05T15:56:29.789719 #823650] INFO -- : /home/opc/ruby/src/master/basictest/test.rb:struct ......OK 6 I, [2024-05-05T15:56:29.789888 #823650] INFO -- : /home/opc/ruby/src/master/basictest/test.rb:variable ............OK 12 I, [2024-05-05T15:56:29.789927 #823650] INFO -- : /home/opc/ruby/src/master/basictest/test.rb:trace ...OK 3 I, [2024-05-05T15:56:29.790054 #823650] INFO -- : /home/opc/ruby/src/master/basictest/test.rb:defined? ............OK 12 I, [2024-05-05T15:56:29.790142 #823650] INFO -- : /home/opc/ruby/src/master/basictest/test.rb:alias ......OK 6 I, [2024-05-05T15:56:29.790651 #823650] INFO -- : /home/opc/ruby/src/master/basictest/test.rb:path .......................OK 23 I, [2024-05-05T15:56:29.859910 #823650] INFO -- : /home/opc/ruby/src/master/basictest/test.rb:gc ....OK 4 I, [2024-05-05T15:56:29.861971 #823650] INFO -- : I, [2024-05-05T15:56:29.862002 #823650] INFO -- : test succeeded I, [2024-05-05T15:56:29.862557 #823650] INFO -- : $$$[end] "make yes-test-basic TESTS='-j3'" exit with 0. I, [2024-05-05T15:56:29.862739 #823650] INFO -- : $$$[beg] make yes-test-all TESTOPTS='--stderr-on-failure' TESTS='-j3' I, [2024-05-05T15:56:29.986382 #823650] INFO -- : BASERUBY = /usr/local/bin/ruby --disable=gems I, [2024-05-05T15:56:29.986459 #823650] INFO -- : CC = gcc I, [2024-05-05T15:56:29.986470 #823650] INFO -- : LD = ld I, [2024-05-05T15:56:29.986479 #823650] INFO -- : LDSHARED = gcc -shared I, [2024-05-05T15:56:29.986491 #823650] INFO -- : CFLAGS = -O3 -fno-fast-math -ggdb3 -Wall -Wextra -Wdeprecated-declarations -Wdiv-by-zero -Wduplicated-cond -Wimplicit-function-declaration -Wimplicit-int -Wpointer-arith -Wwrite-strings -Wold-style-definition -Wimplicit-fallthrough=0 -Wmissing-noreturn -Wno-cast-function-type -Wno-constant-logical-operand -Wno-long-long -Wno-missing-field-initializers -Wno-overlength-strings -Wno-packed-bitfield-compat -Wno-parentheses-equality -Wno-self-assign -Wno-tautological-compare -Wno-unused-parameter -Wno-unused-value -Wsuggest-attribute=format -Wsuggest-attribute=noreturn -Wunused-variable -Wmisleading-indentation -Wundef I, [2024-05-05T15:56:29.986502 #823650] INFO -- : XCFLAGS = -U_FORTIFY_SOURCE -D_FORTIFY_SOURCE=2 -fstack-protector-strong -msign-return-address=all -fno-strict-overflow -fvisibility=hidden -fexcess-precision=standard -DRUBY_EXPORT -fPIE -I. -I.ext/include/aarch64-linux -I/home/opc/ruby/src/master/include -I/home/opc/ruby/src/master -I/home/opc/ruby/src/master/prism -I/home/opc/ruby/src/master/enc/unicode/15.0.0 I, [2024-05-05T15:56:29.986511 #823650] INFO -- : CPPFLAGS = I, [2024-05-05T15:56:29.986519 #823650] INFO -- : DLDFLAGS = -Wl,--compress-debug-sections=zlib -fstack-protector-strong -pie I, [2024-05-05T15:56:29.986529 #823650] INFO -- : SOLIBS = -lz -lrt -lrt -ldl -lcrypt -lm -lpthread I, [2024-05-05T15:56:29.986537 #823650] INFO -- : LANG = en_US.UTF-8 I, [2024-05-05T15:56:29.986545 #823650] INFO -- : LC_ALL = I, [2024-05-05T15:56:29.986553 #823650] INFO -- : LC_CTYPE = I, [2024-05-05T15:56:29.986561 #823650] INFO -- : MFLAGS = I, [2024-05-05T15:56:29.986569 #823650] INFO -- : RUSTC = rustc I, [2024-05-05T15:56:29.986577 #823650] INFO -- : YJIT_RUSTC_ARGS = --crate-name=yjit --crate-type=staticlib --edition=2021 -g -C lto=thin -C opt-level=3 -C overflow-checks=on '--out-dir=/home/opc/ruby/build/master/yjit/target/release/' /home/opc/ruby/src/master/yjit/src/lib.rs I, [2024-05-05T15:56:29.987281 #823650] INFO -- : gcc (GCC) 8.5.0 20210514 (Red Hat 8.5.0-10.1.0.1) I, [2024-05-05T15:56:29.987295 #823650] INFO -- : Copyright (C) 2018 Free Software Foundation, Inc. I, [2024-05-05T15:56:29.987304 #823650] INFO -- : This is free software; see the source for copying conditions. There is NO I, [2024-05-05T15:56:29.987313 #823650] INFO -- : warranty; not even for MERCHANTABILITY or FITNESS FOR A PARTICULAR PURPOSE. I, [2024-05-05T15:56:29.987322 #823650] INFO -- : I, [2024-05-05T15:56:29.990255 #823650] INFO -- : generating enc.mk I, [2024-05-05T15:56:30.232894 #823650] INFO -- : making enc I, [2024-05-05T15:56:30.260322 #823650] INFO -- : make[1]: Entering directory '/home/opc/ruby/build/master' I, [2024-05-05T15:56:30.260393 #823650] INFO -- : make[1]: Nothing to be done for 'enc'. I, [2024-05-05T15:56:30.260413 #823650] INFO -- : make[1]: Leaving directory '/home/opc/ruby/build/master' I, [2024-05-05T15:56:30.261251 #823650] INFO -- : making srcs under enc I, [2024-05-05T15:56:30.303201 #823650] INFO -- : make[1]: Entering directory '/home/opc/ruby/build/master' I, [2024-05-05T15:56:30.303254 #823650] INFO -- : make[1]: Nothing to be done for 'srcs'. I, [2024-05-05T15:56:30.303265 #823650] INFO -- : make[1]: Leaving directory '/home/opc/ruby/build/master' I, [2024-05-05T15:56:30.304553 #823650] INFO -- : generating transdb.h I, [2024-05-05T15:56:30.451762 #823650] INFO -- : transdb.h unchanged I, [2024-05-05T15:56:30.453214 #823650] INFO -- : making trans I, [2024-05-05T15:56:30.501508 #823650] INFO -- : make[1]: Entering directory '/home/opc/ruby/build/master' I, [2024-05-05T15:56:30.501580 #823650] INFO -- : make[1]: Nothing to be done for 'trans'. I, [2024-05-05T15:56:30.501591 #823650] INFO -- : make[1]: Leaving directory '/home/opc/ruby/build/master' I, [2024-05-05T15:56:30.502360 #823650] INFO -- : making encs I, [2024-05-05T15:56:30.554794 #823650] INFO -- : make[1]: Entering directory '/home/opc/ruby/build/master' I, [2024-05-05T15:56:30.554853 #823650] INFO -- : make[1]: Nothing to be done for 'encs'. I, [2024-05-05T15:56:30.554863 #823650] INFO -- : make[1]: Leaving directory '/home/opc/ruby/build/master' I, [2024-05-05T15:56:30.556999 #823650] INFO -- : generating makefiles ext/configure-ext.mk I, [2024-05-05T15:56:30.596882 #823650] INFO -- : ext/configure-ext.mk updated I, [2024-05-05T15:56:30.600229 #823650] INFO -- : make[1]: Entering directory '/home/opc/ruby/build/master' I, [2024-05-05T15:56:32.651510 #823650] INFO -- : make[1]: Leaving directory '/home/opc/ruby/build/master' I, [2024-05-05T15:56:32.652284 #823650] INFO -- : generating makefile exts.mk I, [2024-05-05T15:56:32.711337 #823650] INFO -- : exts.mk unchanged I, [2024-05-05T15:56:32.716254 #823650] INFO -- : make[1]: Entering directory '/home/opc/ruby/build/master' I, [2024-05-05T15:56:33.020448 #823650] INFO -- : make[2]: Entering directory '/home/opc/ruby/build/master/ext/coverage' I, [2024-05-05T15:56:33.025571 #823650] INFO -- : make[2]: Leaving directory '/home/opc/ruby/build/master/ext/coverage' I, [2024-05-05T15:56:33.031429 #823650] INFO -- : make[2]: Entering directory '/home/opc/ruby/build/master/ext/date' I, [2024-05-05T15:56:33.037103 #823650] INFO -- : make[2]: Leaving directory '/home/opc/ruby/build/master/ext/date' I, [2024-05-05T15:56:33.040575 #823650] INFO -- : make[2]: Entering directory '/home/opc/ruby/build/master/ext/digest' I, [2024-05-05T15:56:33.049804 #823650] INFO -- : make[2]: Leaving directory '/home/opc/ruby/build/master/ext/digest' I, [2024-05-05T15:56:33.073210 #823650] INFO -- : make[2]: Entering directory '/home/opc/ruby/build/master/ext/digest/sha2' I, [2024-05-05T15:56:33.078402 #823650] INFO -- : make[2]: Leaving directory '/home/opc/ruby/build/master/ext/digest/sha2' I, [2024-05-05T15:56:33.097150 #823650] INFO -- : make[2]: Entering directory '/home/opc/ruby/build/master/ext/fiddle' I, [2024-05-05T15:56:33.107353 #823650] INFO -- : make[2]: Leaving directory '/home/opc/ruby/build/master/ext/fiddle' I, [2024-05-05T15:56:33.111695 #823650] INFO -- : make[2]: Entering directory '/home/opc/ruby/build/master/ext/io/console' I, [2024-05-05T15:56:33.116025 #823650] INFO -- : make[2]: Leaving directory '/home/opc/ruby/build/master/ext/io/console' I, [2024-05-05T15:56:33.126890 #823650] INFO -- : make[2]: Entering directory '/home/opc/ruby/build/master/ext/json' I, [2024-05-05T15:56:33.136332 #823650] INFO -- : make[2]: Leaving directory '/home/opc/ruby/build/master/ext/json' I, [2024-05-05T15:56:33.149653 #823650] INFO -- : make[2]: Entering directory '/home/opc/ruby/build/master/ext/monitor' I, [2024-05-05T15:56:33.153826 #823650] INFO -- : make[2]: Leaving directory '/home/opc/ruby/build/master/ext/monitor' I, [2024-05-05T15:56:33.159929 #823650] INFO -- : make[2]: Entering directory '/home/opc/ruby/build/master/ext/objspace' I, [2024-05-05T15:56:33.165884 #823650] INFO -- : make[2]: Leaving directory '/home/opc/ruby/build/master/ext/objspace' I, [2024-05-05T15:56:33.184865 #823650] INFO -- : make[2]: Entering directory '/home/opc/ruby/build/master/ext/openssl' I, [2024-05-05T15:56:33.206544 #823650] INFO -- : make[2]: Leaving directory '/home/opc/ruby/build/master/ext/openssl' I, [2024-05-05T15:56:33.210919 #823650] INFO -- : make[2]: Entering directory '/home/opc/ruby/build/master/ext/pathname' I, [2024-05-05T15:56:33.215169 #823650] INFO -- : make[2]: Leaving directory '/home/opc/ruby/build/master/ext/pathname' I, [2024-05-05T15:56:33.221527 #823650] INFO -- : make[2]: Entering directory '/home/opc/ruby/build/master/ext/psych' I, [2024-05-05T15:56:33.242981 #823650] INFO -- : make[2]: Leaving directory '/home/opc/ruby/build/master/ext/psych' I, [2024-05-05T15:56:33.247518 #823650] INFO -- : make[2]: Entering directory '/home/opc/ruby/build/master/ext/pty' I, [2024-05-05T15:56:33.251749 #823650] INFO -- : make[2]: Leaving directory '/home/opc/ruby/build/master/ext/pty' I, [2024-05-05T15:56:33.265099 #823650] INFO -- : make[2]: Entering directory '/home/opc/ruby/build/master/ext/ripper' I, [2024-05-05T15:56:33.273459 #823650] INFO -- : make[2]: Leaving directory '/home/opc/ruby/build/master/ext/ripper' I, [2024-05-05T15:56:33.275498 #823650] INFO -- : make[2]: Entering directory '/home/opc/ruby/build/master/ext/rubyvm' I, [2024-05-05T15:56:33.279016 #823650] INFO -- : make[2]: Leaving directory '/home/opc/ruby/build/master/ext/rubyvm' I, [2024-05-05T15:56:33.291011 #823650] INFO -- : make[2]: Entering directory '/home/opc/ruby/build/master/ext/socket' I, [2024-05-05T15:56:33.301802 #823650] INFO -- : make[2]: Leaving directory '/home/opc/ruby/build/master/ext/socket' I, [2024-05-05T15:56:33.317551 #823650] INFO -- : make[2]: Entering directory '/home/opc/ruby/build/master/.bundle/gems/bigdecimal-3.1.7/ext/bigdecimal' I, [2024-05-05T15:56:33.348181 #823650] INFO -- : make[2]: Leaving directory '/home/opc/ruby/build/master/.bundle/gems/bigdecimal-3.1.7/ext/bigdecimal' I, [2024-05-05T15:56:33.350947 #823650] INFO -- : make[2]: Entering directory '/home/opc/ruby/build/master/.bundle/gems/debug-1.9.2/ext/debug' I, [2024-05-05T15:56:33.381508 #823650] INFO -- : make[2]: Leaving directory '/home/opc/ruby/build/master/.bundle/gems/debug-1.9.2/ext/debug' I, [2024-05-05T15:56:33.384114 #823650] INFO -- : make[2]: Entering directory '/home/opc/ruby/build/master/.bundle/gems/nkf-0.2.0/ext/nkf' I, [2024-05-05T15:56:33.414872 #823650] INFO -- : make[2]: Leaving directory '/home/opc/ruby/build/master/.bundle/gems/nkf-0.2.0/ext/nkf' I, [2024-05-05T15:56:33.417536 #823650] INFO -- : make[2]: Entering directory '/home/opc/ruby/build/master/.bundle/gems/racc-1.7.3/ext/racc/cparse' I, [2024-05-05T15:56:33.447852 #823650] INFO -- : make[2]: Leaving directory '/home/opc/ruby/build/master/.bundle/gems/racc-1.7.3/ext/racc/cparse' I, [2024-05-05T15:56:33.450910 #823650] INFO -- : make[2]: Entering directory '/home/opc/ruby/build/master/.bundle/gems/rbs-3.4.4/ext/rbs_extension' I, [2024-05-05T15:56:33.483052 #823650] INFO -- : make[2]: Leaving directory '/home/opc/ruby/build/master/.bundle/gems/rbs-3.4.4/ext/rbs_extension' I, [2024-05-05T15:56:33.485655 #823650] INFO -- : make[2]: Entering directory '/home/opc/ruby/build/master/.bundle/gems/syslog-0.1.2/ext/syslog' I, [2024-05-05T15:56:33.515860 #823650] INFO -- : make[2]: Leaving directory '/home/opc/ruby/build/master/.bundle/gems/syslog-0.1.2/ext/syslog' I, [2024-05-05T15:56:33.553939 #823650] INFO -- : make[2]: Entering directory '/home/opc/ruby/build/master' I, [2024-05-05T15:56:33.641280 #823650] INFO -- : make[2]: 'ruby' is up to date. I, [2024-05-05T15:56:33.641354 #823650] INFO -- : make[2]: Leaving directory '/home/opc/ruby/build/master' I, [2024-05-05T15:56:33.641555 #823650] INFO -- : make[1]: Leaving directory '/home/opc/ruby/build/master' I, [2024-05-05T15:56:33.646011 #823650] INFO -- : make[1]: Entering directory '/home/opc/ruby/build/master' I, [2024-05-05T15:56:33.646053 #823650] INFO -- : make[1]: Nothing to be done for 'note'. I, [2024-05-05T15:56:33.646063 #823650] INFO -- : make[1]: Leaving directory '/home/opc/ruby/build/master' I, [2024-05-05T15:56:33.762000 #823650] INFO -- : Run options: I, [2024-05-05T15:56:33.762078 #823650] INFO -- : --seed=25291 I, [2024-05-05T15:56:33.762089 #823650] INFO -- : "--ruby=./miniruby -I/home/opc/ruby/src/master/lib -I. -I.ext/common /home/opc/ruby/src/master/tool/runruby.rb --extout=.ext -- --disable-gems" I, [2024-05-05T15:56:33.762099 #823650] INFO -- : --excludes-dir=/home/opc/ruby/src/master/test/.excludes I, [2024-05-05T15:56:33.762108 #823650] INFO -- : --name=!/memory_leak/ I, [2024-05-05T15:56:33.762116 #823650] INFO -- : --stderr-on-failure I, [2024-05-05T15:56:33.762125 #823650] INFO -- : -j3 I, [2024-05-05T15:56:33.762133 #823650] INFO -- : I, [2024-05-05T15:56:33.762142 #823650] INFO -- : # Running tests: I, [2024-05-05T15:56:33.762150 #823650] INFO -- : I, [2024-05-05T15:56:33.899234 #823650] INFO -- : [ 1/885] 864617=test_hash I, [2024-05-05T15:56:33.901457 #823650] INFO -- : [ 2/885] 864615=test_variable I, [2024-05-05T15:56:33.919572 #823650] INFO -- : [ 3/885] 864616=test_gem_commands_pristine_command I, [2024-05-05T15:56:33.942861 #823650] INFO -- : [ 4/885] 864617=test_optarg I, [2024-05-05T15:56:34.008755 #823650] INFO -- : [ 5/885] 864615=test_rdoc_tom_doc I, [2024-05-05T15:56:34.058675 #823650] INFO -- : [ 6/885] 864617=test_utf32 I, [2024-05-05T15:56:34.134755 #823650] INFO -- : [ 7/885] 864617=test_gem_resolver_git_specification I, [2024-05-05T15:56:34.167837 #823650] INFO -- : [ 8/885] 864615=test_basicinstructions I, [2024-05-05T15:56:34.238757 #823650] INFO -- : [ 9/885] 864615=test_erb I, [2024-05-05T15:56:34.304179 #823650] INFO -- : [ 10/885] 864615=test_date_ractor I, [2024-05-05T15:56:34.511637 #823650] INFO -- : [ 11/885] 864615=test_key_actor_emacs I, [2024-05-05T15:56:34.614816 #823650] INFO -- : [ 12/885] 864617=test_gem_security I, [2024-05-05T15:56:34.690251 #823650] INFO -- : [ 13/885] 864615=test_pp I, [2024-05-05T15:56:34.727697 #823650] INFO -- : .Leaked file descriptor: PPTestModule::PPFileStatTest#test_nothing_raised: 7 # I, [2024-05-05T15:56:34.727762 #823650] INFO -- : Leaked file descriptor: PPTestModule::PPFileStatTest#test_nothing_raised: 8 # I, [2024-05-05T15:56:34.757178 #823650] INFO -- : COMMAND PID USER FD TYPE DEVICE SIZE/OFF NODE NAME I, [2024-05-05T15:56:34.757243 #823650] INFO -- : ruby 864615 opc 7r REG 252,0 9253600 13705411 /var/lib/sss/mc/passwd I, [2024-05-05T15:56:34.757255 #823650] INFO -- : ruby 864615 opc 8r REG 252,0 6940392 13705429 /var/lib/sss/mc/group I, [2024-05-05T15:56:34.793373 #823650] INFO -- : [ 14/885] 864615=test_gem_impossible_dependencies_error I, [2024-05-05T15:56:34.973322 #823650] INFO -- : [ 15/885] 864615=test_arith_seq_beg_len_step I, [2024-05-05T15:56:35.036744 #823650] INFO -- : [ 16/885] 864615=test_raise_exception I, [2024-05-05T15:56:35.573366 #823650] INFO -- : [ 17/885] 864616=test_exception I, [2024-05-05T15:56:35.584420 #823650] INFO -- : [ 18/885] 864616=test_noarg I, [2024-05-05T15:56:35.593597 #823650] INFO -- : [ 19/885] 864615=test_gem_resolver_requirement_list I, [2024-05-05T15:56:35.639577 #823650] INFO -- : [ 20/885] 864615=memsize_test I, [2024-05-05T15:56:35.690122 #823650] INFO -- : [ 21/885] 864615=test_gem_command I, [2024-05-05T15:56:35.759215 #823650] INFO -- : [ 22/885] 864616=test_asn1 I, [2024-05-05T15:56:35.786700 #823650] INFO -- : [ 23/885] 864616=test_rdoc_generator_darkfish I, [2024-05-05T15:56:35.811915 #823650] INFO -- : [ 24/885] 864615=test_random I, [2024-05-05T15:56:35.849284 #823650] INFO -- : [ 25/885] 864615=test_gem_resolver_lock_set I, [2024-05-05T15:56:35.867287 #823650] INFO -- : [ 26/885] 864615=test_undef I, [2024-05-05T15:56:35.869805 #823650] INFO -- : [ 27/885] 864615=test_normalize I, [2024-05-05T15:56:35.874147 #823650] INFO -- : [ 28/885] 864615=test_emoji_breaks I, [2024-05-05T15:56:35.882879 #823650] INFO -- : [ 29/885] 864615=test_verbose I, [2024-05-05T15:56:35.917241 #823650] INFO -- : [ 30/885] 864615=test_gem_commands_open_command I, [2024-05-05T15:56:36.022895 #823650] INFO -- : [ 31/885] 864615=test_assignment I, [2024-05-05T15:56:36.344389 #823650] INFO -- : [ 32/885] 864616=test_gem_update_suggestion I, [2024-05-05T15:56:36.433998 #823650] INFO -- : [ 33/885] 864616=test_process I, [2024-05-05T15:56:36.455385 #823650] INFO -- : [ 34/885] 864616=test_forwardable I, [2024-05-05T15:56:36.471985 #823650] INFO -- : [ 35/885] 864616=test_fd_setsize I, [2024-05-05T15:56:36.473309 #823650] INFO -- : [ 36/885] 864616=!Nothing_to_test I, [2024-05-05T15:56:36.499043 #823650] INFO -- : [ 37/885] 864616=test_memory_view I, [2024-05-05T15:56:36.716192 #823650] INFO -- : [ 38/885] 864616=test_dir_m17n I, [2024-05-05T15:56:37.297787 #823650] INFO -- : [ 39/885] 864615=test_array_create I, [2024-05-05T15:56:37.310280 #823650] INFO -- : [ 40/885] 864615=test_complex I, [2024-05-05T15:56:37.405929 #823650] INFO -- : [ 41/885] 864615=test_threadgroup I, [2024-05-05T15:56:37.770238 #823650] INFO -- : [ 42/885] 864616=test_err_in_callback I, [2024-05-05T15:56:37.784846 #823650] INFO -- : [ 43/885] 864616=test_method_name_check I, [2024-05-05T15:56:37.797830 #823650] INFO -- : [ 44/885] 864616=test_storage I, [2024-05-05T15:56:37.806352 #823650] INFO -- : [ 45/885] 864616=test_merge_keys I, [2024-05-05T15:56:37.810673 #823650] INFO -- : [ 46/885] 864616=test_shapes I, [2024-05-05T15:56:37.815580 #823650] INFO -- : [ 47/885] 864616=test_did_you_mean I, [2024-05-05T15:56:37.882232 #823650] INFO -- : [ 48/885] 864616=test_rdoc_extend I, [2024-05-05T15:56:37.896612 #823650] INFO -- : [ 49/885] 864616=test_cesu8 I, [2024-05-05T15:56:37.935833 #823650] INFO -- : [ 50/885] 864616=test_kernel I, [2024-05-05T15:56:38.448084 #823650] INFO -- : [ 51/885] 864615=test_rendering I, [2024-05-05T15:56:38.449657 #823650] INFO -- : [ 52/885] 864616=test_gem_rdoc I, [2024-05-05T15:56:38.456689 #823650] INFO -- : [ 53/885] 864615=test_dot_dot I, [2024-05-05T15:56:38.467460 #823650] INFO -- : [ 54/885] 864615=pattern_test I, [2024-05-05T15:56:38.483815 #823650] INFO -- : [ 55/885] 864615=test_iterator I, [2024-05-05T15:56:38.553965 #823650] INFO -- : [ 56/885] 864615=test_string I, [2024-05-05T15:56:38.556690 #823650] INFO -- : [ 57/885] 864615=test_gem_commands_install_command I, [2024-05-05T15:56:38.609222 #823650] INFO -- : [ 58/885] 864616=test_gbk I, [2024-05-05T15:56:38.612162 #823650] INFO -- : [ 59/885] 864616=test_backtrace I, [2024-05-05T15:56:38.613816 #823650] INFO -- : [ 60/885] 864616=test_gem_commands_dependency_command I, [2024-05-05T15:56:38.729769 #823650] INFO -- : [ 61/885] 864616=test_gem_spec_fetcher I, [2024-05-05T15:56:38.918184 #823650] INFO -- : [ 62/885] 864616=test_yamldbm I, [2024-05-05T15:56:38.932765 #823650] INFO -- : [ 63/885] 864616=test_switch_hitter I, [2024-05-05T15:56:38.949992 #823650] INFO -- : [ 64/885] 864616=test_default_gems I, [2024-05-05T15:56:38.998728 #823650] INFO -- : [ 65/885] 864616=test_unicode_escape I, [2024-05-05T15:56:39.078103 #823650] INFO -- : [ 66/885] 864616=test_hash_create I, [2024-05-05T15:56:39.080066 #823650] INFO -- : [ 67/885] 864616=test_grapheme_breaks I, [2024-05-05T15:56:39.112135 #823650] INFO -- : [ 68/885] 864616=test_set I, [2024-05-05T15:56:39.144390 #823650] INFO -- : [ 69/885] 864616=test_rdoc_method_attr I, [2024-05-05T15:56:39.244866 #823650] INFO -- : [ 70/885] 864617=test_enumerable I, [2024-05-05T15:56:39.250520 #823650] INFO -- : [ 71/885] 864617=static_literals_test I, [2024-05-05T15:56:39.278657 #823650] INFO -- : [ 72/885] 864616=test_tree_spell_checker I, [2024-05-05T15:56:39.311457 #823650] INFO -- : [ 73/885] 864616=test_rdoc_rubygems_hook I, [2024-05-05T15:56:39.328793 #823650] INFO -- : [ 74/885] 864617=test_gem_resolver_api_specification I, [2024-05-05T15:56:39.391533 #823650] INFO -- : [ 75/885] 864616=test_ractor I, [2024-05-05T15:56:39.399304 #823650] INFO -- : [ 76/885] 864617=test_webauthn_listener I, [2024-05-05T15:56:39.415647 #823650] INFO -- : [ 77/885] 864616=test_gem_ext_cargo_builder_unit I, [2024-05-05T15:56:39.441278 #823650] INFO -- : [ 78/885] 864616=test_case_mapping I, [2024-05-05T15:56:39.458625 #823650] INFO -- : [ 79/885] 864616=test_rational I, [2024-05-05T15:56:39.488581 #823650] INFO -- : [ 80/885] 864616=test_thread I, [2024-05-05T15:56:39.496193 #823650] INFO -- : [ 81/885] 864616=test_arity I, [2024-05-05T15:56:39.499512 #823650] INFO -- : [ 82/885] 864616=test_buffering I, [2024-05-05T15:56:39.508785 #823650] INFO -- : [ 83/885] 864616=test_svcb_https I, [2024-05-05T15:56:39.522420 #823650] INFO -- : [ 84/885] 864617=test_pkey_ec I, [2024-05-05T15:56:39.541945 #823650] INFO -- : [ 85/885] 864616=test_key_event_record I, [2024-05-05T15:56:39.576821 #823650] INFO -- : [ 86/885] 864617=test_date_parse I, [2024-05-05T15:56:39.577946 #823650] INFO -- : [ 87/885] 864616=test_open3 I, [2024-05-05T15:56:39.696484 #823650] INFO -- : [ 88/885] 864617=test_mdns I, [2024-05-05T15:56:39.766269 #823650] INFO -- : [ 89/885] 864617=test_rdoc_store I, [2024-05-05T15:56:40.544591 #823650] INFO -- : [ 90/885] 864617=test_shift_jis I, [2024-05-05T15:56:40.560474 #823650] INFO -- : [ 91/885] 864617=test_rubyoptions I, [2024-05-05T15:56:40.684279 #823650] INFO -- : [ 92/885] 864615=test_data_error I, [2024-05-05T15:56:40.756615 #823650] INFO -- : [ 93/885] 864615=test_rdoc_stats I, [2024-05-05T15:56:40.791499 #823650] INFO -- : [ 94/885] 864615=test_files_sample I, [2024-05-05T15:56:40.872277 #823650] INFO -- : [ 95/885] 864615=test_force_exit I, [2024-05-05T15:56:40.885743 #823650] INFO -- : [ 96/885] 864615=test_optimization I, [2024-05-05T15:56:42.209013 #823650] INFO -- : [ 97/885] 864616=regexp_test I, [2024-05-05T15:56:42.265133 #823650] INFO -- : [ 98/885] 864616=test_show_source I, [2024-05-05T15:56:42.327005 #823650] INFO -- : [ 99/885] 864616=test_remote_fetch_error I, [2024-05-05T15:56:42.348106 #823650] INFO -- : [100/885] 864616=test_yield I, [2024-05-05T15:56:45.105467 #823650] INFO -- : [101/885] 864616=test_dryrun I, [2024-05-05T15:56:45.275504 #823650] INFO -- : [102/885] 864616=test_gc_compact I, [2024-05-05T15:56:45.816320 #823650] INFO -- : Leaked file descriptor: TestRubyOptions#test_script_from_stdin: 10 # I, [2024-05-05T15:56:45.844800 #823650] INFO -- : COMMAND PID USER FD TYPE DEVICE SIZE/OFF NODE NAME I, [2024-05-05T15:56:45.844879 #823650] INFO -- : ruby 864617 opc 10r REG 252,0 6940392 13705429 /var/lib/sss/mc/group I, [2024-05-05T15:56:47.104859 #823650] INFO -- : [103/885] 864617=test_rdoc_i18n_locale I, [2024-05-05T15:56:47.112261 #823650] INFO -- : [104/885] 864617=test_queue I, [2024-05-05T15:56:47.123331 #823650] INFO -- : [105/885] 864617=test_boolean I, [2024-05-05T15:56:47.133548 #823650] INFO -- : [106/885] 864617=test_gem_resolver_lock_specification I, [2024-05-05T15:56:47.196247 #823650] INFO -- : [107/885] 864617=test_clone I, [2024-05-05T15:56:47.348623 #823650] INFO -- : [108/885] 864617=test_enc_raise I, [2024-05-05T15:56:47.355975 #823650] INFO -- : [109/885] 864617=test_prettyprint I, [2024-05-05T15:56:47.380919 #823650] INFO -- : [110/885] 864617=test_gem_uri_formatter I, [2024-05-05T15:56:47.409654 #823650] INFO -- : [111/885] 864617=test_cgi_util I, [2024-05-05T15:56:47.605150 #823650] INFO -- : [112/885] 864617=test_ole_methods I, [2024-05-05T15:56:47.613163 #823650] INFO -- : [113/885] 864617=test_set I, [2024-05-05T15:56:47.613854 #823650] INFO -- : [114/885] 864617=test_http I, [2024-05-05T15:56:47.689704 #823650] INFO -- : [115/885] 864615=test_utf16 I, [2024-05-05T15:56:47.697806 #823650] INFO -- : [116/885] 864615=attribute_write_test I, [2024-05-05T15:56:47.701927 #823650] INFO -- : [117/885] 864615=test_severity I, [2024-05-05T15:56:47.709146 #823650] INFO -- : [118/885] 864615=test_case I, [2024-05-05T15:56:47.713906 #823650] INFO -- : [119/885] 864615=test_ractor I, [2024-05-05T15:56:47.735283 #823650] INFO -- : [120/885] 864615=test_gem_package_tar_writer I, [2024-05-05T15:56:47.786858 #823650] INFO -- : [121/885] 864616=test_str2big I, [2024-05-05T15:56:47.796727 #823650] INFO -- : [122/885] 864616=test_rdoc_markup_to_rdoc I, [2024-05-05T15:56:47.848431 #823650] INFO -- : [123/885] 864616=test_gem_uninstaller I, [2024-05-05T15:56:47.879160 #823650] INFO -- : [124/885] 864615=test_cclass I, [2024-05-05T15:56:47.996045 #823650] INFO -- : [125/885] 864615=test_yjit I, [2024-05-05T15:56:48.000688 #823650] INFO -- : [126/885] 864615=test_gem_dependency I, [2024-05-05T15:56:48.186172 #823650] INFO -- : [127/885] 864615=test_m17n I, [2024-05-05T15:56:48.263869 #823650] INFO -- : [128/885] 864615=test_method I, [2024-05-05T15:56:49.080667 #823650] INFO -- : [129/885] 864616=test_argf I, [2024-05-05T15:56:52.660538 #823650] INFO -- : [130/885] 864616=test_x509name I, [2024-05-05T15:56:52.673362 #823650] INFO -- : [131/885] 864616=test_yaml I, [2024-05-05T15:56:52.811274 #823650] INFO -- : [132/885] 864616=test_pkcs12 I, [2024-05-05T15:56:53.500190 #823650] INFO -- : [133/885] 864616=test_gem_remote_fetcher I, [2024-05-05T15:56:53.748858 #823650] INFO -- : [134/885] 864615=test_koi8 I, [2024-05-05T15:56:53.759885 #823650] INFO -- : [135/885] 864615=test_json_tree I, [2024-05-05T15:56:53.763453 #823650] INFO -- : [136/885] 864615=test_filter I, [2024-05-05T15:56:53.831835 #823650] INFO -- : [137/885] 864615=test_parser_events I, [2024-05-05T15:56:53.898102 #823650] INFO -- : [138/885] 864615=test_http I, [2024-05-05T15:56:53.913924 #823650] INFO -- : [139/885] 864615=test_hash I, [2024-05-05T15:56:55.310949 #823650] INFO -- : [140/885] 864616=parser_test I, [2024-05-05T15:56:55.315896 #823650] INFO -- : [141/885] 864616=test_pty I, [2024-05-05T15:56:55.838811 #823650] INFO -- : [142/885] 864616=test_gem_dependency_installer I, [2024-05-05T15:56:56.436678 #823650] INFO -- : [143/885] 864617=test_gem_request I, [2024-05-05T15:56:56.672495 #823650] INFO -- : [144/885] 864617=test_gem_commands_which_command I, [2024-05-05T15:56:56.708099 #823650] INFO -- : [145/885] 864617=test_gem_package_old I, [2024-05-05T15:56:56.761512 #823650] INFO -- : [146/885] 864617=encoding_test I, [2024-05-05T15:56:56.841890 #823650] INFO -- : [147/885] 864617=test_gem_commands_specification_command I, [2024-05-05T15:56:56.976756 #823650] INFO -- : [148/885] 864617=test_scan_args I, [2024-05-05T15:56:57.002022 #823650] INFO -- : [149/885] 864617=test_too_many_dummy_encodings I, [2024-05-05T15:56:57.043087 #823650] INFO -- : [150/885] 864617=test_method_cache I, [2024-05-05T15:56:57.061233 #823650] INFO -- : [151/885] 864617=test_sprintf_comb I, [2024-05-05T15:56:57.207227 #823650] INFO -- : [152/885] 864617=test_gem_commands_push_command I, [2024-05-05T15:56:57.576530 #823650] INFO -- : [153/885] 864615=locals_test I, [2024-05-05T15:56:57.851184 #823650] INFO -- : [154/885] 864617=test_rdoc_task I, [2024-05-05T15:56:57.859468 #823650] INFO -- : [155/885] 864617=test_backtrace I, [2024-05-05T15:56:57.981599 #823650] INFO -- : [156/885] 864615=test_tracepoint I, [2024-05-05T15:56:58.273840 #823650] INFO -- : [157/885] 864616=test_gem_text I, [2024-05-05T15:56:58.298228 #823650] INFO -- : [158/885] 864615=test_settracefunc I, [2024-05-05T15:56:58.334661 #823650] INFO -- : [159/885] 864616=test_rendering I, [2024-05-05T15:56:58.346583 #823650] INFO -- : [160/885] 864616=test_internal_ivar I, [2024-05-05T15:56:58.351566 #823650] INFO -- : [161/885] 864616=test_win32ole I, [2024-05-05T15:56:58.359459 #823650] INFO -- : [162/885] 864616=desugar_compiler_test I, [2024-05-05T15:56:58.381568 #823650] INFO -- : [163/885] 864616=test_gem_source_local I, [2024-05-05T15:56:58.595822 #823650] INFO -- : [164/885] 864616=test_gem_gemcutter_utilities I, [2024-05-05T15:56:59.090265 #823650] INFO -- : [165/885] 864616=test_pack I, [2024-05-05T15:56:59.101508 #823650] INFO -- : [166/885] 864616=test_cgi_tag_helper I, [2024-05-05T15:56:59.121268 #823650] INFO -- : [167/885] 864616=test_pinned I, [2024-05-05T15:56:59.140949 #823650] INFO -- : [168/885] 864615=test_framework I, [2024-05-05T15:56:59.158687 #823650] INFO -- : [169/885] 864615=test_inadvertent_creation I, [2024-05-05T15:56:59.166273 #823650] INFO -- : [170/885] 864616=test_ansi_with_terminfo I, [2024-05-05T15:56:59.170891 #823650] INFO -- : [171/885] 864616=test_coderange I, [2024-05-05T15:56:59.173262 #823650] INFO -- : [172/885] 864616=test_weakmap I, [2024-05-05T15:56:59.176435 #823650] INFO -- : [173/885] 864617=test_nil2vtempty I, [2024-05-05T15:56:59.188963 #823650] INFO -- : [174/885] 864617=test_date_time I, [2024-05-05T15:56:59.200195 #823650] INFO -- : [175/885] 864617=test_rdoc_generator_json_index I, [2024-05-05T15:56:59.255585 #823650] INFO -- : [176/885] 864617=test_rdoc_context I, [2024-05-05T15:56:59.288755 #823650] INFO -- : [177/885] 864615=test_gem_command_manager I, [2024-05-05T15:56:59.471176 #823650] INFO -- : [178/885] 864615=test_array I, [2024-05-05T15:56:59.482835 #823650] INFO -- : [179/885] 864615=test_open-uri I, [2024-05-05T15:56:59.959536 #823650] INFO -- : [180/885] 864615=test_case I, [2024-05-05T15:56:59.978572 #823650] INFO -- : [181/885] 864615=test_enumerator I, [2024-05-05T15:57:00.080806 #823650] INFO -- : [182/885] 864617=test_enc_associate I, [2024-05-05T15:57:00.616217 #823650] INFO -- : [183/885] 864617=test_sprintf I, [2024-05-05T15:57:00.710529 #823650] INFO -- : [184/885] 864617=test_gem_source_list I, [2024-05-05T15:57:00.788861 #823650] INFO -- : [185/885] 864617=json_addition_test I, [2024-05-05T15:57:00.801118 #823650] INFO -- : [186/885] 864617=test_name_error I, [2024-05-05T15:57:00.898427 #823650] INFO -- : [187/885] 864617=test_gem_commands_sources_command I, [2024-05-05T15:57:01.111571 #823650] INFO -- : [188/885] 864617=test_yaml_special_cases I, [2024-05-05T15:57:01.118056 #823650] INFO -- : [189/885] 864617=test_recorder I, [2024-05-05T15:57:01.122811 #823650] INFO -- : [190/885] 864617=test_const I, [2024-05-05T15:57:01.132194 #823650] INFO -- : [191/885] 864617=test_rdoc_parser_rd I, [2024-05-05T15:57:01.155618 #823650] INFO -- : [192/885] 864617=index_write_test I, [2024-05-05T15:57:01.288979 #823650] INFO -- : [193/885] 864617=test_class I, [2024-05-05T15:57:04.630368 #823650] INFO -- : [194/885] 864616=test_exit I, [2024-05-05T15:57:04.666572 #823650] INFO -- : [195/885] 864616=test_qsort I, [2024-05-05T15:57:04.672397 #823650] INFO -- : [196/885] 864616=comments_test I, [2024-05-05T15:57:04.674349 #823650] INFO -- : [197/885] 864616=test_gc I, [2024-05-05T15:57:04.685174 #823650] INFO -- : [198/885] 864616=test_math I, [2024-05-05T15:57:04.718022 #823650] INFO -- : [199/885] 864616=test_libs I, [2024-05-05T15:57:04.783171 #823650] INFO -- : [200/885] 864616=ripper_test I, [2024-05-05T15:57:05.359358 #823650] INFO -- : [201/885] 864616=test_iso_8859 I, [2024-05-05T15:57:05.386217 #823650] INFO -- : [202/885] 864616=test_safe_load I, [2024-05-05T15:57:05.403011 #823650] INFO -- : [203/885] 864616=test_pkey_rsa I, [2024-05-05T15:57:05.678669 #823650] INFO -- : [204/885] 864616=test_flush I, [2024-05-05T15:57:05.683832 #823650] INFO -- : [205/885] 864616=test_numhash I, [2024-05-05T15:57:05.689375 #823650] INFO -- : [206/885] 864616=test_system I, [2024-05-05T15:57:05.762175 #823650] INFO -- : [207/885] 864617=test_gem_specification I, [2024-05-05T15:57:06.568626 #823650] INFO -- : [208/885] 864616=test_rdoc_class_module I, [2024-05-05T15:57:07.087677 #823650] INFO -- : [209/885] 864616=test_parse I, [2024-05-05T15:57:07.570446 #823650] INFO -- : [210/885] 864616=test_rdoc_cross_reference I, [2024-05-05T15:57:07.932723 #823650] INFO -- : [211/885] 864616=test_method_cache I, [2024-05-05T15:57:07.936165 #823650] INFO -- : [212/885] 864616=test_win32ole_variable I, [2024-05-05T15:57:07.940474 #823650] INFO -- : [213/885] 864616=test_stack I, [2024-05-05T15:57:08.409201 #823650] INFO -- : [214/885] 864617=test_windows_1252 I, [2024-05-05T15:57:08.414116 #823650] INFO -- : [215/885] 864617=test_sorted_set I, [2024-05-05T15:57:08.628792 #823650] INFO -- : [216/885] 864617=test_emoji I, [2024-05-05T15:57:08.659190 #823650] INFO -- : [217/885] 864617=test_condition I, [2024-05-05T15:57:08.675049 #823650] INFO -- : [218/885] 864617=test_gem_resolver_vendor_set I, [2024-05-05T15:57:08.707209 #823650] INFO -- : [219/885] 864617=test_cp949 I, [2024-05-05T15:57:08.715839 #823650] INFO -- : [220/885] 864617=test_jaro_winkler I, [2024-05-05T15:57:08.722637 #823650] INFO -- : [221/885] 864617=test_mixed_unicode_escapes I, [2024-05-05T15:57:08.735947 #823650] INFO -- : [222/885] 864617=test_sleep I, [2024-05-05T15:57:08.872425 #823650] INFO -- : [223/885] 864616=test_fileutils I, [2024-05-05T15:57:09.337740 #823650] INFO -- : Leaked file descriptor: TestFileUtils#test_chown_error: 11 # I, [2024-05-05T15:57:09.366785 #823650] INFO -- : COMMAND PID USER FD TYPE DEVICE SIZE/OFF NODE NAME I, [2024-05-05T15:57:09.366854 #823650] INFO -- : ruby 864616 opc 11r REG 252,0 9253600 13705411 /var/lib/sss/mc/passwd I, [2024-05-05T15:57:09.465728 #823650] INFO -- : [224/885] 864616=test_gem_dependency_resolution_error I, [2024-05-05T15:57:09.475461 #823650] INFO -- : [225/885] 864616=test_econv I, [2024-05-05T15:57:10.328316 #823650] INFO -- : [226/885] 864616=test_gem_install_update_options I, [2024-05-05T15:57:10.504717 #823650] INFO -- : [227/885] 864616=test_date_attr I, [2024-05-05T15:57:10.783115 #823650] INFO -- : [228/885] 864616=test_sizeof I, [2024-05-05T15:57:10.804261 #823650] INFO -- : [229/885] 864617=test_gem_request_set_lockfile_parser I, [2024-05-05T15:57:11.057379 #823650] INFO -- : [230/885] 864617=test_face I, [2024-05-05T15:57:11.077462 #823650] INFO -- : [231/885] 864617=warnings_test I, [2024-05-05T15:57:11.161005 #823650] INFO -- : [232/885] 864617=test_stringchar I, [2024-05-05T15:57:11.172267 #823650] INFO -- : [233/885] 864617=test_gem_version_option I, [2024-05-05T15:57:11.234951 #823650] INFO -- : [234/885] 864617=test_win32ole_record I, [2024-05-05T15:57:11.247488 #823650] INFO -- : [235/885] 864617=test_rdoc_include I, [2024-05-05T15:57:11.271954 #823650] INFO -- : [236/885] 864617=test_date_compat I, [2024-05-05T15:57:11.310399 #823650] INFO -- : [237/885] 864617=test_pstore I, [2024-05-05T15:57:11.540758 #823650] INFO -- : [238/885] 864617=test_ubf_async_safe I, [2024-05-05T15:57:11.553193 #823650] INFO -- : [239/885] 864617=test_rdoc_options I, [2024-05-05T15:57:12.081485 #823650] INFO -- : [240/885] 864617=test_zlib I, [2024-05-05T15:57:13.059308 #823650] INFO -- : [241/885] 864616=test_proc I, [2024-05-05T15:57:13.980282 #823650] INFO -- : [242/885] 864616=test_console_attr I, [2024-05-05T15:57:14.020042 #823650] INFO -- : [243/885] 864616=test_gem_ext_cargo_builder I, [2024-05-05T15:57:14.045494 #823650] INFO -- : [244/885] 864616=test_gem_commands_unpack_command I, [2024-05-05T15:57:14.441316 #823650] INFO -- : [245/885] 864616=test_reqarg I, [2024-05-05T15:57:14.884173 #823650] INFO -- : [246/885] 864616=test_spell_checker I, [2024-05-05T15:57:14.896620 #823650] INFO -- : [247/885] 864616=test_gem_version I, [2024-05-05T15:57:15.040889 #823650] INFO -- : [248/885] 864616=test_gem_ext_ext_conf_builder I, [2024-05-05T15:57:16.146584 #823650] INFO -- : [249/885] 864616=test_frozen_error I, [2024-05-05T15:57:16.151322 #823650] INFO -- : [250/885] 864616=test_path_to_class I, [2024-05-05T15:57:16.155777 #823650] INFO -- : [251/885] 864616=test_enumerator I, [2024-05-05T15:57:16.160686 #823650] INFO -- : [252/885] 864616=test_yield_block I, [2024-05-05T15:57:16.165231 #823650] INFO -- : [253/885] 864616=test_bug-5832 I, [2024-05-05T15:57:16.178181 #823650] INFO -- : [254/885] 864616=test_c_struct_builder I, [2024-05-05T15:57:16.382565 #823650] INFO -- : [255/885] 864616=test_resource I, [2024-05-05T15:57:16.403988 #823650] INFO -- : [256/885] 864616=test_gem_package_tar_reader_entry I, [2024-05-05T15:57:16.654734 #823650] INFO -- : [257/885] 864616=test_gem_uri I, [2024-05-05T15:57:16.700826 #823650] INFO -- : [258/885] 864616=test_gem_commands_server_command I, [2024-05-05T15:57:16.711833 #823650] INFO -- : [259/885] 864616=test_function I, [2024-05-05T15:57:16.937219 #823650] INFO -- : [260/885] 864616=test_gem_resolver_activation_request I, [2024-05-05T15:57:16.989164 #823650] INFO -- : [261/885] 864616=test_pipe I, [2024-05-05T15:57:17.102560 #823650] INFO -- : [262/885] 864616=test_macro I, [2024-05-05T15:57:17.139667 #823650] INFO -- : [263/885] 864616=test_string I, [2024-05-05T15:57:17.209145 #823650] INFO -- : [264/885] 864617=test_gem_requirement I, [2024-05-05T15:57:17.399405 #823650] INFO -- : [265/885] 864617=parse_comments_test I, [2024-05-05T15:57:17.405730 #823650] INFO -- : [266/885] 864617=test_tcp I, [2024-05-05T15:57:17.475112 #823650] INFO -- : [267/885] 864617=test_win32ole_method_event I, [2024-05-05T15:57:17.532181 #823650] INFO -- : [268/885] 864617=test_integer I, [2024-05-05T15:57:17.541711 #823650] INFO -- : [269/885] 864617=test_gem_name_tuple I, [2024-05-05T15:57:17.598490 #823650] INFO -- : [270/885] 864617=test_rdoc_markup_to_table_of_contents I, [2024-05-05T15:57:17.643019 #823650] INFO -- : [271/885] 864617=test_file I, [2024-05-05T15:57:17.657315 #823650] INFO -- : [272/885] 864617=test_time I, [2024-05-05T15:57:17.789148 #823650] INFO -- : [273/885] 864617=test_gem_commands_owner_command I, [2024-05-05T15:57:18.479310 #823650] INFO -- : [274/885] 864617=test_nextafter I, [2024-05-05T15:57:18.568280 #823650] INFO -- : [275/885] 864617=test_capacity I, [2024-05-05T15:57:18.579355 #823650] INFO -- : [276/885] 864617=test_gem_request_connection_pools I, [2024-05-05T15:57:19.762397 #823650] INFO -- : [277/885] 864617=test_init I, [2024-05-05T15:57:20.047698 #823650] INFO -- : [278/885] 864617=test_rat I, [2024-05-05T15:57:20.057119 #823650] INFO -- : [279/885] 864617=test_yamlstore I, [2024-05-05T15:57:20.077572 #823650] INFO -- : [280/885] 864617=test_bug-3571 I, [2024-05-05T15:57:20.088792 #823650] INFO -- : [281/885] 864617=test_numeric I, [2024-05-05T15:57:20.361093 #823650] INFO -- : [282/885] 864617=test_flags I, [2024-05-05T15:57:20.746569 #823650] INFO -- : [283/885] 864617=test_rdoc_generator_markup I, [2024-05-05T15:57:20.761089 #823650] INFO -- : [284/885] 864617=test_find I, [2024-05-05T15:57:21.175738 #823650] INFO -- : [285/885] 864617=test_constant I, [2024-05-05T15:57:21.682326 #823650] INFO -- : [286/885] 864615=test_encoding I, [2024-05-05T15:57:21.817258 #823650] INFO -- : [287/885] 864615=test_hmac I, [2024-05-05T15:57:21.824290 #823650] INFO -- : [288/885] 864615=test_enumerator_kw I, [2024-05-05T15:57:21.831852 #823650] INFO -- : [289/885] 864615=reflection_test I, [2024-05-05T15:57:21.840300 #823650] INFO -- : [290/885] 864615=test_line_editor I, [2024-05-05T15:57:21.847173 #823650] INFO -- : [291/885] 864615=test_marshalable I, [2024-05-05T15:57:21.849398 #823650] INFO -- : [292/885] 864615=test_files_lib I, [2024-05-05T15:57:21.858191 #823650] INFO -- : [293/885] 864615=test_help I, [2024-05-05T15:57:21.912344 #823650] INFO -- : [294/885] 864615=test_string_memory I, [2024-05-05T15:57:22.007480 #823650] INFO -- : [295/885] 864615=test_raise I, [2024-05-05T15:57:22.013958 #823650] INFO -- : [296/885] 864615=test_complexrational I, [2024-05-05T15:57:22.018834 #823650] INFO -- : [297/885] 864615=version_test I, [2024-05-05T15:57:22.032903 #823650] INFO -- : [298/885] 864615=json_common_interface_test I, [2024-05-05T15:57:22.045694 #823650] INFO -- : [299/885] 864615=test_string I, [2024-05-05T15:57:22.059856 #823650] INFO -- : [300/885] 864615=test_function_entry I, [2024-05-05T15:57:22.074068 #823650] INFO -- : [301/885] 864615=test_error_highlight I, [2024-05-05T15:57:22.544016 #823650] INFO -- : [302/885] 864615=test_rdoc_any_method I, [2024-05-05T15:57:22.775250 #823650] INFO -- : [303/885] 864617=test_fnmatch I, [2024-05-05T15:57:22.817131 #823650] INFO -- : [304/885] 864617=test_pathname I, [2024-05-05T15:57:22.966873 #823650] INFO -- : [305/885] 864615=test_coverage I, [2024-05-05T15:57:23.048662 #823650] INFO -- : [306/885] 864617=test_http_request I, [2024-05-05T15:57:23.059907 #823650] INFO -- : [307/885] 864617=test_tempfile I, [2024-05-05T15:57:23.295539 #823650] INFO -- : [308/885] 864617=test_rdoc_markup_pre_process I, [2024-05-05T15:57:23.373525 #823650] INFO -- : [309/885] 864617=test_store I, [2024-05-05T15:57:23.713398 #823650] INFO -- : [310/885] 864617=test_tree_builder I, [2024-05-05T15:57:23.732914 #823650] INFO -- : [311/885] 864617=test_gem_commands_update_command I, [2024-05-05T15:57:23.752737 #823650] INFO -- : [312/885] 864615=test_big5 I, [2024-05-05T15:57:23.761269 #823650] INFO -- : [313/885] 864615=test_date I, [2024-05-05T15:57:23.767296 #823650] INFO -- : [314/885] 864615=test_protect I, [2024-05-05T15:57:23.772531 #823650] INFO -- : [315/885] 864615=test_date_conv I, [2024-05-05T15:57:23.789431 #823650] INFO -- : [316/885] 864615=test_rdoc_markup_verbatim I, [2024-05-05T15:57:23.803238 #823650] INFO -- : [317/885] 864615=test_webauthn_poller I, [2024-05-05T15:57:24.054304 #823650] INFO -- : [318/885] 864615=test_egrep_cpp I, [2024-05-05T15:57:24.120360 #823650] INFO -- : [319/885] 864615=test_frozen I, [2024-05-05T15:57:24.134840 #823650] INFO -- : [320/885] 864615=test_gem_resolver_index_specification I, [2024-05-05T15:57:24.185514 #823650] INFO -- : [321/885] 864615=test_serialize_subclasses I, [2024-05-05T15:57:24.203374 #823650] INFO -- : [322/885] 864615=test_rdoc_generator_pot_po_entry I, [2024-05-05T15:57:24.213846 #823650] INFO -- : [323/885] 864615=test_erb_m17n I, [2024-05-05T15:57:24.231601 #823650] INFO -- : [324/885] 864615=test_timeout I, [2024-05-05T15:57:24.234343 #823650] INFO -- : [325/885] 864615=test_yjit_exit_locations I, [2024-05-05T15:57:24.240578 #823650] INFO -- : [326/885] 864615=test_rdoc_rdoc I, [2024-05-05T15:57:24.343160 #823650] INFO -- : [327/885] 864615=test_rdoc_markdown_test I, [2024-05-05T15:57:25.433602 #823650] INFO -- : [328/885] 864615=test_type_completor I, [2024-05-05T15:57:25.451948 #823650] INFO -- : [329/885] 864615=test_rdoc_normal_module I, [2024-05-05T15:57:25.462092 #823650] INFO -- : [330/885] 864617=test_io_timeout I, [2024-05-05T15:57:25.462630 #823650] INFO -- : [331/885] 864617=test_gem_config_file I, [2024-05-05T15:57:25.488666 #823650] INFO -- : [332/885] 864615=json_string_matching_test I, [2024-05-05T15:57:25.493847 #823650] INFO -- : [333/885] 864615=test_comparable I, [2024-05-05T15:57:25.510532 #823650] INFO -- : [334/885] 864615=test_kdf I, [2024-05-05T15:57:25.588717 #823650] INFO -- : [335/885] 864615=test_ldap I, [2024-05-05T15:57:25.593294 #823650] INFO -- : [336/885] 864615=test_defined I, [2024-05-05T15:57:25.666432 #823650] INFO -- : [337/885] 864615=test_passing_block I, [2024-05-05T15:57:25.687651 #823650] INFO -- : [338/885] 864615=test_nowrite I, [2024-05-05T15:57:25.711119 #823650] INFO -- : [339/885] 864615=test_thread_queue I, [2024-05-05T15:57:25.724691 #823650] INFO -- : [340/885] 864617=test_io_buffer I, [2024-05-05T15:57:25.784611 #823650] INFO -- : [341/885] 864617=test_nil I, [2024-05-05T15:57:25.796543 #823650] INFO -- : [342/885] 864617=test_psych I, [2024-05-05T15:57:25.848310 #823650] INFO -- : [343/885] 864617=test_human_typo I, [2024-05-05T15:57:25.886192 #823650] INFO -- : [344/885] 864617=test_import I, [2024-05-05T15:57:27.657095 #823650] INFO -- : [345/885] 864617=test_wait I, [2024-05-05T15:57:27.715997 #823650] INFO -- : [346/885] 864617=test_gem_resolver_specification I, [2024-05-05T15:57:27.742245 #823650] INFO -- : [347/885] 864617=test_big2str I, [2024-05-05T15:57:27.757806 #823650] INFO -- : [348/885] 864617=test_logger I, [2024-05-05T15:57:27.776610 #823650] INFO -- : [349/885] 864617=test_pkey_dsa I, [2024-05-05T15:57:30.332816 #823650] INFO -- : [350/885] 864617=test_yaml_tree I, [2024-05-05T15:57:30.358507 #823650] INFO -- : [351/885] 864617=test_gem_commands_yank_command I, [2024-05-05T15:57:30.704282 #823650] INFO -- : [352/885] 864615=test_euc_tw I, [2024-05-05T15:57:30.717471 #823650] INFO -- : [353/885] 864615=test_command I, [2024-05-05T15:57:30.895823 #823650] INFO -- : [354/885] 864617=test_gem_resolver_dependency_request I, [2024-05-05T15:57:30.960233 #823650] INFO -- : [355/885] 864617=test_cstr I, [2024-05-05T15:57:31.020120 #823650] INFO -- : [356/885] 864615=test_gem_commands_cert_command I, [2024-05-05T15:57:32.396450 #823650] INFO -- : [357/885] 864617=ruby_parser_test I, [2024-05-05T15:57:32.411094 #823650] INFO -- : [358/885] 864617=test_gem_commands_stale_command I, [2024-05-05T15:57:32.440614 #823650] INFO -- : [359/885] 864617=json_parser_test I, [2024-05-05T15:57:32.570637 #823650] INFO -- : [360/885] 864617=test_date_strftime I, [2024-05-05T15:57:32.883504 #823650] INFO -- : [361/885] 864617=test_ws I, [2024-05-05T15:57:32.894266 #823650] INFO -- : [362/885] 864617=test_rdoc_markup_to_tt_only I, [2024-05-05T15:57:32.935998 #823650] INFO -- : [363/885] 864617=test_rdoc_markup_raw I, [2024-05-05T15:57:32.942268 #823650] INFO -- : [364/885] 864617=test_key_name_check I, [2024-05-05T15:57:32.949905 #823650] INFO -- : [365/885] 864617=test_rdoc_markup_to_bs I, [2024-05-05T15:57:32.998761 #823650] INFO -- : [366/885] 864617=test_timeout I, [2024-05-05T15:57:33.049603 #823650] INFO -- : [367/885] 864615=test_rdoc_alias I, [2024-05-05T15:57:33.202478 #823650] INFO -- : [368/885] 864615=test_instrumentation_api I, [2024-05-05T15:57:33.910111 #823650] INFO -- : [369/885] 864617=test_weakref I, [2024-05-05T15:57:34.091608 #823650] INFO -- : [370/885] 864617=test_numeric I, [2024-05-05T15:57:34.147159 #823650] INFO -- : [371/885] 864617=test_fstring I, [2024-05-05T15:57:34.202885 #823650] INFO -- : [372/885] 864617=test_singleton I, [2024-05-05T15:57:34.206271 #823650] INFO -- : [373/885] 864617=test_word I, [2024-05-05T15:57:34.218583 #823650] INFO -- : [374/885] 864617=test_rdoc_require I, [2024-05-05T15:57:34.358997 #823650] INFO -- : [375/885] 864617=test_gem_ext_rake_builder I, [2024-05-05T15:57:34.900718 #823650] INFO -- : [376/885] 864617=test_exception I, [2024-05-05T15:57:36.063751 #823650] INFO -- : [377/885] 864615=test_bash_completion I, [2024-05-05T15:57:36.069985 #823650] INFO -- : [378/885] 864615=test_div I, [2024-05-05T15:57:36.071962 #823650] INFO -- : [379/885] 864615=test_files_test_2 I, [2024-05-05T15:57:36.089390 #823650] INFO -- : [380/885] 864615=test_rdoc_markup_to_html_crossref I, [2024-05-05T15:57:36.415678 #823650] INFO -- : [381/885] 864615=test_deprecated I, [2024-05-05T15:57:36.422021 #823650] INFO -- : [382/885] 864615=test_io_buffer I, [2024-05-05T15:57:36.539563 #823650] INFO -- : [383/885] 864615=test_rdoc_context_section I, [2024-05-05T15:57:36.543975 #823650] INFO -- : [384/885] 864615=test_optparse I, [2024-05-05T15:57:36.560187 #823650] INFO -- : [385/885] 864615=test_pkcs7 I, [2024-05-05T15:57:36.720555 #823650] INFO -- : [386/885] 864615=test_gem_commands_environment_command I, [2024-05-05T15:57:36.795832 #823650] INFO -- : [387/885] 864615=test_pack I, [2024-05-05T15:57:36.992186 #823650] INFO -- : [388/885] 864615=test_syntax I, [2024-05-05T15:57:38.000439 #823650] INFO -- : [389/885] 864617=test_scalar I, [2024-05-05T15:57:38.017525 #823650] INFO -- : [390/885] 864617=test_class_name_check I, [2024-05-05T15:57:38.046440 #823650] INFO -- : [391/885] 864617=test_basicsocket I, [2024-05-05T15:57:38.056348 #823650] INFO -- : [392/885] 864617=test_zsh_completion I, [2024-05-05T15:57:38.117377 #823650] INFO -- : [393/885] 864617=test_thread I, [2024-05-05T15:57:38.292586 #823650] INFO -- : [394/885] 864617=test_gem_util I, [2024-05-05T15:57:38.509919 #823650] INFO -- : [395/885] 864617=test_complex2 I, [2024-05-05T15:57:38.520444 #823650] INFO -- : [396/885] 864617=test_config I, [2024-05-05T15:57:38.572837 #823650] INFO -- : [397/885] 864617=test_gem_security_signer I, [2024-05-05T15:57:38.688881 #823650] INFO -- : [398/885] 864617=test_literal I, [2024-05-05T15:57:39.221467 #823650] INFO -- : [399/885] 864617=test_gem_unsatisfiable_dependency_error I, [2024-05-05T15:57:39.238900 #823650] INFO -- : [400/885] 864617=test_io I, [2024-05-05T15:57:39.426487 #823650] INFO -- : [401/885] 864617=test_rdoc_i18n_text I, [2024-05-05T15:57:39.435887 #823650] INFO -- : [402/885] 864617=test_input_method I, [2024-05-05T15:57:39.514268 #823650] INFO -- : [403/885] 864617=test_pkey_dh I, [2024-05-05T15:57:39.596958 #823650] INFO -- : [404/885] 864616=test_multi_irb_commands I, [2024-05-05T15:57:39.614254 #823650] INFO -- : [405/885] 864616=test_m17n_comb I, [2024-05-05T15:57:40.869600 #823650] INFO -- : [406/885] 864617=test_ractor I, [2024-05-05T15:57:40.903628 #823650] INFO -- : [407/885] 864617=test_null I, [2024-05-05T15:57:40.913132 #823650] INFO -- : [408/885] 864617=test_memory_view I, [2024-05-05T15:57:40.934822 #823650] INFO -- : [409/885] 864617=test_data I, [2024-05-05T15:57:40.939780 #823650] INFO -- : [410/885] 864617=test_bigzero I, [2024-05-05T15:57:40.940751 #823650] INFO -- : [411/885] 864617=test_gem_platform I, [2024-05-05T15:57:41.103754 #823650] INFO -- : [412/885] 864617=test_gem_commands_query_command I, [2024-05-05T15:57:41.797984 #823650] INFO -- : [413/885] 864617=test_win32ole_typelib I, [2024-05-05T15:57:41.803822 #823650] INFO -- : [414/885] 864617=test_external_new I, [2024-05-05T15:57:41.816550 #823650] INFO -- : [415/885] 864617=test_pkey I, [2024-05-05T15:57:41.821497 #823650] INFO -- : [416/885] 864617=test_rdoc_markup_attributes I, [2024-05-05T15:57:41.828715 #823650] INFO -- : [417/885] 864617=redundant_return_test I, [2024-05-05T15:57:41.833757 #823650] INFO -- : [418/885] 864617=test_string_processing I, [2024-05-05T15:57:41.843996 #823650] INFO -- : [419/885] 864617=test_random_formatter I, [2024-05-05T15:57:41.868472 #823650] INFO -- : [420/885] 864617=test_rand I, [2024-05-05T15:57:42.239586 #823650] INFO -- : [421/885] 864617=test_euc_kr I, [2024-05-05T15:57:42.241601 #823650] INFO -- : [422/885] 864617=test_provider I, [2024-05-05T15:57:42.245069 #823650] INFO -- : [423/885] 864617=test_gem_source_specific_file I, [2024-05-05T15:57:42.345345 #823650] INFO -- : [424/885] 864617=test_bmethod I, [2024-05-05T15:57:42.366016 #823650] INFO -- : [425/885] 864617=test_rdoc_code_object I, [2024-05-05T15:57:42.520233 #823650] INFO -- : [426/885] 864616=test_process I, [2024-05-05T15:57:42.673336 #823650] INFO -- : [427/885] 864617=test_io_wait I, [2024-05-05T15:57:43.116580 #823650] INFO -- : [428/885] 864617=test_pack I, [2024-05-05T15:57:43.220169 #823650] INFO -- : [429/885] 864617=test_rdoc_parser_c I, [2024-05-05T15:57:43.495590 #823650] INFO -- : [430/885] 864617=test_kwargs I, [2024-05-05T15:57:43.550869 #823650] INFO -- : [431/885] 864617=parse_test I, [2024-05-05T15:57:45.053287 #823650] INFO -- : [432/885] 864615=json_fixtures_test I, [2024-05-05T15:57:45.064028 #823650] INFO -- : [433/885] 864615=test_gem_doctor I, [2024-05-05T15:57:45.173916 #823650] INFO -- : [434/885] 864615=test_len I, [2024-05-05T15:57:45.192243 #823650] INFO -- : [435/885] 864615=test_gem_dependency_list I, [2024-05-05T15:57:45.275172 #823650] INFO -- : [436/885] 864615=test_gem_commands_outdated_command I, [2024-05-05T15:57:45.343341 #823650] INFO -- : [437/885] 864615=test_rdoc_parser_changelog I, [2024-05-05T15:57:45.438794 #823650] INFO -- : [438/885] 864615=parameters_signature_test I, [2024-05-05T15:57:45.450207 #823650] INFO -- : [439/885] 864615=test_typeddata I, [2024-05-05T15:57:45.717396 #823650] INFO -- : [440/885] 864615=test_gem_commands_fetch_command I, [2024-05-05T15:57:45.909956 #823650] INFO -- : [441/885] 864615=test_tsort I, [2024-05-05T15:57:45.920028 #823650] INFO -- : [442/885] 864615=test_securerandom I, [2024-05-05T15:57:45.962302 #823650] INFO -- : [443/885] 864615=test_rdoc_text I, [2024-05-05T15:57:46.020789 #823650] INFO -- : [444/885] 864615=library_symbols_test I, [2024-05-05T15:57:46.029314 #823650] INFO -- : [445/885] 864615=test_stringify_symbols I, [2024-05-05T15:57:46.034022 #823650] INFO -- : [446/885] 864615=test_require I, [2024-05-05T15:57:46.043608 #823650] INFO -- : [447/885] 864615=test_objspace I, [2024-05-05T15:57:46.377861 #823650] INFO -- : [448/885] 864617=test_have_library I, [2024-05-05T15:57:47.196183 #823650] INFO -- : [449/885] 864617=test_stream I, [2024-05-05T15:57:47.203998 #823650] INFO -- : [450/885] 864617=test_ns_spki I, [2024-05-05T15:57:47.211748 #823650] INFO -- : [451/885] 864617=test_iseq_load I, [2024-05-05T15:57:48.351121 #823650] INFO -- : [452/885] 864617=test_rdoc_markup_parser I, [2024-05-05T15:57:48.403336 #823650] INFO -- : [453/885] 864617=test_rdoc_markup_indented_paragraph I, [2024-05-05T15:57:48.461501 #823650] INFO -- : [454/885] 864617=test_postponed_job I, [2024-05-05T15:57:48.733318 #823650] INFO -- : [455/885] 864617=test_key_actor_vi I, [2024-05-05T15:57:48.827661 #823650] INFO -- : [456/885] 864617=test_rdoc_markdown I, [2024-05-05T15:57:49.068464 #823650] INFO -- : [457/885] 864617=test_gem_request_set_lockfile I, [2024-05-05T15:57:49.540846 #823650] INFO -- : [458/885] 864617=test_win32ole_variant_outarg I, [2024-05-05T15:57:49.552819 #823650] INFO -- : [459/885] 864617=test_rdoc_encoding I, [2024-05-05T15:57:49.608993 #823650] INFO -- : [460/885] 864617=test_generic I, [2024-05-05T15:57:49.637091 #823650] INFO -- : [461/885] 864617=test_rdoc_markup_to_html_snippet I, [2024-05-05T15:57:49.717780 #823650] INFO -- : [462/885] 864617=test_common I, [2024-05-05T15:57:49.891049 #823650] INFO -- : [463/885] 864617=test_httpresponses I, [2024-05-05T15:57:49.904552 #823650] INFO -- : [464/885] 864617=test_rdoc_constant I, [2024-05-05T15:57:50.053865 #823650] INFO -- : [465/885] 864617=test_deprecate I, [2024-05-05T15:57:50.109723 #823650] INFO -- : [466/885] 864617=test_gem_ext_builder I, [2024-05-05T15:57:51.175421 #823650] INFO -- : [467/885] 864617=test_history I, [2024-05-05T15:57:51.195878 #823650] INFO -- : [468/885] 864617=test_to_ary_concat I, [2024-05-05T15:57:54.616057 #823650] INFO -- : [469/885] 864617=test_windows_1251 I, [2024-05-05T15:57:54.635460 #823650] INFO -- : [470/885] 864617=test_gem_commands_build_command I, [2024-05-05T15:57:54.988715 #823650] INFO -- : [471/885] 864617=test_call I, [2024-05-05T15:57:55.116777 #823650] INFO -- : [472/885] 864617=test_ellipsize I, [2024-05-05T15:57:55.178240 #823650] INFO -- : [473/885] 864617=test_reline I, [2024-05-05T15:57:55.317520 #823650] INFO -- : [474/885] 864617=test_terminfo I, [2024-05-05T15:57:55.398595 #823650] INFO -- : [475/885] 864617=test_socket I, [2024-05-05T15:57:56.222692 #823650] INFO -- : [476/885] 864617=test_inlinecache I, [2024-05-05T15:57:56.291482 #823650] INFO -- : [477/885] 864617=test_thread I, [2024-05-05T15:58:00.684759 #823650] INFO -- : [478/885] 864616=test_data I, [2024-05-05T15:58:00.802359 #823650] INFO -- : [479/885] 864616=test_bug-14834 I, [2024-05-05T15:58:00.818791 #823650] INFO -- : [480/885] 864616=test_addrinfo I, [2024-05-05T15:58:00.854713 #823650] INFO -- : [481/885] 864616=test_to_ruby I, [2024-05-05T15:58:00.883378 #823650] INFO -- : [482/885] 864616=test_time_tz I, [2024-05-05T15:58:00.945366 #823650] INFO -- : [483/885] 864616=test_webauthn_listener_response I, [2024-05-05T15:58:01.307716 #823650] INFO -- : [484/885] 864616=test_sleep I, [2024-05-05T15:58:05.066724 #823650] INFO -- : [485/885] 864617=ruby_api_test I, [2024-05-05T15:58:05.244136 #823650] INFO -- : [486/885] 864617=test_gem_resolver_index_set I, [2024-05-05T15:58:05.288199 #823650] INFO -- : [487/885] 864617=test_gc I, [2024-05-05T15:58:05.988367 #823650] INFO -- : [488/885] 864616=test_gem_request_set I, [2024-05-05T15:58:06.593596 #823650] INFO -- : [489/885] 864616=test_gem_bundler_version_finder I, [2024-05-05T15:58:06.631794 #823650] INFO -- : [490/885] 864616=test_folderitem2_invokeverb I, [2024-05-05T15:58:06.640425 #823650] INFO -- : [491/885] 864616=test_interned_str I, [2024-05-05T15:58:06.648080 #823650] INFO -- : [492/885] 864616=constant_path_node_test I, [2024-05-05T15:58:06.656303 #823650] INFO -- : [493/885] 864616=test_set_len I, [2024-05-05T15:58:06.677773 #823650] INFO -- : [494/885] 864616=test_pattern_matching I, [2024-05-05T15:58:06.701890 #823650] INFO -- : [495/885] 864616=location_test I, [2024-05-05T15:58:06.758495 #823650] INFO -- : [496/885] 864616=test_delegate I, [2024-05-05T15:58:06.775054 #823650] INFO -- : [497/885] 864616=test_chilled I, [2024-05-05T15:58:06.779939 #823650] INFO -- : [498/885] 864616=test_symbol I, [2024-05-05T15:58:06.844603 #823650] INFO -- : [499/885] 864616=test_project_sanity I, [2024-05-05T15:58:06.853561 #823650] INFO -- : [500/885] 864616=test_alias_and_anchor I, [2024-05-05T15:58:06.924966 #823650] INFO -- : [501/885] 864616=test_popen_deadlock I, [2024-05-05T15:58:07.451424 #823650] INFO -- : [502/885] 864616=test_time I, [2024-05-05T15:58:07.659607 #823650] INFO -- : [503/885] 864616=test_ensured I, [2024-05-05T15:58:07.669681 #823650] INFO -- : [504/885] 864616=test_key_stroke I, [2024-05-05T15:58:07.677878 #823650] INFO -- : [505/885] 864616=test_rdoc_markup I, [2024-05-05T15:58:07.682785 #823650] INFO -- : [506/885] 864616=test_euc_jp I, [2024-05-05T15:58:07.699316 #823650] INFO -- : [507/885] 864616=test_gem_commands_signin_command I, [2024-05-05T15:58:07.885615 #823650] INFO -- : [508/885] 864616=test_range I, [2024-05-05T15:58:08.631414 #823650] INFO -- : [509/885] 864616=test_iter_break I, [2024-05-05T15:58:08.704371 #823650] INFO -- : [510/885] 864616=test_extlibs I, [2024-05-05T15:58:10.297184 #823650] INFO -- : [511/885] 864616=test_enum I, [2024-05-05T15:58:11.258465 #823650] INFO -- : [512/885] 864616=test_rdoc_markup_include I, [2024-05-05T15:58:11.274200 #823650] INFO -- : [513/885] 864616=test_require I, [2024-05-05T15:58:12.613389 #823650] INFO -- : [514/885] 864616=test_recursion I, [2024-05-05T15:58:12.622257 #823650] INFO -- : [515/885] 864616=test_rbconfig I, [2024-05-05T15:58:12.635391 #823650] INFO -- : [516/885] 864616=test_num2int I, [2024-05-05T15:58:12.654708 #823650] INFO -- : [517/885] 864616=test_locale I, [2024-05-05T15:58:12.681623 #823650] INFO -- : [518/885] 864616=test_ts I, [2024-05-05T15:58:13.014418 #823650] INFO -- : [519/885] 864616=test_ractor I, [2024-05-05T15:58:13.031971 #823650] INFO -- : [520/885] 864616=test_trick I, [2024-05-05T15:58:14.621936 #823650] INFO -- : [521/885] 864617=test_stream I, [2024-05-05T15:58:14.632888 #823650] INFO -- : [522/885] 864617=test_address_resolve I, [2024-05-05T15:58:14.651330 #823650] INFO -- : [523/885] 864617=test_rdoc_attr I, [2024-05-05T15:58:14.675403 #823650] INFO -- : [524/885] 864617=test_gem_commands_list_command I, [2024-05-05T15:58:14.686344 #823650] INFO -- : [525/885] 864617=test_date_new I, [2024-05-05T15:58:14.699070 #823650] INFO -- : [526/885] 864617=test_configuration I, [2024-05-05T15:58:14.796361 #823650] INFO -- : [527/885] 864617=test_gem_resolver_local_specification I, [2024-05-05T15:58:14.824615 #823650] INFO -- : [528/885] 864617=test_date_marshal I, [2024-05-05T15:58:15.006756 #823650] INFO -- : [529/885] 864617=test_have_func I, [2024-05-05T15:58:15.562899 #823650] INFO -- : [530/885] 864616=test_integer I, [2024-05-05T15:58:16.103695 #823650] INFO -- : [531/885] 864617=test_unix I, [2024-05-05T15:58:16.148069 #823650] INFO -- : [532/885] 864617=test_coder I, [2024-05-05T15:58:16.169929 #823650] INFO -- : [533/885] 864617=test_rdoc_servlet I, [2024-05-05T15:58:16.266095 #823650] INFO -- : [534/885] 864617=test_gem_commands_search_command I, [2024-05-05T15:58:16.287942 #823650] INFO -- : [535/885] 864617=test_symbol I, [2024-05-05T15:58:18.155355 #823650] INFO -- : [536/885] 864616=test_udp I, [2024-05-05T15:58:18.175533 #823650] INFO -- : [537/885] 864616=test_context I, [2024-05-05T15:58:18.282327 #823650] INFO -- : [538/885] 864616=test_gem_commands_contents_command I, [2024-05-05T15:58:18.416759 #823650] INFO -- : [539/885] 864616=test_formatter I, [2024-05-05T15:58:18.424469 #823650] INFO -- : [540/885] 864616=test_rdoc_markup_hard_break I, [2024-05-05T15:58:18.435828 #823650] INFO -- : [541/885] 864616=test_nesting_parser I, [2024-05-05T15:58:18.514264 #823650] INFO -- : [542/885] 864616=ractor_test I, [2024-05-05T15:58:18.523276 #823650] INFO -- : [543/885] 864616=test_ancdata I, [2024-05-05T15:58:18.538946 #823650] INFO -- : [544/885] 864616=test_marshal I, [2024-05-05T15:58:19.735308 #823650] INFO -- : [545/885] 864616=test_enc_str_buf_cat I, [2024-05-05T15:58:19.745389 #823650] INFO -- : [546/885] 864616=newline_test I, [2024-05-05T15:58:19.831889 #823650] INFO -- : [547/885] 864616=test_bignum I, [2024-05-05T15:58:22.162871 #823650] INFO -- : [548/885] 864617=test_ssl I, [2024-05-05T15:58:22.379112 #823650] INFO -- : [549/885] 864617=test_scheduler I, [2024-05-05T15:58:22.511067 #823650] INFO -- : [550/885] 864617=test_gem_commands_help_command I, [2024-05-05T15:58:22.561638 #823650] INFO -- : [551/885] 864617=test_gem_resolver_conflict I, [2024-05-05T15:58:22.663790 #823650] INFO -- : [552/885] 864617=test_ractor I, [2024-05-05T15:58:22.930988 #823650] INFO -- : [553/885] 864617=test_ansi_without_terminfo I, [2024-05-05T15:58:22.974954 #823650] INFO -- : [554/885] 864617=json_generator_test I, [2024-05-05T15:58:23.072672 #823650] INFO -- : [555/885] 864617=test_ractor I, [2024-05-05T15:58:23.100822 #823650] INFO -- : [556/885] 864617=test_gem I, [2024-05-05T15:58:23.435388 #823650] INFO -- : [557/885] 864616=test_registry I, [2024-05-05T15:58:23.444945 #823650] INFO -- : [558/885] 864616=test_gem_resolver_best_set I, [2024-05-05T15:58:23.546749 #823650] INFO -- : [559/885] 864616=test_cgi_core I, [2024-05-05T15:58:23.564800 #823650] INFO -- : [560/885] 864616=test_parser I, [2024-05-05T15:58:23.571744 #823650] INFO -- : [561/885] 864616=test_rdoc_markup_to_label I, [2024-05-05T15:58:23.615752 #823650] INFO -- : [562/885] 864616=test_insns_leaf I, [2024-05-05T15:58:23.616657 #823650] INFO -- : [563/885] 864616=test_ifunless I, [2024-05-05T15:58:23.724892 #823650] INFO -- : [564/885] 864616=test_allocation I, [2024-05-05T15:58:24.199109 #823650] INFO -- : [565/885] 864615=test_gem_console_ui I, [2024-05-05T15:58:24.210449 #823650] INFO -- : [566/885] 864615=test_x509req I, [2024-05-05T15:58:24.231625 #823650] INFO -- : [567/885] 864615=test_readpartial I, [2024-05-05T15:58:24.632655 #823650] INFO -- : [568/885] 864615=test_rdoc_parser_ruby I, [2024-05-05T15:58:25.495181 #823650] INFO -- : [569/885] 864615=test_httpresponse I, [2024-05-05T15:58:25.518653 #823650] INFO -- : [570/885] 864615=unescape_test I, [2024-05-05T15:58:25.714332 #823650] INFO -- : [571/885] 864617=test_gem_commands_exec_command I, [2024-05-05T15:58:25.987711 #823650] INFO -- : [572/885] 864616=test_super I, [2024-05-05T15:58:26.870638 #823650] INFO -- : [573/885] 864615=test_color_printer I, [2024-05-05T15:58:26.885591 #823650] INFO -- : [574/885] 864615=test_gem_source_vendor I, [2024-05-05T15:58:26.901382 #823650] INFO -- : [575/885] 864615=test_gem_resolver I, [2024-05-05T15:58:27.128622 #823650] INFO -- : [576/885] 864617=test_dln I, [2024-05-05T15:58:27.136641 #823650] INFO -- : [577/885] 864617=test_object I, [2024-05-05T15:58:27.227604 #823650] INFO -- : [578/885] 864615=test_config I, [2024-05-05T15:58:27.317222 #823650] INFO -- : [579/885] 864615=test_func I, [2024-05-05T15:58:27.436131 #823650] INFO -- : [580/885] 864616=test_vm_dump I, [2024-05-05T15:58:27.444990 #823650] INFO -- : [581/885] 864616=json_encoding_test I, [2024-05-05T15:58:27.466851 #823650] INFO -- : [582/885] 864616=test_gem_available_set I, [2024-05-05T15:58:27.506476 #823650] INFO -- : [583/885] 864617=test_pkg_config I, [2024-05-05T15:58:27.507778 #823650] INFO -- : [584/885] 864617=test_modify_expand I, [2024-05-05T15:58:27.523497 #823650] INFO -- : [585/885] 864617=errors_test I, [2024-05-05T15:58:27.561403 #823650] INFO -- : [586/885] 864616=test_convertible I, [2024-05-05T15:58:27.613707 #823650] INFO -- : [587/885] 864617=test_win32ole_event I, [2024-05-05T15:58:27.631000 #823650] INFO -- : [588/885] 864617=test_rdoc_markup_formatter I, [2024-05-05T15:58:27.727491 #823650] INFO -- : [589/885] 864617=test_gem_commands_uninstall_command I, [2024-05-05T15:58:28.520052 #823650] INFO -- : [590/885] 864617=test_compile_prism I, [2024-05-05T15:58:28.819498 #823650] INFO -- : [591/885] 864617=test_helper I, [2024-05-05T15:58:28.828244 #823650] INFO -- : [592/885] 864617=test_getopts I, [2024-05-05T15:58:28.841792 #823650] INFO -- : [593/885] 864617=test_alias I, [2024-05-05T15:58:29.102725 #823650] INFO -- : [594/885] 864617=test_fips I, [2024-05-05T15:58:29.277241 #823650] INFO -- : [595/885] 864617=test_emitter I, [2024-05-05T15:58:29.292383 #823650] INFO -- : [596/885] 864617=test_digest_extend I, [2024-05-05T15:58:29.344625 #823650] INFO -- : [597/885] 864617=test_gem_ext_cmake_builder I, [2024-05-05T15:58:29.369465 #823650] INFO -- : [598/885] 864617=test_thread_fd_close I, [2024-05-05T15:58:29.395027 #823650] INFO -- : [599/885] 864617=test_last_thread I, [2024-05-05T15:58:30.751569 #823650] INFO -- : [600/885] 864617=test_refinement I, [2024-05-05T15:58:31.194618 #823650] INFO -- : [601/885] 864616=test_transcode I, [2024-05-05T15:58:31.382384 #823650] INFO -- : [602/885] 864616=test_debug I, [2024-05-05T15:58:31.428767 #823650] INFO -- : [603/885] 864616=test_gem_commands_cleanup_command I, [2024-05-05T15:58:31.673090 #823650] INFO -- : [604/885] 864615=test_class2name I, [2024-05-05T15:58:31.683683 #823650] INFO -- : [605/885] 864615=test_pattern_key_name_check I, [2024-05-05T15:58:31.693054 #823650] INFO -- : [606/885] 864615=test_profile_frames I, [2024-05-05T15:58:31.882720 #823650] INFO -- : [607/885] 864615=test_rdoc_markup_heading I, [2024-05-05T15:58:31.912937 #823650] INFO -- : [608/885] 864615=test_io_console I, [2024-05-05T15:58:32.085112 #823650] INFO -- : [609/885] 864616=test_flip I, [2024-05-05T15:58:32.124693 #823650] INFO -- : [610/885] 864616=test_c_union_entity I, [2024-05-05T15:58:32.261016 #823650] INFO -- : [611/885] 864616=test_cgi_session I, [2024-05-05T15:58:32.275031 #823650] INFO -- : [612/885] 864616=test_notimplement I, [2024-05-05T15:58:32.422382 #823650] INFO -- : [613/885] 864616=test_dns I, [2024-05-05T15:58:32.739600 #823650] INFO -- : [614/885] 864616=test_x509crl I, [2024-05-05T15:58:32.839864 #823650] INFO -- : [615/885] 864616=test_helper_method I, [2024-05-05T15:58:32.851995 #823650] INFO -- : [616/885] 864616=test_summary I, [2024-05-05T15:58:32.912782 #823650] INFO -- : [617/885] 864616=test_file I, [2024-05-05T15:58:34.511456 #823650] INFO -- : [618/885] 864617=test_config I, [2024-05-05T15:58:34.557014 #823650] INFO -- : [619/885] 864615=bom_test I, [2024-05-05T15:58:34.567275 #823650] INFO -- : [620/885] 864615=test_emitter I, [2024-05-05T15:58:34.574173 #823650] INFO -- : [621/885] 864615=test_x509ext I, [2024-05-05T15:58:34.579484 #823650] INFO -- : [622/885] 864615=test_foreach I, [2024-05-05T15:58:34.588520 #823650] INFO -- : [623/885] 864615=test_rdoc_markup_to_html I, [2024-05-05T15:58:34.744202 #823650] INFO -- : [624/885] 864615=test_gem_resolver_installer_set I, [2024-05-05T15:58:34.828324 #823650] INFO -- : [625/885] 864617=test_append I, [2024-05-05T15:58:34.829463 #823650] INFO -- : [626/885] 864617=test_gem_path_support I, [2024-05-05T15:58:34.888338 #823650] INFO -- : [627/885] 864617=test_arity I, [2024-05-05T15:58:34.897320 #823650] INFO -- : [628/885] 864617=test_win32ole_type_event I, [2024-05-05T15:58:34.912190 #823650] INFO -- : [629/885] 864617=test_keyword I, [2024-05-05T15:58:34.995902 #823650] INFO -- : [630/885] 864615=test_trace I, [2024-05-05T15:58:35.004751 #823650] INFO -- : [631/885] 864615=test_scalar_scanner I, [2024-05-05T15:58:35.014246 #823650] INFO -- : [632/885] 864615=test_rb_str_dup I, [2024-05-05T15:58:35.022968 #823650] INFO -- : [633/885] 864615=test_lambda I, [2024-05-05T15:58:35.080944 #823650] INFO -- : [634/885] 864615=test_whileuntil I, [2024-05-05T15:58:35.100027 #823650] INFO -- : [635/885] 864615=test_regexp I, [2024-05-05T15:58:35.467288 #823650] INFO -- : [636/885] 864617=test_nofree I, [2024-05-05T15:58:35.478757 #823650] INFO -- : [637/885] 864617=test_within_pipe I, [2024-05-05T15:58:35.503287 #823650] INFO -- : [638/885] 864617=test_rdoc_normal_class I, [2024-05-05T15:58:35.538977 #823650] INFO -- : [639/885] 864617=test_pointer I, [2024-05-05T15:58:37.537424 #823650] INFO -- : [640/885] 864617=test_monitor I, [2024-05-05T15:58:37.762944 #823650] INFO -- : [641/885] 864617=test_beginendblock I, [2024-05-05T15:58:38.083140 #823650] INFO -- : [642/885] 864617=test_eval I, [2024-05-05T15:58:38.371287 #823650] INFO -- : [643/885] 864617=test_arith_seq_extract I, [2024-05-05T15:58:38.471792 #823650] INFO -- : [644/885] 864617=compiler_test I, [2024-05-05T15:58:38.480103 #823650] INFO -- : [645/885] 864617=test_ruby_lex I, [2024-05-05T15:58:38.593515 #823650] INFO -- : [646/885] 864617=test_object_references I, [2024-05-05T15:58:38.638338 #823650] INFO -- : [647/885] 864617=test_gem_source_subpath_problem I, [2024-05-05T15:58:38.806989 #823650] INFO -- : [648/885] 864617=test_bug_reporter I, [2024-05-05T15:58:38.943168 #823650] INFO -- : [649/885] 864617=test_gem_installer I, [2024-05-05T15:58:39.159544 #823650] INFO -- : [650/885] 864616=test_ossl I, [2024-05-05T15:58:44.160045 #823650] INFO -- : [651/885] 864617=test_buffered_io I, [2024-05-05T15:58:44.160955 #823650] INFO -- : [652/885] 864617=test_helper I, [2024-05-05T15:58:44.180979 #823650] INFO -- : [653/885] 864617=test_gem_resolver_api_set I, [2024-05-05T15:58:44.278339 #823650] INFO -- : [654/885] 864617=test_duplicate I, [2024-05-05T15:58:44.289519 #823650] INFO -- : [655/885] 864617=test_cgi_header I, [2024-05-05T15:58:44.298975 #823650] INFO -- : [656/885] 864617=format_errors_test I, [2024-05-05T15:58:44.308954 #823650] INFO -- : [657/885] 864617=test_case_options I, [2024-05-05T15:58:44.320934 #823650] INFO -- : [658/885] 864617=test_kill_ring I, [2024-05-05T15:58:44.332745 #823650] INFO -- : [659/885] 864617=test_mailto I, [2024-05-05T15:58:44.342854 #823650] INFO -- : [660/885] 864617=test_addr I, [2024-05-05T15:58:44.359000 #823650] INFO -- : [661/885] 864617=test_object I, [2024-05-05T15:58:44.369893 #823650] INFO -- : [662/885] 864617=test_member I, [2024-05-05T15:58:44.379770 #823650] INFO -- : [663/885] 864617=test_autoconf I, [2024-05-05T15:58:44.389819 #823650] INFO -- : [664/885] 864617=integer_parse_test I, [2024-05-05T15:58:44.456900 #823650] INFO -- : [665/885] 864617=test_ractor_compatibility I, [2024-05-05T15:58:44.769755 #823650] INFO -- : [666/885] 864617=test_arithmetic_sequence I, [2024-05-05T15:58:44.785847 #823650] INFO -- : [667/885] 864617=test_find_executable I, [2024-05-05T15:58:44.802832 #823650] INFO -- : [668/885] 864617=test_gem_request_set_lockfile_tokenizer I, [2024-05-05T15:58:44.892142 #823650] INFO -- : [669/885] 864617=test_cgi_multipart I, [2024-05-05T15:58:45.010129 #823650] INFO -- : [670/885] 864617=test_lazy_enumerator I, [2024-05-05T15:58:45.462225 #823650] INFO -- : [671/885] 864617=test_gem_source_fetch_problem I, [2024-05-05T15:58:45.484765 #823650] INFO -- : [672/885] 864617=test_rdoc_comment I, [2024-05-05T15:58:45.712315 #823650] INFO -- : [673/885] 864617=test_install I, [2024-05-05T15:58:45.722844 #823650] INFO -- : [674/885] 864617=test_encoding I, [2024-05-05T15:58:45.738653 #823650] INFO -- : [675/885] 864617=test_ftp I, [2024-05-05T15:58:45.748441 #823650] INFO -- : [676/885] 864617=test_sockopt I, [2024-05-05T15:58:45.788422 #823650] INFO -- : [677/885] 864617=test_gem_commands_setup_command I, [2024-05-05T15:58:46.602408 #823650] INFO -- : [678/885] 864617=test_history I, [2024-05-05T15:58:46.642904 #823650] INFO -- : [679/885] 864617=test_document I, [2024-05-05T15:58:46.652993 #823650] INFO -- : [680/885] 864617=test_eval I, [2024-05-05T15:58:46.668306 #823650] INFO -- : [681/885] 864617=test_gem_safe_yaml I, [2024-05-05T15:58:46.678520 #823650] INFO -- : [682/885] 864617=test_singleton_function I, [2024-05-05T15:58:46.687023 #823650] INFO -- : [683/885] 864617=command_line_test I, [2024-05-05T15:58:46.713238 #823650] INFO -- : [684/885] 864617=test_gem_package_tar_reader I, [2024-05-05T15:58:46.761989 #823650] INFO -- : [685/885] 864616=test_gem_commands_signout_command I, [2024-05-05T15:58:46.783524 #823650] INFO -- : [686/885] 864617=test_env I, [2024-05-05T15:58:46.799825 #823650] INFO -- : [687/885] 864616=test_win32ole_variant_m I, [2024-05-05T15:58:46.855665 #823650] INFO -- : [688/885] 864616=test_pair I, [2024-05-05T15:58:49.338868 #823650] INFO -- : [689/885] 864617=test_primitive I, [2024-05-05T15:58:49.354747 #823650] INFO -- : [690/885] 864617=test_rdoc_ri_paths I, [2024-05-05T15:58:49.390576 #823650] INFO -- : [691/885] 864617=test_parser I, [2024-05-05T15:58:49.467874 #823650] INFO -- : [692/885] 864617=test_iseq I, [2024-05-05T15:58:50.080608 #823650] INFO -- : [693/885] 864617=test_thread_cv I, [2024-05-05T15:58:50.797949 #823650] INFO -- : [694/885] 864617=test_stringio I, [2024-05-05T15:58:50.880810 #823650] INFO -- : [695/885] 864617=test_assembler I, [2024-05-05T15:58:50.982797 #823650] INFO -- : [696/885] 864617=test_files_ext I, [2024-05-05T15:58:50.991012 #823650] INFO -- : [697/885] 864617=test_random I, [2024-05-05T15:58:51.023910 #823650] INFO -- : [698/885] 864617=test_lexer I, [2024-05-05T15:58:51.036891 #823650] INFO -- : [699/885] 864617=test_win32ole_method I, [2024-05-05T15:58:51.061147 #823650] INFO -- : [700/885] 864617=test_regex_casefold I, [2024-05-05T15:58:51.482699 #823650] INFO -- : [701/885] 864617=test_gem_source_git I, [2024-05-05T15:58:52.143261 #823650] INFO -- : [702/885] 864616=test_ripper I, [2024-05-05T15:58:52.470089 #823650] INFO -- : [703/885] 864616=test_eval_history I, [2024-05-05T15:58:52.488429 #823650] INFO -- : [704/885] 864616=dispatcher_test I, [2024-05-05T15:58:52.495429 #823650] INFO -- : [705/885] 864616=test_unicode I, [2024-05-05T15:58:52.528819 #823650] INFO -- : [706/885] 864616=test_gem_package I, [2024-05-05T15:58:52.539324 #823650] INFO -- : [707/885] 864617=test_array I, [2024-05-05T15:58:53.506284 #823650] INFO -- : [708/885] 864616=test_autoload I, [2024-05-05T15:58:57.760553 #823650] INFO -- : [709/885] 864616=test_have_macro I, [2024-05-05T15:58:57.992103 #823650] INFO -- : [710/885] 864616=test_mkmf I, [2024-05-05T15:58:58.038272 #823650] INFO -- : [711/885] 864616=test_gem_source I, [2024-05-05T15:58:58.408768 #823650] INFO -- : [712/885] 864616=test_class I, [2024-05-05T15:58:58.427751 #823650] INFO -- : [713/885] 864616=test_at_exit I, [2024-05-05T15:58:58.437815 #823650] INFO -- : [714/885] 864616=test_benchmark I, [2024-05-05T15:59:00.056124 #823650] INFO -- : [715/885] 864616=test_shellwords I, [2024-05-05T15:59:00.066960 #823650] INFO -- : [716/885] 864616=test_mul I, [2024-05-05T15:59:00.074492 #823650] INFO -- : [717/885] 864616=test_rdoc_generator_pot_po I, [2024-05-05T15:59:00.086604 #823650] INFO -- : [718/885] 864616=test_ipaddr I, [2024-05-05T15:59:00.114485 #823650] INFO -- : [719/885] 864616=test_scanner_events I, [2024-05-05T15:59:00.161253 #823650] INFO -- : [720/885] 864616=test_ocsp I, [2024-05-05T15:59:00.254856 #823650] INFO -- : [721/885] 864616=test_omap I, [2024-05-05T15:59:00.271192 #823650] INFO -- : [722/885] 864616=test_date_strptime I, [2024-05-05T15:59:00.392359 #823650] INFO -- : [723/885] 864616=test_nonblock I, [2024-05-05T15:59:00.417316 #823650] INFO -- : [724/885] 864616=test_rdoc_parser_simple I, [2024-05-05T15:59:00.451416 #823650] INFO -- : [725/885] 864616=test_gem_ext_configure_builder I, [2024-05-05T15:59:00.484922 #823650] INFO -- : [726/885] 864616=json_ext_parser_test I, [2024-05-05T15:59:00.497240 #823650] INFO -- : [727/885] 864616=test_color I, [2024-05-05T15:59:00.583736 #823650] INFO -- : [728/885] 864616=test_rdoc_top_level I, [2024-05-05T15:59:00.895415 #823650] INFO -- : [729/885] 864616=test_io_m17n I, [2024-05-05T15:59:01.532079 #823650] INFO -- : [730/885] 864615=test_float I, [2024-05-05T15:59:02.182914 #823650] INFO -- : [731/885] 864616=test_gem_stub_specification I, [2024-05-05T15:59:02.361485 #823650] INFO -- : [732/885] 864616=test_cmethod I, [2024-05-05T15:59:02.611578 #823650] INFO -- : [733/885] 864616=test_unicode_normalize I, [2024-05-05T15:59:03.449299 #823650] INFO -- : [734/885] 864615=test_rdoc_generator_ri I, [2024-05-05T15:59:03.461250 #823650] INFO -- : [735/885] 864615=test_gem_stream_ui I, [2024-05-05T15:59:03.597819 #823650] INFO -- : [736/885] 864615=test_gb18030 I, [2024-05-05T15:59:03.603149 #823650] INFO -- : [737/885] 864615=test_propertyputref I, [2024-05-05T15:59:03.609739 #823650] INFO -- : [738/885] 864615=test_reline_key I, [2024-05-05T15:59:03.623356 #823650] INFO -- : [739/885] 864615=test_gem_commands_lock_command I, [2024-05-05T15:59:03.651998 #823650] INFO -- : [740/885] 864615=test_digest I, [2024-05-05T15:59:03.661170 #823650] INFO -- : [741/885] 864615=test_path I, [2024-05-05T15:59:03.662813 #823650] INFO -- : [742/885] 864615=test_rdoc_rd_inline I, [2024-05-05T15:59:03.673067 #823650] INFO -- : [743/885] 864615=test_files_test_1 I, [2024-05-05T15:59:03.686676 #823650] INFO -- : [744/885] 864615=test_dir I, [2024-05-05T15:59:03.907472 #823650] INFO -- : Leaked file descriptor: TestDir#test_home: 11 # I, [2024-05-05T15:59:03.944905 #823650] INFO -- : COMMAND PID USER FD TYPE DEVICE SIZE/OFF NODE NAME I, [2024-05-05T15:59:03.944977 #823650] INFO -- : ruby 864615 opc 11u unix 0x0000000000000000 0t0 2852927023 type=STREAM I, [2024-05-05T15:59:04.136828 #823650] INFO -- : [745/885] 864615=test_rubygems I, [2024-05-05T15:59:04.346499 #823650] INFO -- : [746/885] 864615=test_resolve_symbol I, [2024-05-05T15:59:04.396574 #823650] INFO -- : [747/885] 864615=test_closure I, [2024-05-05T15:59:06.522977 #823650] INFO -- : [748/885] 864616=test_io I, [2024-05-05T15:59:06.922112 #823650] INFO -- : [749/885] 864615=test_uncorrectable_name_check I, [2024-05-05T15:59:06.931768 #823650] INFO -- : [750/885] 864615=test_cgi_modruby I, [2024-05-05T15:59:06.940845 #823650] INFO -- : [751/885] 864615=magic_comment_test I, [2024-05-05T15:59:06.949327 #823650] INFO -- : [752/885] 864615=test_win32ole_variant I, [2024-05-05T15:59:06.956946 #823650] INFO -- : [753/885] 864615=test_printf I, [2024-05-05T15:59:06.972191 #823650] INFO -- : [754/885] 864615=test_x509attr I, [2024-05-05T15:59:07.092277 #823650] INFO -- : [755/885] 864615=test_workspace I, [2024-05-05T15:59:07.103308 #823650] INFO -- : [756/885] 864615=test_etc I, [2024-05-05T15:59:07.263652 #823650] INFO -- : [757/885] 864615=test_gem_commands_rebuild_command I, [2024-05-05T15:59:07.274829 #823650] INFO -- : [758/885] 864615=test_nomethod_error I, [2024-05-05T15:59:07.282237 #823650] INFO -- : [759/885] 864615=test_stat I, [2024-05-05T15:59:07.287253 #823650] INFO -- : [760/885] 864615=test_win32ole_param_event I, [2024-05-05T15:59:07.293977 #823650] INFO -- : [761/885] 864615=test_rdoc_parser I, [2024-05-05T15:59:07.320565 #823650] INFO -- : [762/885] 864615=test_https_proxy I, [2024-05-05T15:59:07.327529 #823650] INFO -- : [763/885] 864615=test_update I, [2024-05-05T15:59:07.334871 #823650] INFO -- : [764/885] 864615=test_cipher I, [2024-05-05T15:59:07.416907 #823650] INFO -- : [765/885] 864615=test_new I, [2024-05-05T15:59:07.428237 #823650] INFO -- : [766/885] 864615=test_gem_source_lock I, [2024-05-05T15:59:07.484137 #823650] INFO -- : [767/885] 864615=test_load I, [2024-05-05T15:59:07.490416 #823650] INFO -- : [768/885] 864615=test_rdoc_rd_inline_parser I, [2024-05-05T15:59:07.519168 #823650] INFO -- : [769/885] 864615=test_win32ole_type I, [2024-05-05T15:59:07.536683 #823650] INFO -- : [770/885] 864615=test_gem_gem_runner I, [2024-05-05T15:59:07.604801 #823650] INFO -- : [771/885] 864615=test_require_lib I, [2024-05-05T15:59:09.126792 #823650] INFO -- : [772/885] 864617=test_metaclass I, [2024-05-05T15:59:09.146279 #823650] INFO -- : [773/885] 864617=test_x509store I, [2024-05-05T15:59:09.653774 #823650] INFO -- : [774/885] 864617=test_rdoc_rd_block_parser I, [2024-05-05T15:59:09.702951 #823650] INFO -- : [775/885] 864617=test_rdoc_generator_pot I, [2024-05-05T15:59:09.711828 #823650] INFO -- : [776/885] 864617=test_rdoc_markup_to_joined_paragraph I, [2024-05-05T15:59:09.721145 #823650] INFO -- : [777/885] 864617=test_rdoc_markup_to_markdown I, [2024-05-05T15:59:09.776732 #823650] INFO -- : [778/885] 864617=test_rdoc_rd I, [2024-05-05T15:59:09.788460 #823650] INFO -- : [779/885] 864617=test_not I, [2024-05-05T15:59:09.798415 #823650] INFO -- : [780/885] 864617=test_cgi_cookie I, [2024-05-05T15:59:09.812610 #823650] INFO -- : [781/885] 864617=test_tracer I, [2024-05-05T15:59:09.813650 #823650] INFO -- : [782/885] 864617=test_rdoc_markup_attribute_manager I, [2024-05-05T15:59:09.870579 #823650] INFO -- : [783/885] 864617=test_wss I, [2024-05-05T15:59:09.884565 #823650] INFO -- : [784/885] 864617=test_option I, [2024-05-05T15:59:10.041572 #823650] INFO -- : [785/885] 864617=test_objectspace I, [2024-05-05T15:59:10.619388 #823650] INFO -- : [786/885] 864615=test_require I, [2024-05-05T15:59:10.959344 #823650] INFO -- : [787/885] 864617=test_my_integer I, [2024-05-05T15:59:10.977314 #823650] INFO -- : [788/885] 864617=test_gem_resolver_composed_set I, [2024-05-05T15:59:10.997493 #823650] INFO -- : [789/885] 864617=test_debugger_integration I, [2024-05-05T15:59:11.032815 #823650] INFO -- : [790/885] 864617=test_integer_comb I, [2024-05-05T15:59:13.223475 #823650] INFO -- : [791/885] 864615=test_bundled_ca I, [2024-05-05T15:59:13.411985 #823650] INFO -- : [792/885] 864617=test_load I, [2024-05-05T15:59:13.420243 #823650] INFO -- : Leaked file descriptor: TestOptionParserLoad#test_load_nothing: 9 # I, [2024-05-05T15:59:13.441903 #823650] INFO -- : COMMAND PID USER FD TYPE DEVICE SIZE/OFF NODE NAME I, [2024-05-05T15:59:13.441974 #823650] INFO -- : ruby 864617 opc 9r REG 252,0 9253600 13705411 /var/lib/sss/mc/passwd I, [2024-05-05T15:59:13.589358 #823650] INFO -- : [793/885] 864617=test_abi I, [2024-05-05T15:59:13.892730 #823650] INFO -- : [794/885] 864617=test_ssl I, [2024-05-05T15:59:15.707437 #823650] INFO -- : [795/885] 864615=test_erb_command I, [2024-05-05T15:59:15.807648 #823650] INFO -- : [796/885] 864615=test_module I, [2024-05-05T15:59:19.672154 #823650] INFO -- : [797/885] 864615=test_gem_security_trust_dir I, [2024-05-05T15:59:19.736297 #823650] INFO -- : [798/885] 864615=test_gem_validator I, [2024-05-05T15:59:19.768054 #823650] INFO -- : [799/885] 864615=test_gem_source_installed I, [2024-05-05T15:59:19.839901 #823650] INFO -- : [800/885] 864615=test_usrmarshal I, [2024-05-05T15:59:19.961099 #823650] INFO -- : [801/885] 864616=test_win32ole_param I, [2024-05-05T15:59:19.966545 #823650] INFO -- : [802/885] 864615=test_key_error I, [2024-05-05T15:59:19.971771 #823650] INFO -- : [803/885] 864616=test_fiber I, [2024-05-05T15:59:19.984738 #823650] INFO -- : [804/885] 864615=test_gem_commands_mirror I, [2024-05-05T15:59:20.032547 #823650] INFO -- : [805/885] 864615=test_engine I, [2024-05-05T15:59:20.529629 #823650] INFO -- : [806/885] 864615=test_lock_native_thread I, [2024-05-05T15:59:20.762231 #823650] INFO -- : [807/885] 864615=test_gem_package_task I, [2024-05-05T15:59:20.775907 #823650] INFO -- : [808/885] 864615=test_resize I, [2024-05-05T15:59:20.831328 #823650] INFO -- : [809/885] 864615=test_cparser I, [2024-05-05T15:59:22.736030 #823650] INFO -- : [810/885] 864615=fuzzer_test I, [2024-05-05T15:59:22.746170 #823650] INFO -- : [811/885] 864615=test_rubyvm I, [2024-05-05T15:59:22.791413 #823650] INFO -- : [812/885] 864615=test_c_struct_entry I, [2024-05-05T15:59:23.549629 #823650] INFO -- : [813/885] 864615=test_struct I, [2024-05-05T15:59:23.557231 #823650] INFO -- : [814/885] 864615=static_inspect_test I, [2024-05-05T15:59:23.564103 #823650] INFO -- : [815/885] 864615=test_custom_command I, [2024-05-05T15:59:23.572657 #823650] INFO -- : [816/885] 864615=test_rdoc_parser_markdown I, [2024-05-05T15:59:23.586187 #823650] INFO -- : [817/885] 864615=test_depth_first I, [2024-05-05T15:59:23.592850 #823650] INFO -- : [818/885] 864615=test_change_word I, [2024-05-05T15:59:23.599276 #823650] INFO -- : [819/885] 864615=test_config I, [2024-05-05T15:59:23.651125 #823650] INFO -- : [820/885] 864615=test_ostruct I, [2024-05-05T15:59:23.784193 #823650] INFO -- : [821/885] 864615=json_generic_object_test I, [2024-05-05T15:59:23.790191 #823650] INFO -- : [822/885] 864615=test_fiddle I, [2024-05-05T15:59:24.005488 #823650] INFO -- : [823/885] 864615=test_date_arith I, [2024-05-05T15:59:24.020409 #823650] INFO -- : [824/885] 864615=test_gem_resolver_vendor_specification I, [2024-05-05T15:59:24.063865 #823650] INFO -- : [825/885] 864615=test_gem_resolver_installed_specification I, [2024-05-05T15:59:24.127983 #823650] INFO -- : [826/885] 864615=test_exception_at_throwing I, [2024-05-05T15:59:24.148065 #823650] INFO -- : [827/885] 864615=test_ractor I, [2024-05-05T15:59:24.184715 #823650] INFO -- : [828/885] 864617=test_stringscanner I, [2024-05-05T15:59:24.209305 #823650] INFO -- : [829/885] 864615=test_signedness I, [2024-05-05T15:59:24.247303 #823650] INFO -- : [830/885] 864617=test_gem_commands_check_command I, [2024-05-05T15:59:24.352909 #823650] INFO -- : [831/885] 864617=test_gem_resolver_git_set I, [2024-05-05T15:59:24.890346 #823650] INFO -- : [832/885] 864617=test_digest I, [2024-05-05T15:59:25.701416 #823650] INFO -- : [833/885] 864617=test_gem_safe_marshal I, [2024-05-05T15:59:26.103022 #823650] INFO -- : [834/885] 864615=test_ractor I, [2024-05-05T15:59:26.166613 #823650] INFO -- : [835/885] 864615=test_httpheader I, [2024-05-05T15:59:26.184760 #823650] INFO -- : [836/885] 864615=test_sexp I, [2024-05-05T15:59:26.202341 #823650] INFO -- : [837/885] 864615=test_rdoc_ri_driver I, [2024-05-05T15:59:26.205925 #823650] INFO -- : [838/885] 864616=test_gem_ext_cargo_builder_link_flag_converter I, [2024-05-05T15:59:26.303410 #823650] INFO -- : [839/885] 864616=test_gem_local_remote_options I, [2024-05-05T15:59:26.378135 #823650] INFO -- : [840/885] 864616=test_rdoc_single_class I, [2024-05-05T15:59:26.391356 #823650] INFO -- : [841/885] 864616=test_dup I, [2024-05-05T15:59:26.549477 #823650] INFO -- : [842/885] 864616=test_acceptable I, [2024-05-05T15:59:26.620703 #823650] INFO -- : [843/885] 864616=test_tmpdir I, [2024-05-05T15:59:26.694322 #823650] INFO -- : [844/885] 864615=test_struct I, [2024-05-05T15:59:26.703400 #823650] INFO -- : [845/885] 864616=test_mutex I, [2024-05-05T15:59:26.924424 #823650] INFO -- : [846/885] 864617=test_rdoc_token_stream I, [2024-05-05T15:59:26.938928 #823650] INFO -- : [847/885] 864617=test_type I, [2024-05-05T15:59:26.947126 #823650] INFO -- : [848/885] 864617=heredoc_dedent_test I, [2024-05-05T15:59:26.952203 #823650] INFO -- : [849/885] 864617=test_logperiod I, [2024-05-05T15:59:26.962715 #823650] INFO -- : [850/885] 864617=test_case_comprehensive I, [2024-05-05T15:59:27.233627 #823650] INFO -- : [851/885] 864615=test_rational2 I, [2024-05-05T15:59:27.244675 #823650] INFO -- : [852/885] 864615=test_placearg I, [2024-05-05T15:59:27.303234 #823650] INFO -- : [853/885] 864615=test_gem_package_tar_header I, [2024-05-05T15:59:27.435635 #823650] INFO -- : [854/885] 864615=test_ssl_session I, [2024-05-05T15:59:27.871334 #823650] INFO -- : [855/885] 864616=test_io_wait_uncommon I, [2024-05-05T15:59:27.885720 #823650] INFO -- : [856/885] 864616=test_continuation I, [2024-05-05T15:59:27.895937 #823650] INFO -- : [857/885] 864616=test_fixnum I, [2024-05-05T15:59:27.920894 #823650] INFO -- : [858/885] 864616=test_signal I, [2024-05-05T15:59:28.262382 #823650] INFO -- : [859/885] 864615=test_gem_silent_ui I, [2024-05-05T15:59:28.364590 #823650] INFO -- : [860/885] 864615=test_gem_ci_detector I, [2024-05-05T15:59:28.372631 #823650] INFO -- : [861/885] 864615=test_completion I, [2024-05-05T15:59:29.174878 #823650] INFO -- : [862/885] 864615=test_file_exhaustive I, [2024-05-05T15:59:29.959085 #823650] INFO -- : [863/885] 864616=test_gem_security_policy I, [2024-05-05T15:59:30.492603 #823650] INFO -- : [864/885] 864616=test_rdoc_markup_document I, [2024-05-05T15:59:30.513662 #823650] INFO -- : [865/885] 864616=test_delete I, [2024-05-05T15:59:30.517611 #823650] INFO -- : [866/885] 864616=parse_stream_test I, [2024-05-05T15:59:30.572991 #823650] INFO -- : [867/885] 864616=test_handle I, [2024-05-05T15:59:31.964589 #823650] INFO -- : [868/885] 864616=test_gem_request_set_gem_dependency_api I, [2024-05-05T15:59:32.385023 #823650] INFO -- : [869/885] 864616=test_name_error_extension I, [2024-05-05T15:59:32.394912 #823650] INFO -- : [870/885] 864616=test_evaluation I, [2024-05-05T15:59:32.406805 #823650] INFO -- : [871/885] 864616=test_protocol I, [2024-05-05T15:59:32.724753 #823650] INFO -- : [872/885] 864616=test_files_test I, [2024-05-05T15:59:32.798665 #823650] INFO -- : [873/885] 864616=test_weakkeymap I, [2024-05-05T15:59:33.403810 #823650] INFO -- : [874/885] 864616=test_rdoc_markup_to_ansi I, [2024-05-05T15:59:33.440901 #823650] INFO -- : [875/885] 864616=test_object_create_start I, [2024-05-05T15:59:33.460373 #823650] INFO -- : [876/885] 864616=test_gem_commands_info_command I, [2024-05-05T15:59:33.488562 #823650] INFO -- : [877/885] 864616=test_https I, [2024-05-05T15:59:33.706277 #823650] INFO -- : [878/885] 864616=test_logdevice I, [2024-05-05T15:59:34.511264 #823650] INFO -- : [879/885] 864616=test_ast I, [2024-05-05T15:59:40.000594 #823650] INFO -- : [880/885] 864615=test_rdoc_markup_paragraph I, [2024-05-05T15:59:40.013367 #823650] INFO -- : [881/885] 864615=test_x509cert I, [2024-05-05T15:59:40.093404 #823650] INFO -- : [882/885] 864615=test_irb I, [2024-05-05T15:59:40.429459 #823650] INFO -- : [883/885] 864615=test_variable_name_check I, [2024-05-05T15:59:40.541831 #823650] INFO -- : [884/885] 864615=test_bn I, [2024-05-05T15:59:40.577756 #823650] INFO -- : [885/885] 864615=test_require_path_check I, [2024-05-05T16:00:19.101806 #823650] INFO -- : Finished tests in 225.353992s, 116.5988 tests/s, 41497.2370 assertions/s. E, [2024-05-05T16:00:19.102049 #823650] ERROR -- : Children under /tmp/rubytest.xtosxr: E, [2024-05-05T16:00:19.102238 #823650] ERROR -- : * drwx------ 4 28 2024-05-05 15:59:07 +0000 gem_rebuild20240505-864615-thkrth/ E, [2024-05-05T16:00:19.102256 #823650] ERROR -- : * drwxrwxr-x 2 40 2024-05-05 15:59:07 +0000 old/ E, [2024-05-05T16:00:19.102292 #823650] ERROR -- : * -rw-rw-r-- 1 4096 2024-05-05 15:59:07 +0000 rebuild_test_gem-1.0.0.gem E, [2024-05-05T16:00:19.102451 #823650] ERROR -- : * drwxrwxr-x 2 40 2024-05-05 15:59:07 +0000 new/ E, [2024-05-05T16:00:19.102467 #823650] ERROR -- : * -rw-rw-r-- 1 4096 2024-05-05 15:59:07 +0000 rebuild_test_gem-1.0.0.gem I, [2024-05-05T16:00:19.108753 #823650] INFO -- : 26276 tests, 9351568 assertions, 0 failures, 0 errors, 320 skips I, [2024-05-05T16:00:19.108798 #823650] INFO -- : I, [2024-05-05T16:00:19.108813 #823650] INFO -- : ruby -v: ruby 3.4.0dev (2024-05-05T15:14:53Z master 6747fbe77d) [aarch64-linux] I, [2024-05-05T16:00:19.110169 #823650] INFO -- : $$$[end] "make yes-test-all TESTOPTS='--stderr-on-failure' TESTS='-j3'" exit with 0. I, [2024-05-05T16:00:19.110329 #823650] INFO -- : $$$[beg] make yes-test-rubyspec MSPECOPT='--error-output stderr --debug -j' TESTS='-j3' I, [2024-05-05T16:00:19.238969 #823650] INFO -- : BASERUBY = /usr/local/bin/ruby --disable=gems I, [2024-05-05T16:00:19.239052 #823650] INFO -- : CC = gcc I, [2024-05-05T16:00:19.239063 #823650] INFO -- : LD = ld I, [2024-05-05T16:00:19.239072 #823650] INFO -- : LDSHARED = gcc -shared I, [2024-05-05T16:00:19.239084 #823650] INFO -- : CFLAGS = -O3 -fno-fast-math -ggdb3 -Wall -Wextra -Wdeprecated-declarations -Wdiv-by-zero -Wduplicated-cond -Wimplicit-function-declaration -Wimplicit-int -Wpointer-arith -Wwrite-strings -Wold-style-definition -Wimplicit-fallthrough=0 -Wmissing-noreturn -Wno-cast-function-type -Wno-constant-logical-operand -Wno-long-long -Wno-missing-field-initializers -Wno-overlength-strings -Wno-packed-bitfield-compat -Wno-parentheses-equality -Wno-self-assign -Wno-tautological-compare -Wno-unused-parameter -Wno-unused-value -Wsuggest-attribute=format -Wsuggest-attribute=noreturn -Wunused-variable -Wmisleading-indentation -Wundef I, [2024-05-05T16:00:19.239094 #823650] INFO -- : XCFLAGS = -U_FORTIFY_SOURCE -D_FORTIFY_SOURCE=2 -fstack-protector-strong -msign-return-address=all -fno-strict-overflow -fvisibility=hidden -fexcess-precision=standard -DRUBY_EXPORT -fPIE -I. -I.ext/include/aarch64-linux -I/home/opc/ruby/src/master/include -I/home/opc/ruby/src/master -I/home/opc/ruby/src/master/prism -I/home/opc/ruby/src/master/enc/unicode/15.0.0 I, [2024-05-05T16:00:19.239103 #823650] INFO -- : CPPFLAGS = I, [2024-05-05T16:00:19.239112 #823650] INFO -- : DLDFLAGS = -Wl,--compress-debug-sections=zlib -fstack-protector-strong -pie I, [2024-05-05T16:00:19.239121 #823650] INFO -- : SOLIBS = -lz -lrt -lrt -ldl -lcrypt -lm -lpthread I, [2024-05-05T16:00:19.239129 #823650] INFO -- : LANG = en_US.UTF-8 I, [2024-05-05T16:00:19.239137 #823650] INFO -- : LC_ALL = I, [2024-05-05T16:00:19.239145 #823650] INFO -- : LC_CTYPE = I, [2024-05-05T16:00:19.239154 #823650] INFO -- : MFLAGS = I, [2024-05-05T16:00:19.239162 #823650] INFO -- : RUSTC = rustc I, [2024-05-05T16:00:19.239171 #823650] INFO -- : YJIT_RUSTC_ARGS = --crate-name=yjit --crate-type=staticlib --edition=2021 -g -C lto=thin -C opt-level=3 -C overflow-checks=on '--out-dir=/home/opc/ruby/build/master/yjit/target/release/' /home/opc/ruby/src/master/yjit/src/lib.rs I, [2024-05-05T16:00:19.240057 #823650] INFO -- : gcc (GCC) 8.5.0 20210514 (Red Hat 8.5.0-10.1.0.1) I, [2024-05-05T16:00:19.240115 #823650] INFO -- : Copyright (C) 2018 Free Software Foundation, Inc. I, [2024-05-05T16:00:19.240126 #823650] INFO -- : This is free software; see the source for copying conditions. There is NO I, [2024-05-05T16:00:19.240136 #823650] INFO -- : warranty; not even for MERCHANTABILITY or FITNESS FOR A PARTICULAR PURPOSE. I, [2024-05-05T16:00:19.240145 #823650] INFO -- : I, [2024-05-05T16:00:19.242252 #823650] INFO -- : generating enc.mk I, [2024-05-05T16:00:19.475839 #823650] INFO -- : making enc I, [2024-05-05T16:00:19.503257 #823650] INFO -- : make[1]: Entering directory '/home/opc/ruby/build/master' I, [2024-05-05T16:00:19.503338 #823650] INFO -- : make[1]: Nothing to be done for 'enc'. I, [2024-05-05T16:00:19.503349 #823650] INFO -- : make[1]: Leaving directory '/home/opc/ruby/build/master' I, [2024-05-05T16:00:19.504116 #823650] INFO -- : making srcs under enc I, [2024-05-05T16:00:19.546218 #823650] INFO -- : make[1]: Entering directory '/home/opc/ruby/build/master' I, [2024-05-05T16:00:19.546296 #823650] INFO -- : make[1]: Nothing to be done for 'srcs'. I, [2024-05-05T16:00:19.546307 #823650] INFO -- : make[1]: Leaving directory '/home/opc/ruby/build/master' I, [2024-05-05T16:00:19.547461 #823650] INFO -- : generating transdb.h I, [2024-05-05T16:00:19.691719 #823650] INFO -- : transdb.h unchanged I, [2024-05-05T16:00:19.693153 #823650] INFO -- : making trans I, [2024-05-05T16:00:19.742082 #823650] INFO -- : make[1]: Entering directory '/home/opc/ruby/build/master' I, [2024-05-05T16:00:19.742161 #823650] INFO -- : make[1]: Nothing to be done for 'trans'. I, [2024-05-05T16:00:19.742172 #823650] INFO -- : make[1]: Leaving directory '/home/opc/ruby/build/master' I, [2024-05-05T16:00:19.742904 #823650] INFO -- : making encs I, [2024-05-05T16:00:19.795828 #823650] INFO -- : make[1]: Entering directory '/home/opc/ruby/build/master' I, [2024-05-05T16:00:19.795909 #823650] INFO -- : make[1]: Nothing to be done for 'encs'. I, [2024-05-05T16:00:19.795920 #823650] INFO -- : make[1]: Leaving directory '/home/opc/ruby/build/master' I, [2024-05-05T16:00:19.798041 #823650] INFO -- : generating makefiles ext/configure-ext.mk I, [2024-05-05T16:00:19.839842 #823650] INFO -- : ext/configure-ext.mk updated I, [2024-05-05T16:00:19.843588 #823650] INFO -- : make[1]: Entering directory '/home/opc/ruby/build/master' I, [2024-05-05T16:00:21.952536 #823650] INFO -- : make[1]: Leaving directory '/home/opc/ruby/build/master' I, [2024-05-05T16:00:21.953277 #823650] INFO -- : generating makefile exts.mk I, [2024-05-05T16:00:22.015401 #823650] INFO -- : exts.mk unchanged I, [2024-05-05T16:00:22.020343 #823650] INFO -- : make[1]: Entering directory '/home/opc/ruby/build/master' I, [2024-05-05T16:00:22.328814 #823650] INFO -- : make[2]: Entering directory '/home/opc/ruby/build/master/ext/coverage' I, [2024-05-05T16:00:22.333655 #823650] INFO -- : make[2]: Leaving directory '/home/opc/ruby/build/master/ext/coverage' I, [2024-05-05T16:00:22.339389 #823650] INFO -- : make[2]: Entering directory '/home/opc/ruby/build/master/ext/date' I, [2024-05-05T16:00:22.344830 #823650] INFO -- : make[2]: Leaving directory '/home/opc/ruby/build/master/ext/date' I, [2024-05-05T16:00:22.348302 #823650] INFO -- : make[2]: Entering directory '/home/opc/ruby/build/master/ext/digest' I, [2024-05-05T16:00:22.357709 #823650] INFO -- : make[2]: Leaving directory '/home/opc/ruby/build/master/ext/digest' I, [2024-05-05T16:00:22.380909 #823650] INFO -- : make[2]: Entering directory '/home/opc/ruby/build/master/ext/digest/sha2' I, [2024-05-05T16:00:22.386022 #823650] INFO -- : make[2]: Leaving directory '/home/opc/ruby/build/master/ext/digest/sha2' I, [2024-05-05T16:00:22.405364 #823650] INFO -- : make[2]: Entering directory '/home/opc/ruby/build/master/ext/fiddle' I, [2024-05-05T16:00:22.415694 #823650] INFO -- : make[2]: Leaving directory '/home/opc/ruby/build/master/ext/fiddle' I, [2024-05-05T16:00:22.420067 #823650] INFO -- : make[2]: Entering directory '/home/opc/ruby/build/master/ext/io/console' I, [2024-05-05T16:00:22.424578 #823650] INFO -- : make[2]: Leaving directory '/home/opc/ruby/build/master/ext/io/console' I, [2024-05-05T16:00:22.435744 #823650] INFO -- : make[2]: Entering directory '/home/opc/ruby/build/master/ext/json' I, [2024-05-05T16:00:22.445460 #823650] INFO -- : make[2]: Leaving directory '/home/opc/ruby/build/master/ext/json' I, [2024-05-05T16:00:22.458900 #823650] INFO -- : make[2]: Entering directory '/home/opc/ruby/build/master/ext/monitor' I, [2024-05-05T16:00:22.463299 #823650] INFO -- : make[2]: Leaving directory '/home/opc/ruby/build/master/ext/monitor' I, [2024-05-05T16:00:22.469521 #823650] INFO -- : make[2]: Entering directory '/home/opc/ruby/build/master/ext/objspace' I, [2024-05-05T16:00:22.475734 #823650] INFO -- : make[2]: Leaving directory '/home/opc/ruby/build/master/ext/objspace' I, [2024-05-05T16:00:22.494790 #823650] INFO -- : make[2]: Entering directory '/home/opc/ruby/build/master/ext/openssl' I, [2024-05-05T16:00:22.516867 #823650] INFO -- : make[2]: Leaving directory '/home/opc/ruby/build/master/ext/openssl' I, [2024-05-05T16:00:22.521232 #823650] INFO -- : make[2]: Entering directory '/home/opc/ruby/build/master/ext/pathname' I, [2024-05-05T16:00:22.526315 #823650] INFO -- : make[2]: Leaving directory '/home/opc/ruby/build/master/ext/pathname' I, [2024-05-05T16:00:22.532619 #823650] INFO -- : make[2]: Entering directory '/home/opc/ruby/build/master/ext/psych' I, [2024-05-05T16:00:22.554291 #823650] INFO -- : make[2]: Leaving directory '/home/opc/ruby/build/master/ext/psych' I, [2024-05-05T16:00:22.558845 #823650] INFO -- : make[2]: Entering directory '/home/opc/ruby/build/master/ext/pty' I, [2024-05-05T16:00:22.563189 #823650] INFO -- : make[2]: Leaving directory '/home/opc/ruby/build/master/ext/pty' I, [2024-05-05T16:00:22.576668 #823650] INFO -- : make[2]: Entering directory '/home/opc/ruby/build/master/ext/ripper' I, [2024-05-05T16:00:22.584619 #823650] INFO -- : make[2]: Leaving directory '/home/opc/ruby/build/master/ext/ripper' I, [2024-05-05T16:00:22.586658 #823650] INFO -- : make[2]: Entering directory '/home/opc/ruby/build/master/ext/rubyvm' I, [2024-05-05T16:00:22.590268 #823650] INFO -- : make[2]: Leaving directory '/home/opc/ruby/build/master/ext/rubyvm' I, [2024-05-05T16:00:22.602523 #823650] INFO -- : make[2]: Entering directory '/home/opc/ruby/build/master/ext/socket' I, [2024-05-05T16:00:22.613403 #823650] INFO -- : make[2]: Leaving directory '/home/opc/ruby/build/master/ext/socket' I, [2024-05-05T16:00:22.629183 #823650] INFO -- : make[2]: Entering directory '/home/opc/ruby/build/master/.bundle/gems/bigdecimal-3.1.7/ext/bigdecimal' I, [2024-05-05T16:00:22.660709 #823650] INFO -- : make[2]: Leaving directory '/home/opc/ruby/build/master/.bundle/gems/bigdecimal-3.1.7/ext/bigdecimal' I, [2024-05-05T16:00:22.663340 #823650] INFO -- : make[2]: Entering directory '/home/opc/ruby/build/master/.bundle/gems/debug-1.9.2/ext/debug' I, [2024-05-05T16:00:22.694436 #823650] INFO -- : make[2]: Leaving directory '/home/opc/ruby/build/master/.bundle/gems/debug-1.9.2/ext/debug' I, [2024-05-05T16:00:22.697149 #823650] INFO -- : make[2]: Entering directory '/home/opc/ruby/build/master/.bundle/gems/nkf-0.2.0/ext/nkf' I, [2024-05-05T16:00:22.728458 #823650] INFO -- : make[2]: Leaving directory '/home/opc/ruby/build/master/.bundle/gems/nkf-0.2.0/ext/nkf' I, [2024-05-05T16:00:22.731072 #823650] INFO -- : make[2]: Entering directory '/home/opc/ruby/build/master/.bundle/gems/racc-1.7.3/ext/racc/cparse' I, [2024-05-05T16:00:22.761918 #823650] INFO -- : make[2]: Leaving directory '/home/opc/ruby/build/master/.bundle/gems/racc-1.7.3/ext/racc/cparse' I, [2024-05-05T16:00:22.764927 #823650] INFO -- : make[2]: Entering directory '/home/opc/ruby/build/master/.bundle/gems/rbs-3.4.4/ext/rbs_extension' I, [2024-05-05T16:00:22.796448 #823650] INFO -- : make[2]: Leaving directory '/home/opc/ruby/build/master/.bundle/gems/rbs-3.4.4/ext/rbs_extension' I, [2024-05-05T16:00:22.799152 #823650] INFO -- : make[2]: Entering directory '/home/opc/ruby/build/master/.bundle/gems/syslog-0.1.2/ext/syslog' I, [2024-05-05T16:00:22.830700 #823650] INFO -- : make[2]: Leaving directory '/home/opc/ruby/build/master/.bundle/gems/syslog-0.1.2/ext/syslog' I, [2024-05-05T16:00:22.869004 #823650] INFO -- : make[2]: Entering directory '/home/opc/ruby/build/master' I, [2024-05-05T16:00:22.954161 #823650] INFO -- : make[2]: 'ruby' is up to date. I, [2024-05-05T16:00:22.954244 #823650] INFO -- : make[2]: Leaving directory '/home/opc/ruby/build/master' I, [2024-05-05T16:00:22.954375 #823650] INFO -- : make[1]: Leaving directory '/home/opc/ruby/build/master' I, [2024-05-05T16:00:22.958889 #823650] INFO -- : make[1]: Entering directory '/home/opc/ruby/build/master' I, [2024-05-05T16:00:22.958959 #823650] INFO -- : make[1]: Nothing to be done for 'note'. I, [2024-05-05T16:00:22.958969 #823650] INFO -- : make[1]: Leaving directory '/home/opc/ruby/build/master' E, [2024-05-05T16:00:23.042750 #823650] ERROR -- : $ /home/opc/ruby/build/master/miniruby -I/home/opc/ruby/src/master/lib /home/opc/ruby/src/master/tool/runruby.rb --archdir=/home/opc/ruby/build/master --extout=.ext -- /home/opc/ruby/src/master/spec/mspec/bin/mspec-run -B /home/opc/ruby/src/master/spec/default.mspec --error-output stderr --debug -fy -o /tmp/rubytest.9h1e5x/1-mspec-multi-0 E, [2024-05-05T16:00:23.043141 #823650] ERROR -- : $ /home/opc/ruby/build/master/miniruby -I/home/opc/ruby/src/master/lib /home/opc/ruby/src/master/tool/runruby.rb --archdir=/home/opc/ruby/build/master --extout=.ext -- /home/opc/ruby/src/master/spec/mspec/bin/mspec-run -B /home/opc/ruby/src/master/spec/default.mspec --error-output stderr --debug -fy -o /tmp/rubytest.9h1e5x/2-mspec-multi-1 E, [2024-05-05T16:00:23.043421 #823650] ERROR -- : $ /home/opc/ruby/build/master/miniruby -I/home/opc/ruby/src/master/lib /home/opc/ruby/src/master/tool/runruby.rb --archdir=/home/opc/ruby/build/master --extout=.ext -- /home/opc/ruby/src/master/spec/mspec/bin/mspec-run -B /home/opc/ruby/src/master/spec/default.mspec --error-output stderr --debug -fy -o /tmp/rubytest.9h1e5x/3-mspec-multi-2 I, [2024-05-05T16:00:23.190122 #823650] INFO -- : ruby 3.4.0dev (2024-05-05T15:14:53Z master 6747fbe77d) [aarch64-linux] I, [2024-05-05T16:00:29.016769 #823650] INFO -- : 0 ......................................................................... I, [2024-05-05T16:00:31.560721 #823650] INFO -- : 73 ......................................................................... I, [2024-05-05T16:00:31.770603 #823650] INFO -- : 146 ......................................................................... I, [2024-05-05T16:00:32.084066 #823650] INFO -- : 219 ......................................................................... I, [2024-05-05T16:00:32.297634 #823650] INFO -- : 292 ......................................................................... I, [2024-05-05T16:00:32.555833 #823650] INFO -- : 365 ......................................................................... I, [2024-05-05T16:00:32.697248 #823650] INFO -- : 438 ......................................................................... I, [2024-05-05T16:00:32.763041 #823650] INFO -- : 511 ......................................................................... I, [2024-05-05T16:00:32.828585 #823650] INFO -- : 584 ......................................................................... I, [2024-05-05T16:00:33.501377 #823650] INFO -- : 657 ......................................................................... I, [2024-05-05T16:00:33.598405 #823650] INFO -- : 730 ......................................................................... I, [2024-05-05T16:00:33.655862 #823650] INFO -- : 803 ......................................................................... I, [2024-05-05T16:00:33.910705 #823650] INFO -- : 876 ......................................................................... I, [2024-05-05T16:00:34.018685 #823650] INFO -- : 949 ......................................................................... I, [2024-05-05T16:00:34.659832 #823650] INFO -- : 1022 ......................................................................... I, [2024-05-05T16:00:37.077242 #823650] INFO -- : 1095 ......................................................................... I, [2024-05-05T16:00:37.933605 #823650] INFO -- : 1168 ......................................................................... I, [2024-05-05T16:00:38.108513 #823650] INFO -- : 1241 ......................................................................... I, [2024-05-05T16:00:38.303610 #823650] INFO -- : 1314 ......................................................................... I, [2024-05-05T16:00:38.405847 #823650] INFO -- : 1387 ......................................................................... I, [2024-05-05T16:00:40.484880 #823650] INFO -- : 1460 ......................................................................... I, [2024-05-05T16:00:44.170088 #823650] INFO -- : 1533 ......................................................................... I, [2024-05-05T16:00:44.345360 #823650] INFO -- : 1606 ......................................................................... I, [2024-05-05T16:00:45.161000 #823650] INFO -- : 1679 ......................................................................... I, [2024-05-05T16:00:45.504862 #823650] INFO -- : 1752 ......................................................................... I, [2024-05-05T16:00:45.819326 #823650] INFO -- : 1825 ......................................................................... I, [2024-05-05T16:00:46.149999 #823650] INFO -- : 1898 ......................................................................... I, [2024-05-05T16:00:46.573672 #823650] INFO -- : 1971 ......................................................................... I, [2024-05-05T16:00:47.126590 #823650] INFO -- : 2044 ......................................................................... I, [2024-05-05T16:00:47.206990 #823650] INFO -- : 2117 ......................................................................... I, [2024-05-05T16:00:47.274156 #823650] INFO -- : 2190 ......................................................................... I, [2024-05-05T16:00:47.328898 #823650] INFO -- : 2263 ......................................................................... I, [2024-05-05T16:00:47.378860 #823650] INFO -- : 2336 ......................................................................... I, [2024-05-05T16:00:47.476098 #823650] INFO -- : 2409 ......................................................................... I, [2024-05-05T16:00:47.767844 #823650] INFO -- : 2482 ......................................................................... I, [2024-05-05T16:00:47.914307 #823650] INFO -- : 2555 ......................................................................... I, [2024-05-05T16:00:49.235834 #823650] INFO -- : 2628 ......................................................................... I, [2024-05-05T16:00:49.518507 #823650] INFO -- : 2701 ......................................................................... I, [2024-05-05T16:00:49.631311 #823650] INFO -- : 2774 ......................................................................... I, [2024-05-05T16:00:49.945790 #823650] INFO -- : 2847 ......................................................................... I, [2024-05-05T16:00:50.215968 #823650] INFO -- : 2920 ......................................................................... I, [2024-05-05T16:00:50.335927 #823650] INFO -- : 2993 ......................................................................... I, [2024-05-05T16:00:50.406270 #823650] INFO -- : 3066 ......................................................................... I, [2024-05-05T16:00:50.467593 #823650] INFO -- : 3139 ......................................................................... I, [2024-05-05T16:00:50.537741 #823650] INFO -- : 3212 ......................................................................... I, [2024-05-05T16:00:50.615451 #823650] INFO -- : 3285 ......................................................................... I, [2024-05-05T16:00:54.433564 #823650] INFO -- : 3358 ........................................................................ I, [2024-05-05T16:00:54.433641 #823650] INFO -- : I, [2024-05-05T16:00:54.433653 #823650] INFO -- : Finished in 31.390770 seconds I, [2024-05-05T16:00:54.433662 #823650] INFO -- : I, [2024-05-05T16:00:54.433670 #823650] INFO -- : 3429 files, 32606 examples, 186164 expectations, 0 failures, 0 errors, 0 tagged I, [2024-05-05T16:00:54.435043 #823650] INFO -- : $$$[end] "make yes-test-rubyspec MSPECOPT='--error-output stderr --debug -j' TESTS='-j3'" exit with 0.