# Logfile created on 2024-05-04 08:57:04 +0000 by logger.rb/v1.5.3 I, [2024-05-04T08:57:04.619508 #3672658] INFO -- : #, @formatter=nil, @logdev=#, @binmode=false, @mon_data=#, @mon_data_owner_object_id=860>>> I, [2024-05-04T08:57:04.619812 #3672658] INFO -- : $$$[beg] make update-unicode -j3 I, [2024-05-04T08:57:04.708748 #3672658] INFO -- : Downloading Unicode emoji 15.0 files... I, [2024-05-04T08:57:04.708881 #3672658] INFO -- : Downloading Unicode emoji 15.0 files... I, [2024-05-04T08:57:04.709269 #3672658] INFO -- : Downloading Unicode emoji 15.0 files... I, [2024-05-04T08:57:04.786088 #3672658] INFO -- : made symlink emoji/15.0/emoji-sequences.txt to /home/opc/ruby/src/master/.downloaded-cache/emoji/15.0/emoji-sequences.txt I, [2024-05-04T08:57:04.786625 #3672658] INFO -- : downloading emoji/15.0/emoji-test.txt ... /home/opc/ruby/src/master/enc/unicode/data/emoji/15.0/emoji-sequences.txt already exists I, [2024-05-04T08:57:04.794074 #3672658] INFO -- : downloading emoji/15.0/emoji-test.txt ... /home/opc/ruby/src/master/enc/unicode/data/emoji/15.0/emoji-sequences.txt already exists E, [2024-05-04T08:57:05.298979 #3672658] ERROR -- : /home/opc/ruby/src/master/tool/downloader.rb:302:in `rescue in download': failed to download emoji/15.0/emoji-test.txt (RuntimeError) E, [2024-05-04T08:57:05.299044 #3672658] ERROR -- : OpenURI::HTTPError: 403 Forbidden: https://www.unicode.org/Public/emoji/15.0/emoji-test.txt E, [2024-05-04T08:57:05.299056 #3672658] ERROR -- : from /home/opc/ruby/src/master/tool/downloader.rb:201:in `download' E, [2024-05-04T08:57:05.299066 #3672658] ERROR -- : from /home/opc/ruby/src/master/tool/downloader.rb:136:in `download' E, [2024-05-04T08:57:05.299074 #3672658] ERROR -- : from /home/opc/ruby/src/master/tool/downloader.rb:482:in `block in
' E, [2024-05-04T08:57:05.299083 #3672658] ERROR -- : from /home/opc/ruby/src/master/tool/downloader.rb:465:in `each' E, [2024-05-04T08:57:05.299091 #3672658] ERROR -- : from /home/opc/ruby/src/master/tool/downloader.rb:465:in `
' E, [2024-05-04T08:57:05.299099 #3672658] ERROR -- : /usr/local/lib/ruby/3.2.0/open-uri.rb:369:in `open_http': 403 Forbidden (OpenURI::HTTPError) E, [2024-05-04T08:57:05.299107 #3672658] ERROR -- : from /usr/local/lib/ruby/3.2.0/open-uri.rb:760:in `buffer_open' E, [2024-05-04T08:57:05.299115 #3672658] ERROR -- : from /usr/local/lib/ruby/3.2.0/open-uri.rb:214:in `block in open_loop' E, [2024-05-04T08:57:05.299123 #3672658] ERROR -- : from /usr/local/lib/ruby/3.2.0/open-uri.rb:212:in `catch' E, [2024-05-04T08:57:05.299131 #3672658] ERROR -- : from /usr/local/lib/ruby/3.2.0/open-uri.rb:212:in `open_loop' E, [2024-05-04T08:57:05.299140 #3672658] ERROR -- : from /usr/local/lib/ruby/3.2.0/open-uri.rb:153:in `open_uri' E, [2024-05-04T08:57:05.299148 #3672658] ERROR -- : from /usr/local/lib/ruby/3.2.0/open-uri.rb:740:in `open' E, [2024-05-04T08:57:05.299159 #3672658] ERROR -- : from /usr/local/lib/ruby/3.2.0/open-uri.rb:748:in `read' E, [2024-05-04T08:57:05.299168 #3672658] ERROR -- : from /home/opc/ruby/src/master/tool/downloader.rb:247:in `block in download' E, [2024-05-04T08:57:05.299176 #3672658] ERROR -- : from /home/opc/ruby/src/master/tool/downloader.rb:378:in `with_retry' E, [2024-05-04T08:57:05.299184 #3672658] ERROR -- : from /home/opc/ruby/src/master/tool/downloader.rb:246:in `download' E, [2024-05-04T08:57:05.299192 #3672658] ERROR -- : from /home/opc/ruby/src/master/tool/downloader.rb:136:in `download' E, [2024-05-04T08:57:05.299200 #3672658] ERROR -- : from /home/opc/ruby/src/master/tool/downloader.rb:482:in `block in
' E, [2024-05-04T08:57:05.299208 #3672658] ERROR -- : from /home/opc/ruby/src/master/tool/downloader.rb:465:in `each' E, [2024-05-04T08:57:05.299216 #3672658] ERROR -- : from /home/opc/ruby/src/master/tool/downloader.rb:465:in `
' E, [2024-05-04T08:57:05.302356 #3672658] ERROR -- : make: *** [uncommon.mk:1787: /home/opc/ruby/src/master/enc/unicode/data/emoji/15.0/emoji-zwj-sequences.txt] Error 1 E, [2024-05-04T08:57:05.302393 #3672658] ERROR -- : make: *** Waiting for unfinished jobs.... E, [2024-05-04T08:57:05.302816 #3672658] ERROR -- : /home/opc/ruby/src/master/tool/downloader.rb:302:in `rescue in download': failed to download emoji/15.0/emoji-test.txt (RuntimeError) E, [2024-05-04T08:57:05.302834 #3672658] ERROR -- : OpenURI::HTTPError: 403 Forbidden: https://www.unicode.org/Public/emoji/15.0/emoji-test.txt E, [2024-05-04T08:57:05.302844 #3672658] ERROR -- : from /home/opc/ruby/src/master/tool/downloader.rb:201:in `download' E, [2024-05-04T08:57:05.302852 #3672658] ERROR -- : from /home/opc/ruby/src/master/tool/downloader.rb:136:in `download' E, [2024-05-04T08:57:05.302860 #3672658] ERROR -- : from /home/opc/ruby/src/master/tool/downloader.rb:482:in `block in
' E, [2024-05-04T08:57:05.302869 #3672658] ERROR -- : from /home/opc/ruby/src/master/tool/downloader.rb:465:in `each' E, [2024-05-04T08:57:05.302877 #3672658] ERROR -- : from /home/opc/ruby/src/master/tool/downloader.rb:465:in `
' E, [2024-05-04T08:57:05.302885 #3672658] ERROR -- : /usr/local/lib/ruby/3.2.0/open-uri.rb:369:in `open_http': 403 Forbidden (OpenURI::HTTPError) E, [2024-05-04T08:57:05.302893 #3672658] ERROR -- : from /usr/local/lib/ruby/3.2.0/open-uri.rb:760:in `buffer_open' E, [2024-05-04T08:57:05.302901 #3672658] ERROR -- : from /usr/local/lib/ruby/3.2.0/open-uri.rb:214:in `block in open_loop' E, [2024-05-04T08:57:05.302909 #3672658] ERROR -- : from /usr/local/lib/ruby/3.2.0/open-uri.rb:212:in `catch' E, [2024-05-04T08:57:05.302917 #3672658] ERROR -- : from /usr/local/lib/ruby/3.2.0/open-uri.rb:212:in `open_loop' E, [2024-05-04T08:57:05.302925 #3672658] ERROR -- : from /usr/local/lib/ruby/3.2.0/open-uri.rb:153:in `open_uri' E, [2024-05-04T08:57:05.302934 #3672658] ERROR -- : from /usr/local/lib/ruby/3.2.0/open-uri.rb:740:in `open' E, [2024-05-04T08:57:05.302942 #3672658] ERROR -- : from /usr/local/lib/ruby/3.2.0/open-uri.rb:748:in `read' E, [2024-05-04T08:57:05.302950 #3672658] ERROR -- : from /home/opc/ruby/src/master/tool/downloader.rb:247:in `block in download' E, [2024-05-04T08:57:05.302958 #3672658] ERROR -- : from /home/opc/ruby/src/master/tool/downloader.rb:378:in `with_retry' E, [2024-05-04T08:57:05.302966 #3672658] ERROR -- : from /home/opc/ruby/src/master/tool/downloader.rb:246:in `download' E, [2024-05-04T08:57:05.302974 #3672658] ERROR -- : from /home/opc/ruby/src/master/tool/downloader.rb:136:in `download' E, [2024-05-04T08:57:05.302982 #3672658] ERROR -- : from /home/opc/ruby/src/master/tool/downloader.rb:482:in `block in
' E, [2024-05-04T08:57:05.302991 #3672658] ERROR -- : from /home/opc/ruby/src/master/tool/downloader.rb:465:in `each' E, [2024-05-04T08:57:05.302999 #3672658] ERROR -- : from /home/opc/ruby/src/master/tool/downloader.rb:465:in `
' E, [2024-05-04T08:57:05.305950 #3672658] ERROR -- : make: *** [uncommon.mk:1787: /home/opc/ruby/src/master/enc/unicode/data/emoji/15.0/emoji-sequences.txt] Error 1 E, [2024-05-04T08:57:05.305990 #3672658] ERROR -- : make: *** Deleting file '/home/opc/ruby/src/master/enc/unicode/data/emoji/15.0/emoji-sequences.txt' E, [2024-05-04T08:57:05.310072 #3672658] ERROR -- : /home/opc/ruby/src/master/tool/downloader.rb:302:in `rescue in download': failed to download emoji/15.0/emoji-test.txt (RuntimeError) E, [2024-05-04T08:57:05.310102 #3672658] ERROR -- : OpenURI::HTTPError: 403 Forbidden: https://www.unicode.org/Public/emoji/15.0/emoji-test.txt E, [2024-05-04T08:57:05.310113 #3672658] ERROR -- : from /home/opc/ruby/src/master/tool/downloader.rb:201:in `download' E, [2024-05-04T08:57:05.310122 #3672658] ERROR -- : from /home/opc/ruby/src/master/tool/downloader.rb:136:in `download' E, [2024-05-04T08:57:05.310131 #3672658] ERROR -- : from /home/opc/ruby/src/master/tool/downloader.rb:482:in `block in
' E, [2024-05-04T08:57:05.310139 #3672658] ERROR -- : from /home/opc/ruby/src/master/tool/downloader.rb:465:in `each' E, [2024-05-04T08:57:05.310147 #3672658] ERROR -- : from /home/opc/ruby/src/master/tool/downloader.rb:465:in `
' E, [2024-05-04T08:57:05.310155 #3672658] ERROR -- : /usr/local/lib/ruby/3.2.0/open-uri.rb:369:in `open_http': 403 Forbidden (OpenURI::HTTPError) E, [2024-05-04T08:57:05.310163 #3672658] ERROR -- : from /usr/local/lib/ruby/3.2.0/open-uri.rb:760:in `buffer_open' E, [2024-05-04T08:57:05.310171 #3672658] ERROR -- : from /usr/local/lib/ruby/3.2.0/open-uri.rb:214:in `block in open_loop' E, [2024-05-04T08:57:05.310179 #3672658] ERROR -- : from /usr/local/lib/ruby/3.2.0/open-uri.rb:212:in `catch' E, [2024-05-04T08:57:05.310187 #3672658] ERROR -- : from /usr/local/lib/ruby/3.2.0/open-uri.rb:212:in `open_loop' E, [2024-05-04T08:57:05.310195 #3672658] ERROR -- : from /usr/local/lib/ruby/3.2.0/open-uri.rb:153:in `open_uri' E, [2024-05-04T08:57:05.310203 #3672658] ERROR -- : from /usr/local/lib/ruby/3.2.0/open-uri.rb:740:in `open' E, [2024-05-04T08:57:05.310211 #3672658] ERROR -- : from /usr/local/lib/ruby/3.2.0/open-uri.rb:748:in `read' E, [2024-05-04T08:57:05.310219 #3672658] ERROR -- : from /home/opc/ruby/src/master/tool/downloader.rb:247:in `block in download' E, [2024-05-04T08:57:05.310227 #3672658] ERROR -- : from /home/opc/ruby/src/master/tool/downloader.rb:378:in `with_retry' E, [2024-05-04T08:57:05.310235 #3672658] ERROR -- : from /home/opc/ruby/src/master/tool/downloader.rb:246:in `download' E, [2024-05-04T08:57:05.310243 #3672658] ERROR -- : from /home/opc/ruby/src/master/tool/downloader.rb:136:in `download' E, [2024-05-04T08:57:05.310252 #3672658] ERROR -- : from /home/opc/ruby/src/master/tool/downloader.rb:482:in `block in
' E, [2024-05-04T08:57:05.310260 #3672658] ERROR -- : from /home/opc/ruby/src/master/tool/downloader.rb:465:in `each' E, [2024-05-04T08:57:05.310268 #3672658] ERROR -- : from /home/opc/ruby/src/master/tool/downloader.rb:465:in `
' E, [2024-05-04T08:57:05.312989 #3672658] ERROR -- : make: *** [uncommon.mk:1787: /home/opc/ruby/src/master/enc/unicode/data/emoji/15.0/emoji-test.txt] Error 1 I, [2024-05-04T08:57:05.313405 #3672658] INFO -- : downloading emoji/15.0/emoji-test.txt ... I, [2024-05-04T08:57:05.313552 #3672658] INFO -- : $$$[end] "make update-unicode -j3" exit with 512. I, [2024-05-04T08:57:05.313580 #3672658] INFO -- : $$$[beg] make update-download -j3 I, [2024-05-04T08:57:05.478832 #3672658] INFO -- : tool/config.guess already exists I, [2024-05-04T08:57:05.478901 #3672658] INFO -- : tool/config.sub already exists I, [2024-05-04T08:57:05.481903 #3672658] INFO -- : Update minitest to ea9caafc0754b1d6236a490d59e624b53209734a I, [2024-05-04T08:57:05.482023 #3672658] INFO -- : Update power_assert to 84e85124c5014a139af39161d484156cfe87a9ed I, [2024-05-04T08:57:05.482261 #3672658] INFO -- : Update rbs to ba7872795d5de04adb8ff500c0e6afdc81a041dd I, [2024-05-04T08:57:05.485650 #3672658] INFO -- : echo ea9caafc0754b1d6236a490d59e624b53209734a | /bin/sh /home/opc/ruby/src/master/tool/ifchange /home/opc/ruby/src/master/.bundle/.timestamp/minitest.revision - I, [2024-05-04T08:57:05.485798 #3672658] INFO -- : echo 84e85124c5014a139af39161d484156cfe87a9ed | /bin/sh /home/opc/ruby/src/master/tool/ifchange /home/opc/ruby/src/master/.bundle/.timestamp/power_assert.revision - I, [2024-05-04T08:57:05.485963 #3672658] INFO -- : echo ba7872795d5de04adb8ff500c0e6afdc81a041dd | /bin/sh /home/opc/ruby/src/master/tool/ifchange /home/opc/ruby/src/master/.bundle/.timestamp/rbs.revision - I, [2024-05-04T08:57:05.491615 #3672658] INFO -- : /home/opc/ruby/src/master/.bundle/.timestamp/minitest.revision unchanged I, [2024-05-04T08:57:05.493242 #3672658] INFO -- : /home/opc/ruby/src/master/.bundle/.timestamp/power_assert.revision unchanged I, [2024-05-04T08:57:05.493763 #3672658] INFO -- : /home/opc/ruby/src/master/.bundle/.timestamp/rbs.revision unchanged I, [2024-05-04T08:57:05.494881 #3672658] INFO -- : Update typeprof to b19a6416da3a05d57fadd6ffdadb382b6d236ca5 I, [2024-05-04T08:57:05.501959 #3672658] INFO -- : echo b19a6416da3a05d57fadd6ffdadb382b6d236ca5 | /bin/sh /home/opc/ruby/src/master/tool/ifchange /home/opc/ruby/src/master/.bundle/.timestamp/typeprof.revision - I, [2024-05-04T08:57:05.507635 #3672658] INFO -- : /home/opc/ruby/src/master/.bundle/.timestamp/typeprof.revision unchanged I, [2024-05-04T08:57:05.583646 #3672658] INFO -- : Building power_assert@84e85124c5014a139af39161d484156cfe87a9ed to /home/opc/ruby/src/master/gems/power_assert-2.0.3.gem I, [2024-05-04T08:57:05.693489 #3672658] INFO -- : Successfully built RubyGem I, [2024-05-04T08:57:05.693547 #3672658] INFO -- : Name: power_assert I, [2024-05-04T08:57:05.693558 #3672658] INFO -- : Version: 2.0.4dev I, [2024-05-04T08:57:05.693567 #3672658] INFO -- : File: power_assert-2.0.4dev.gem I, [2024-05-04T08:57:05.777765 #3672658] INFO -- : $$$[end] "make update-download -j3" exit with 0. I, [2024-05-04T08:57:05.777852 #3672658] INFO -- : $$$[beg] make update-rubyspec -j3 I, [2024-05-04T08:57:05.866674 #3672658] INFO -- : make: Nothing to be done for 'update-rubyspec'. I, [2024-05-04T08:57:05.866866 #3672658] INFO -- : $$$[end] "make update-rubyspec -j3" exit with 0. I, [2024-05-04T08:57:05.866912 #3672658] INFO -- : $$$[beg] make update-src -j3 I, [2024-05-04T08:57:06.784721 #3672658] INFO -- : Already up to date. I, [2024-05-04T08:57:06.799328 #3672658] INFO -- : Latest commit hash = bd42f0898d I, [2024-05-04T08:57:06.799947 #3672658] INFO -- : $$$[end] "make update-src -j3" exit with 0. I, [2024-05-04T08:57:06.799986 #3672658] INFO -- : $$$[beg] make after-update -j3 I, [2024-05-04T08:57:06.902548 #3672658] INFO -- : generating /home/opc/ruby/src/master/ext/ripper/eventids2table.c I, [2024-05-04T08:57:06.909178 #3672658] INFO -- : make[1]: Entering directory '/home/opc/ruby/src/master/ext/ripper' I, [2024-05-04T08:57:06.909241 #3672658] INFO -- : make[1]: Nothing to be done for 'src'. I, [2024-05-04T08:57:06.909253 #3672658] INFO -- : make[1]: Leaving directory '/home/opc/ruby/src/master/ext/ripper' I, [2024-05-04T08:57:06.936852 #3672658] INFO -- : /home/opc/ruby/src/master/revision.h updated I, [2024-05-04T08:57:06.938236 #3672658] INFO -- : generating aarch64-linux-fake.rb I, [2024-05-04T08:57:06.995661 #3672658] INFO -- : aarch64-linux-fake.rb updated I, [2024-05-04T08:57:06.997034 #3672658] INFO -- : generating enc.mk I, [2024-05-04T08:57:07.231057 #3672658] INFO -- : making srcs under enc I, [2024-05-04T08:57:07.272736 #3672658] INFO -- : make[1]: Entering directory '/home/opc/ruby/build/master' I, [2024-05-04T08:57:07.272816 #3672658] INFO -- : make[1]: Nothing to be done for 'srcs'. I, [2024-05-04T08:57:07.272828 #3672658] INFO -- : make[1]: Leaving directory '/home/opc/ruby/build/master' I, [2024-05-04T08:57:07.352996 #3672658] INFO -- : Update minitest to ea9caafc0754b1d6236a490d59e624b53209734a I, [2024-05-04T08:57:07.353353 #3672658] INFO -- : Update power_assert to 84e85124c5014a139af39161d484156cfe87a9ed I, [2024-05-04T08:57:07.353534 #3672658] INFO -- : Update rbs to ba7872795d5de04adb8ff500c0e6afdc81a041dd I, [2024-05-04T08:57:07.356281 #3672658] INFO -- : echo ba7872795d5de04adb8ff500c0e6afdc81a041dd | /bin/sh /home/opc/ruby/src/master/tool/ifchange /home/opc/ruby/src/master/.bundle/.timestamp/rbs.revision - I, [2024-05-04T08:57:07.356604 #3672658] INFO -- : echo ea9caafc0754b1d6236a490d59e624b53209734a | /bin/sh /home/opc/ruby/src/master/tool/ifchange /home/opc/ruby/src/master/.bundle/.timestamp/minitest.revision - I, [2024-05-04T08:57:07.356904 #3672658] INFO -- : echo 84e85124c5014a139af39161d484156cfe87a9ed | /bin/sh /home/opc/ruby/src/master/tool/ifchange /home/opc/ruby/src/master/.bundle/.timestamp/power_assert.revision - I, [2024-05-04T08:57:07.362058 #3672658] INFO -- : /home/opc/ruby/src/master/.bundle/.timestamp/rbs.revision unchanged I, [2024-05-04T08:57:07.362120 #3672658] INFO -- : /home/opc/ruby/src/master/.bundle/.timestamp/minitest.revision unchanged I, [2024-05-04T08:57:07.362898 #3672658] INFO -- : /home/opc/ruby/src/master/.bundle/.timestamp/power_assert.revision unchanged I, [2024-05-04T08:57:07.364408 #3672658] INFO -- : Update typeprof to b19a6416da3a05d57fadd6ffdadb382b6d236ca5 I, [2024-05-04T08:57:07.369258 #3672658] INFO -- : echo b19a6416da3a05d57fadd6ffdadb382b6d236ca5 | /bin/sh /home/opc/ruby/src/master/tool/ifchange /home/opc/ruby/src/master/.bundle/.timestamp/typeprof.revision - I, [2024-05-04T08:57:07.377645 #3672658] INFO -- : /home/opc/ruby/src/master/.bundle/.timestamp/typeprof.revision unchanged I, [2024-05-04T08:57:07.453987 #3672658] INFO -- : Building power_assert@84e85124c5014a139af39161d484156cfe87a9ed to /home/opc/ruby/src/master/gems/power_assert-2.0.3.gem I, [2024-05-04T08:57:07.564734 #3672658] INFO -- : Successfully built RubyGem I, [2024-05-04T08:57:07.564793 #3672658] INFO -- : Name: power_assert I, [2024-05-04T08:57:07.564805 #3672658] INFO -- : Version: 2.0.4dev I, [2024-05-04T08:57:07.564814 #3672658] INFO -- : File: power_assert-2.0.4dev.gem I, [2024-05-04T08:57:07.567176 #3672658] INFO -- : Extracting bundle gem power_assert-2.0.3... I, [2024-05-04T08:57:07.664409 #3672658] INFO -- : Try with hash version of bundled gems instead of gems/power_assert-2.0.3.gem. We don't use this gem with release version of Ruby. I, [2024-05-04T08:57:07.675588 #3672658] INFO -- : Unpacked gems/power_assert-2.0.4dev.gem I, [2024-05-04T08:57:07.677545 #3672658] INFO -- : $$$[end] "make after-update -j3" exit with 0. I, [2024-05-04T08:57:07.677693 #3672658] INFO -- : $$$[beg] make miniruby -j3 I, [2024-05-04T08:57:07.765408 #3672658] INFO -- : BASERUBY = /usr/local/bin/ruby --disable=gems I, [2024-05-04T08:57:07.765477 #3672658] INFO -- : CC = gcc I, [2024-05-04T08:57:07.765487 #3672658] INFO -- : LD = ld I, [2024-05-04T08:57:07.765496 #3672658] INFO -- : LDSHARED = gcc -shared I, [2024-05-04T08:57:07.765505 #3672658] INFO -- : CFLAGS = -O3 -fno-fast-math -ggdb3 -Wall -Wextra -Wdeprecated-declarations -Wdiv-by-zero -Wduplicated-cond -Wimplicit-function-declaration -Wimplicit-int -Wpointer-arith -Wwrite-strings -Wold-style-definition -Wimplicit-fallthrough=0 -Wmissing-noreturn -Wno-cast-function-type -Wno-constant-logical-operand -Wno-long-long -Wno-missing-field-initializers -Wno-overlength-strings -Wno-packed-bitfield-compat -Wno-parentheses-equality -Wno-self-assign -Wno-tautological-compare -Wno-unused-parameter -Wno-unused-value -Wsuggest-attribute=format -Wsuggest-attribute=noreturn -Wunused-variable -Wmisleading-indentation -Wundef I, [2024-05-04T08:57:07.765514 #3672658] INFO -- : XCFLAGS = -U_FORTIFY_SOURCE -D_FORTIFY_SOURCE=2 -fstack-protector-strong -msign-return-address=all -fno-strict-overflow -fvisibility=hidden -fexcess-precision=standard -DRUBY_EXPORT -fPIE -I. -I.ext/include/aarch64-linux -I/home/opc/ruby/src/master/include -I/home/opc/ruby/src/master -I/home/opc/ruby/src/master/prism -I/home/opc/ruby/src/master/enc/unicode/15.0.0 I, [2024-05-04T08:57:07.765523 #3672658] INFO -- : CPPFLAGS = I, [2024-05-04T08:57:07.765531 #3672658] INFO -- : DLDFLAGS = -Wl,--compress-debug-sections=zlib -fstack-protector-strong -pie I, [2024-05-04T08:57:07.765543 #3672658] INFO -- : SOLIBS = -lz -lrt -lrt -ldl -lcrypt -lm -lpthread I, [2024-05-04T08:57:07.765573 #3672658] INFO -- : LANG = en_US.UTF-8 I, [2024-05-04T08:57:07.765583 #3672658] INFO -- : LC_ALL = I, [2024-05-04T08:57:07.765591 #3672658] INFO -- : LC_CTYPE = I, [2024-05-04T08:57:07.765599 #3672658] INFO -- : MFLAGS = -j3 --jobserver-auth=4,5 I, [2024-05-04T08:57:07.765607 #3672658] INFO -- : RUSTC = rustc I, [2024-05-04T08:57:07.765615 #3672658] INFO -- : YJIT_RUSTC_ARGS = --crate-name=yjit --crate-type=staticlib --edition=2021 -g -C lto=thin -C opt-level=3 -C overflow-checks=on '--out-dir=/home/opc/ruby/build/master/yjit/target/release/' /home/opc/ruby/src/master/yjit/src/lib.rs I, [2024-05-04T08:57:07.766248 #3672658] INFO -- : gcc (GCC) 8.5.0 20210514 (Red Hat 8.5.0-10.1.0.1) I, [2024-05-04T08:57:07.766268 #3672658] INFO -- : Copyright (C) 2018 Free Software Foundation, Inc. I, [2024-05-04T08:57:07.766277 #3672658] INFO -- : This is free software; see the source for copying conditions. There is NO I, [2024-05-04T08:57:07.766285 #3672658] INFO -- : warranty; not even for MERCHANTABILITY or FITNESS FOR A PARTICULAR PURPOSE. I, [2024-05-04T08:57:07.766293 #3672658] INFO -- : I, [2024-05-04T08:57:07.791526 #3672658] INFO -- : compiling /home/opc/ruby/src/master/version.c I, [2024-05-04T08:57:07.934265 #3672658] INFO -- : linking miniruby I, [2024-05-04T08:57:08.826521 #3672658] INFO -- : $$$[end] "make miniruby -j3" exit with 0. I, [2024-05-04T08:57:08.826694 #3672658] INFO -- : $$$[beg] make ruby -j3 I, [2024-05-04T08:57:08.914913 #3672658] INFO -- : BASERUBY = /usr/local/bin/ruby --disable=gems I, [2024-05-04T08:57:08.914980 #3672658] INFO -- : CC = gcc I, [2024-05-04T08:57:08.914991 #3672658] INFO -- : LD = ld I, [2024-05-04T08:57:08.914999 #3672658] INFO -- : LDSHARED = gcc -shared I, [2024-05-04T08:57:08.915010 #3672658] INFO -- : CFLAGS = -O3 -fno-fast-math -ggdb3 -Wall -Wextra -Wdeprecated-declarations -Wdiv-by-zero -Wduplicated-cond -Wimplicit-function-declaration -Wimplicit-int -Wpointer-arith -Wwrite-strings -Wold-style-definition -Wimplicit-fallthrough=0 -Wmissing-noreturn -Wno-cast-function-type -Wno-constant-logical-operand -Wno-long-long -Wno-missing-field-initializers -Wno-overlength-strings -Wno-packed-bitfield-compat -Wno-parentheses-equality -Wno-self-assign -Wno-tautological-compare -Wno-unused-parameter -Wno-unused-value -Wsuggest-attribute=format -Wsuggest-attribute=noreturn -Wunused-variable -Wmisleading-indentation -Wundef I, [2024-05-04T08:57:08.915160 #3672658] INFO -- : XCFLAGS = -U_FORTIFY_SOURCE -D_FORTIFY_SOURCE=2 -fstack-protector-strong -msign-return-address=all -fno-strict-overflow -fvisibility=hidden -fexcess-precision=standard -DRUBY_EXPORT -fPIE -I. -I.ext/include/aarch64-linux -I/home/opc/ruby/src/master/include -I/home/opc/ruby/src/master -I/home/opc/ruby/src/master/prism -I/home/opc/ruby/src/master/enc/unicode/15.0.0 I, [2024-05-04T08:57:08.915170 #3672658] INFO -- : CPPFLAGS = I, [2024-05-04T08:57:08.915179 #3672658] INFO -- : DLDFLAGS = -Wl,--compress-debug-sections=zlib -fstack-protector-strong -pie I, [2024-05-04T08:57:08.915188 #3672658] INFO -- : SOLIBS = -lz -lrt -lrt -ldl -lcrypt -lm -lpthread I, [2024-05-04T08:57:08.915196 #3672658] INFO -- : LANG = en_US.UTF-8 I, [2024-05-04T08:57:08.915204 #3672658] INFO -- : LC_ALL = I, [2024-05-04T08:57:08.915212 #3672658] INFO -- : LC_CTYPE = I, [2024-05-04T08:57:08.915220 #3672658] INFO -- : MFLAGS = -j3 --jobserver-auth=4,5 I, [2024-05-04T08:57:08.915228 #3672658] INFO -- : RUSTC = rustc I, [2024-05-04T08:57:08.915236 #3672658] INFO -- : YJIT_RUSTC_ARGS = --crate-name=yjit --crate-type=staticlib --edition=2021 -g -C lto=thin -C opt-level=3 -C overflow-checks=on '--out-dir=/home/opc/ruby/build/master/yjit/target/release/' /home/opc/ruby/src/master/yjit/src/lib.rs I, [2024-05-04T08:57:08.915883 #3672658] INFO -- : gcc (GCC) 8.5.0 20210514 (Red Hat 8.5.0-10.1.0.1) I, [2024-05-04T08:57:08.915898 #3672658] INFO -- : Copyright (C) 2018 Free Software Foundation, Inc. I, [2024-05-04T08:57:08.915911 #3672658] INFO -- : This is free software; see the source for copying conditions. There is NO I, [2024-05-04T08:57:08.915919 #3672658] INFO -- : warranty; not even for MERCHANTABILITY or FITNESS FOR A PARTICULAR PURPOSE. I, [2024-05-04T08:57:08.915927 #3672658] INFO -- : I, [2024-05-04T08:57:09.094725 #3672658] INFO -- : builtin_binary.inc updated I, [2024-05-04T08:57:09.099194 #3672658] INFO -- : c5234a9416e4f20f175185e840b25b0f08674d14078ed7083f37e655458e3ca9 builtin_binary.inc I, [2024-05-04T08:57:09.100154 #3672658] INFO -- : compiling /home/opc/ruby/src/master/builtin.c I, [2024-05-04T08:57:09.424607 #3672658] INFO -- : linking static-library libruby-static.a I, [2024-05-04T08:57:12.158704 #3672658] INFO -- : linking ruby I, [2024-05-04T08:57:13.062062 #3672658] INFO -- : $$$[end] "make ruby -j3" exit with 0. I, [2024-05-04T08:57:13.062228 #3672658] INFO -- : $$$[beg] make all -j3 I, [2024-05-04T08:57:13.150229 #3672658] INFO -- : BASERUBY = /usr/local/bin/ruby --disable=gems I, [2024-05-04T08:57:13.150298 #3672658] INFO -- : CC = gcc I, [2024-05-04T08:57:13.150309 #3672658] INFO -- : LD = ld I, [2024-05-04T08:57:13.150320 #3672658] INFO -- : LDSHARED = gcc -shared I, [2024-05-04T08:57:13.150329 #3672658] INFO -- : CFLAGS = -O3 -fno-fast-math -ggdb3 -Wall -Wextra -Wdeprecated-declarations -Wdiv-by-zero -Wduplicated-cond -Wimplicit-function-declaration -Wimplicit-int -Wpointer-arith -Wwrite-strings -Wold-style-definition -Wimplicit-fallthrough=0 -Wmissing-noreturn -Wno-cast-function-type -Wno-constant-logical-operand -Wno-long-long -Wno-missing-field-initializers -Wno-overlength-strings -Wno-packed-bitfield-compat -Wno-parentheses-equality -Wno-self-assign -Wno-tautological-compare -Wno-unused-parameter -Wno-unused-value -Wsuggest-attribute=format -Wsuggest-attribute=noreturn -Wunused-variable -Wmisleading-indentation -Wundef I, [2024-05-04T08:57:13.150339 #3672658] INFO -- : XCFLAGS = -U_FORTIFY_SOURCE -D_FORTIFY_SOURCE=2 -fstack-protector-strong -msign-return-address=all -fno-strict-overflow -fvisibility=hidden -fexcess-precision=standard -DRUBY_EXPORT -fPIE -I. -I.ext/include/aarch64-linux -I/home/opc/ruby/src/master/include -I/home/opc/ruby/src/master -I/home/opc/ruby/src/master/prism -I/home/opc/ruby/src/master/enc/unicode/15.0.0 I, [2024-05-04T08:57:13.150347 #3672658] INFO -- : CPPFLAGS = I, [2024-05-04T08:57:13.150355 #3672658] INFO -- : DLDFLAGS = -Wl,--compress-debug-sections=zlib -fstack-protector-strong -pie I, [2024-05-04T08:57:13.150365 #3672658] INFO -- : SOLIBS = -lz -lrt -lrt -ldl -lcrypt -lm -lpthread I, [2024-05-04T08:57:13.150373 #3672658] INFO -- : LANG = en_US.UTF-8 I, [2024-05-04T08:57:13.150381 #3672658] INFO -- : LC_ALL = I, [2024-05-04T08:57:13.150389 #3672658] INFO -- : LC_CTYPE = I, [2024-05-04T08:57:13.150397 #3672658] INFO -- : MFLAGS = -j3 --jobserver-auth=4,5 I, [2024-05-04T08:57:13.150405 #3672658] INFO -- : RUSTC = rustc I, [2024-05-04T08:57:13.150413 #3672658] INFO -- : YJIT_RUSTC_ARGS = --crate-name=yjit --crate-type=staticlib --edition=2021 -g -C lto=thin -C opt-level=3 -C overflow-checks=on '--out-dir=/home/opc/ruby/build/master/yjit/target/release/' /home/opc/ruby/src/master/yjit/src/lib.rs I, [2024-05-04T08:57:13.151165 #3672658] INFO -- : gcc (GCC) 8.5.0 20210514 (Red Hat 8.5.0-10.1.0.1) I, [2024-05-04T08:57:13.151201 #3672658] INFO -- : Copyright (C) 2018 Free Software Foundation, Inc. I, [2024-05-04T08:57:13.151211 #3672658] INFO -- : This is free software; see the source for copying conditions. There is NO I, [2024-05-04T08:57:13.151220 #3672658] INFO -- : warranty; not even for MERCHANTABILITY or FITNESS FOR A PARTICULAR PURPOSE. I, [2024-05-04T08:57:13.151229 #3672658] INFO -- : I, [2024-05-04T08:57:13.184692 #3672658] INFO -- : generating enc.mk I, [2024-05-04T08:57:13.418216 #3672658] INFO -- : making srcs under enc I, [2024-05-04T08:57:13.418287 #3672658] INFO -- : making enc I, [2024-05-04T08:57:13.445809 #3672658] INFO -- : make[1]: Entering directory '/home/opc/ruby/build/master' I, [2024-05-04T08:57:13.445880 #3672658] INFO -- : make[1]: Nothing to be done for 'enc'. I, [2024-05-04T08:57:13.445891 #3672658] INFO -- : make[1]: Leaving directory '/home/opc/ruby/build/master' I, [2024-05-04T08:57:13.460400 #3672658] INFO -- : make[1]: Entering directory '/home/opc/ruby/build/master' I, [2024-05-04T08:57:13.460452 #3672658] INFO -- : make[1]: Nothing to be done for 'srcs'. I, [2024-05-04T08:57:13.460463 #3672658] INFO -- : make[1]: Leaving directory '/home/opc/ruby/build/master' I, [2024-05-04T08:57:13.461405 #3672658] INFO -- : generating transdb.h I, [2024-05-04T08:57:13.604284 #3672658] INFO -- : transdb.h unchanged I, [2024-05-04T08:57:13.605625 #3672658] INFO -- : generating makefiles ext/configure-ext.mk I, [2024-05-04T08:57:13.605732 #3672658] INFO -- : making trans I, [2024-05-04T08:57:13.644514 #3672658] INFO -- : ext/configure-ext.mk updated I, [2024-05-04T08:57:13.647471 #3672658] INFO -- : make[1]: Entering directory '/home/opc/ruby/build/master' I, [2024-05-04T08:57:13.654719 #3672658] INFO -- : make[1]: Entering directory '/home/opc/ruby/build/master' I, [2024-05-04T08:57:13.654774 #3672658] INFO -- : make[1]: Nothing to be done for 'trans'. I, [2024-05-04T08:57:13.654787 #3672658] INFO -- : make[1]: Leaving directory '/home/opc/ruby/build/master' I, [2024-05-04T08:57:14.326823 #3672658] INFO -- : making encs I, [2024-05-04T08:57:14.370053 #3672658] INFO -- : make[1]: Leaving directory '/home/opc/ruby/build/master' I, [2024-05-04T08:57:14.370863 #3672658] INFO -- : generating makefile exts.mk I, [2024-05-04T08:57:14.385863 #3672658] INFO -- : make[1]: Entering directory '/home/opc/ruby/build/master' I, [2024-05-04T08:57:14.385920 #3672658] INFO -- : make[1]: Nothing to be done for 'encs'. I, [2024-05-04T08:57:14.385931 #3672658] INFO -- : make[1]: Leaving directory '/home/opc/ruby/build/master' I, [2024-05-04T08:57:14.430454 #3672658] INFO -- : exts.mk unchanged I, [2024-05-04T08:57:14.435357 #3672658] INFO -- : make[1]: Entering directory '/home/opc/ruby/build/master' I, [2024-05-04T08:57:14.540644 #3672658] INFO -- : make[2]: Entering directory '/home/opc/ruby/build/master/ext/coverage' I, [2024-05-04T08:57:14.542719 #3672658] INFO -- : make[2]: Entering directory '/home/opc/ruby/build/master/ext/digest' I, [2024-05-04T08:57:14.544092 #3672658] INFO -- : make[2]: Entering directory '/home/opc/ruby/build/master/ext/date' I, [2024-05-04T08:57:14.547452 #3672658] INFO -- : make[2]: Leaving directory '/home/opc/ruby/build/master/ext/coverage' I, [2024-05-04T08:57:14.549485 #3672658] INFO -- : make[2]: Leaving directory '/home/opc/ruby/build/master/ext/date' I, [2024-05-04T08:57:14.552212 #3672658] INFO -- : make[2]: Leaving directory '/home/opc/ruby/build/master/ext/digest' I, [2024-05-04T08:57:14.558380 #3672658] INFO -- : make[2]: Entering directory '/home/opc/ruby/build/master/ext/io/console' I, [2024-05-04T08:57:14.559352 #3672658] INFO -- : make[2]: Entering directory '/home/opc/ruby/build/master/ext/fiddle' I, [2024-05-04T08:57:14.564352 #3672658] INFO -- : make[2]: Leaving directory '/home/opc/ruby/build/master/ext/io/console' I, [2024-05-04T08:57:14.566405 #3672658] INFO -- : make[2]: Entering directory '/home/opc/ruby/build/master/ext/json' I, [2024-05-04T08:57:14.567427 #3672658] INFO -- : make[2]: Leaving directory '/home/opc/ruby/build/master/ext/fiddle' I, [2024-05-04T08:57:14.568851 #3672658] INFO -- : make[2]: Entering directory '/home/opc/ruby/build/master/ext/monitor' I, [2024-05-04T08:57:14.574332 #3672658] INFO -- : make[2]: Leaving directory '/home/opc/ruby/build/master/ext/json' I, [2024-05-04T08:57:14.574602 #3672658] INFO -- : make[2]: Entering directory '/home/opc/ruby/build/master/ext/objspace' I, [2024-05-04T08:57:14.574888 #3672658] INFO -- : make[2]: Leaving directory '/home/opc/ruby/build/master/ext/monitor' I, [2024-05-04T08:57:14.579039 #3672658] INFO -- : make[2]: Entering directory '/home/opc/ruby/build/master/ext/pathname' I, [2024-05-04T08:57:14.580529 #3672658] INFO -- : make[2]: Leaving directory '/home/opc/ruby/build/master/ext/objspace' I, [2024-05-04T08:57:14.587626 #3672658] INFO -- : make[2]: Leaving directory '/home/opc/ruby/build/master/ext/pathname' I, [2024-05-04T08:57:14.587688 #3672658] INFO -- : make[2]: Entering directory '/home/opc/ruby/build/master/ext/psych' I, [2024-05-04T08:57:14.591978 #3672658] INFO -- : make[2]: Entering directory '/home/opc/ruby/build/master/ext/pty' I, [2024-05-04T08:57:14.593528 #3672658] INFO -- : make[2]: Entering directory '/home/opc/ruby/build/master/ext/openssl' I, [2024-05-04T08:57:14.602110 #3672658] INFO -- : make[2]: Leaving directory '/home/opc/ruby/build/master/ext/pty' I, [2024-05-04T08:57:14.609255 #3672658] INFO -- : make[2]: Leaving directory '/home/opc/ruby/build/master/ext/psych' I, [2024-05-04T08:57:14.611109 #3672658] INFO -- : make[2]: Entering directory '/home/opc/ruby/build/master/ext/rubyvm' I, [2024-05-04T08:57:14.614175 #3672658] INFO -- : make[2]: Leaving directory '/home/opc/ruby/build/master/ext/openssl' I, [2024-05-04T08:57:14.616616 #3672658] INFO -- : make[2]: Entering directory '/home/opc/ruby/build/master/ext/ripper' I, [2024-05-04T08:57:14.617537 #3672658] INFO -- : make[2]: Leaving directory '/home/opc/ruby/build/master/ext/rubyvm' I, [2024-05-04T08:57:14.623619 #3672658] INFO -- : make[2]: Leaving directory '/home/opc/ruby/build/master/ext/ripper' I, [2024-05-04T08:57:14.626568 #3672658] INFO -- : make[2]: Entering directory '/home/opc/ruby/build/master/ext/socket' I, [2024-05-04T08:57:14.630457 #3672658] INFO -- : make[2]: Entering directory '/home/opc/ruby/build/master/.bundle/gems/bigdecimal-3.1.7/ext/bigdecimal' I, [2024-05-04T08:57:14.630496 #3672658] INFO -- : make[2]: Entering directory '/home/opc/ruby/build/master/.bundle/gems/debug-1.9.2/ext/debug' I, [2024-05-04T08:57:14.637273 #3672658] INFO -- : make[2]: Leaving directory '/home/opc/ruby/build/master/ext/socket' I, [2024-05-04T08:57:14.639556 #3672658] INFO -- : make[2]: Entering directory '/home/opc/ruby/build/master/.bundle/gems/nkf-0.2.0/ext/nkf' I, [2024-05-04T08:57:14.661720 #3672658] INFO -- : make[2]: Leaving directory '/home/opc/ruby/build/master/.bundle/gems/debug-1.9.2/ext/debug' I, [2024-05-04T08:57:14.663023 #3672658] INFO -- : make[2]: Leaving directory '/home/opc/ruby/build/master/.bundle/gems/bigdecimal-3.1.7/ext/bigdecimal' I, [2024-05-04T08:57:14.664363 #3672658] INFO -- : make[2]: Entering directory '/home/opc/ruby/build/master/.bundle/gems/racc-1.7.3/ext/racc/cparse' I, [2024-05-04T08:57:14.665934 #3672658] INFO -- : make[2]: Entering directory '/home/opc/ruby/build/master/.bundle/gems/rbs-3.4.4/ext/rbs_extension' I, [2024-05-04T08:57:14.671512 #3672658] INFO -- : make[2]: Leaving directory '/home/opc/ruby/build/master/.bundle/gems/nkf-0.2.0/ext/nkf' I, [2024-05-04T08:57:14.674225 #3672658] INFO -- : make[2]: Entering directory '/home/opc/ruby/build/master/.bundle/gems/syslog-0.1.2/ext/syslog' I, [2024-05-04T08:57:14.695603 #3672658] INFO -- : make[2]: Leaving directory '/home/opc/ruby/build/master/.bundle/gems/racc-1.7.3/ext/racc/cparse' I, [2024-05-04T08:57:14.700706 #3672658] INFO -- : make[2]: Leaving directory '/home/opc/ruby/build/master/.bundle/gems/rbs-3.4.4/ext/rbs_extension' I, [2024-05-04T08:57:14.708564 #3672658] INFO -- : make[2]: Leaving directory '/home/opc/ruby/build/master/.bundle/gems/syslog-0.1.2/ext/syslog' I, [2024-05-04T08:57:14.712633 #3672658] INFO -- : make[2]: Entering directory '/home/opc/ruby/build/master/ext/digest/sha2' I, [2024-05-04T08:57:14.717251 #3672658] INFO -- : make[2]: Leaving directory '/home/opc/ruby/build/master/ext/digest/sha2' I, [2024-05-04T08:57:14.755109 #3672658] INFO -- : make[2]: Entering directory '/home/opc/ruby/build/master' I, [2024-05-04T08:57:14.837792 #3672658] INFO -- : make[2]: 'ruby' is up to date. I, [2024-05-04T08:57:14.837867 #3672658] INFO -- : make[2]: Leaving directory '/home/opc/ruby/build/master' I, [2024-05-04T08:57:14.837991 #3672658] INFO -- : make[1]: Leaving directory '/home/opc/ruby/build/master' I, [2024-05-04T08:57:14.842315 #3672658] INFO -- : make[1]: Entering directory '/home/opc/ruby/build/master' I, [2024-05-04T08:57:14.842345 #3672658] INFO -- : make[1]: Nothing to be done for 'note'. I, [2024-05-04T08:57:14.842355 #3672658] INFO -- : make[1]: Leaving directory '/home/opc/ruby/build/master' I, [2024-05-04T08:57:14.842671 #3672658] INFO -- : $$$[end] "make all -j3" exit with 0. I, [2024-05-04T08:57:14.842816 #3672658] INFO -- : $$$[beg] make install -j3 I, [2024-05-04T08:57:14.936253 #3672658] INFO -- : Update minitest to ea9caafc0754b1d6236a490d59e624b53209734a I, [2024-05-04T08:57:14.936445 #3672658] INFO -- : Update power_assert to 84e85124c5014a139af39161d484156cfe87a9ed I, [2024-05-04T08:57:14.936707 #3672658] INFO -- : Update rbs to ba7872795d5de04adb8ff500c0e6afdc81a041dd I, [2024-05-04T08:57:14.939341 #3672658] INFO -- : echo ea9caafc0754b1d6236a490d59e624b53209734a | /bin/sh /home/opc/ruby/src/master/tool/ifchange /home/opc/ruby/src/master/.bundle/.timestamp/minitest.revision - I, [2024-05-04T08:57:14.939556 #3672658] INFO -- : echo 84e85124c5014a139af39161d484156cfe87a9ed | /bin/sh /home/opc/ruby/src/master/tool/ifchange /home/opc/ruby/src/master/.bundle/.timestamp/power_assert.revision - I, [2024-05-04T08:57:14.939685 #3672658] INFO -- : echo ba7872795d5de04adb8ff500c0e6afdc81a041dd | /bin/sh /home/opc/ruby/src/master/tool/ifchange /home/opc/ruby/src/master/.bundle/.timestamp/rbs.revision - I, [2024-05-04T08:57:14.944905 #3672658] INFO -- : /home/opc/ruby/src/master/.bundle/.timestamp/minitest.revision unchanged I, [2024-05-04T08:57:14.945585 #3672658] INFO -- : /home/opc/ruby/src/master/.bundle/.timestamp/power_assert.revision unchanged I, [2024-05-04T08:57:14.946124 #3672658] INFO -- : /home/opc/ruby/src/master/.bundle/.timestamp/rbs.revision unchanged I, [2024-05-04T08:57:14.948369 #3672658] INFO -- : Update typeprof to b19a6416da3a05d57fadd6ffdadb382b6d236ca5 I, [2024-05-04T08:57:14.949397 #3672658] INFO -- : BASERUBY = /usr/local/bin/ruby --disable=gems I, [2024-05-04T08:57:14.949426 #3672658] INFO -- : CC = gcc I, [2024-05-04T08:57:14.949437 #3672658] INFO -- : LD = ld I, [2024-05-04T08:57:14.949448 #3672658] INFO -- : LDSHARED = gcc -shared I, [2024-05-04T08:57:14.949457 #3672658] INFO -- : CFLAGS = -O3 -fno-fast-math -ggdb3 -Wall -Wextra -Wdeprecated-declarations -Wdiv-by-zero -Wduplicated-cond -Wimplicit-function-declaration -Wimplicit-int -Wpointer-arith -Wwrite-strings -Wold-style-definition -Wimplicit-fallthrough=0 -Wmissing-noreturn -Wno-cast-function-type -Wno-constant-logical-operand -Wno-long-long -Wno-missing-field-initializers -Wno-overlength-strings -Wno-packed-bitfield-compat -Wno-parentheses-equality -Wno-self-assign -Wno-tautological-compare -Wno-unused-parameter -Wno-unused-value -Wsuggest-attribute=format -Wsuggest-attribute=noreturn -Wunused-variable -Wmisleading-indentation -Wundef I, [2024-05-04T08:57:14.949467 #3672658] INFO -- : XCFLAGS = -U_FORTIFY_SOURCE -D_FORTIFY_SOURCE=2 -fstack-protector-strong -msign-return-address=all -fno-strict-overflow -fvisibility=hidden -fexcess-precision=standard -DRUBY_EXPORT -fPIE -I. -I.ext/include/aarch64-linux -I/home/opc/ruby/src/master/include -I/home/opc/ruby/src/master -I/home/opc/ruby/src/master/prism -I/home/opc/ruby/src/master/enc/unicode/15.0.0 I, [2024-05-04T08:57:14.949496 #3672658] INFO -- : CPPFLAGS = I, [2024-05-04T08:57:14.949505 #3672658] INFO -- : DLDFLAGS = -Wl,--compress-debug-sections=zlib -fstack-protector-strong -pie I, [2024-05-04T08:57:14.949513 #3672658] INFO -- : SOLIBS = -lz -lrt -lrt -ldl -lcrypt -lm -lpthread I, [2024-05-04T08:57:14.949521 #3672658] INFO -- : LANG = en_US.UTF-8 I, [2024-05-04T08:57:14.949529 #3672658] INFO -- : LC_ALL = I, [2024-05-04T08:57:14.949537 #3672658] INFO -- : LC_CTYPE = I, [2024-05-04T08:57:14.949544 #3672658] INFO -- : MFLAGS = -j3 --jobserver-auth=4,5 I, [2024-05-04T08:57:14.949554 #3672658] INFO -- : RUSTC = rustc I, [2024-05-04T08:57:14.949562 #3672658] INFO -- : YJIT_RUSTC_ARGS = --crate-name=yjit --crate-type=staticlib --edition=2021 -g -C lto=thin -C opt-level=3 -C overflow-checks=on '--out-dir=/home/opc/ruby/build/master/yjit/target/release/' /home/opc/ruby/src/master/yjit/src/lib.rs I, [2024-05-04T08:57:14.981475 #3672658] INFO -- : gcc (GCC) 8.5.0 20210514 (Red Hat 8.5.0-10.1.0.1) I, [2024-05-04T08:57:14.981542 #3672658] INFO -- : Copyright (C) 2018 Free Software Foundation, Inc. I, [2024-05-04T08:57:14.981552 #3672658] INFO -- : This is free software; see the source for copying conditions. There is NO I, [2024-05-04T08:57:14.981562 #3672658] INFO -- : warranty; not even for MERCHANTABILITY or FITNESS FOR A PARTICULAR PURPOSE. I, [2024-05-04T08:57:14.981570 #3672658] INFO -- : I, [2024-05-04T08:57:14.983525 #3672658] INFO -- : generating enc.mk I, [2024-05-04T08:57:14.986724 #3672658] INFO -- : echo b19a6416da3a05d57fadd6ffdadb382b6d236ca5 | /bin/sh /home/opc/ruby/src/master/tool/ifchange /home/opc/ruby/src/master/.bundle/.timestamp/typeprof.revision - I, [2024-05-04T08:57:14.994711 #3672658] INFO -- : /home/opc/ruby/src/master/.bundle/.timestamp/typeprof.revision unchanged I, [2024-05-04T08:57:15.093051 #3672658] INFO -- : Building power_assert@84e85124c5014a139af39161d484156cfe87a9ed to /home/opc/ruby/src/master/gems/power_assert-2.0.3.gem I, [2024-05-04T08:57:15.211082 #3672658] INFO -- : Successfully built RubyGem I, [2024-05-04T08:57:15.211141 #3672658] INFO -- : Name: power_assert I, [2024-05-04T08:57:15.211153 #3672658] INFO -- : Version: 2.0.4dev I, [2024-05-04T08:57:15.211162 #3672658] INFO -- : File: power_assert-2.0.4dev.gem I, [2024-05-04T08:57:15.213449 #3672658] INFO -- : Extracting bundle gem power_assert-2.0.3... I, [2024-05-04T08:57:15.303105 #3672658] INFO -- : making srcs under enc I, [2024-05-04T08:57:15.303334 #3672658] INFO -- : making enc I, [2024-05-04T08:57:15.311114 #3672658] INFO -- : Try with hash version of bundled gems instead of gems/power_assert-2.0.3.gem. We don't use this gem with release version of Ruby. I, [2024-05-04T08:57:15.321790 #3672658] INFO -- : Unpacked gems/power_assert-2.0.4dev.gem I, [2024-05-04T08:57:15.331353 #3672658] INFO -- : make[1]: Entering directory '/home/opc/ruby/build/master' I, [2024-05-04T08:57:15.331400 #3672658] INFO -- : make[1]: Nothing to be done for 'enc'. I, [2024-05-04T08:57:15.331412 #3672658] INFO -- : make[1]: Leaving directory '/home/opc/ruby/build/master' I, [2024-05-04T08:57:15.345604 #3672658] INFO -- : make[1]: Entering directory '/home/opc/ruby/build/master' I, [2024-05-04T08:57:15.345643 #3672658] INFO -- : make[1]: Nothing to be done for 'srcs'. I, [2024-05-04T08:57:15.345655 #3672658] INFO -- : make[1]: Leaving directory '/home/opc/ruby/build/master' I, [2024-05-04T08:57:15.346487 #3672658] INFO -- : generating transdb.h I, [2024-05-04T08:57:15.491428 #3672658] INFO -- : transdb.h unchanged I, [2024-05-04T08:57:15.492886 #3672658] INFO -- : generating makefiles ext/configure-ext.mk I, [2024-05-04T08:57:15.493178 #3672658] INFO -- : making trans I, [2024-05-04T08:57:15.532020 #3672658] INFO -- : ext/configure-ext.mk unchanged I, [2024-05-04T08:57:15.535055 #3672658] INFO -- : make[1]: Entering directory '/home/opc/ruby/build/master' I, [2024-05-04T08:57:15.541389 #3672658] INFO -- : make[1]: Entering directory '/home/opc/ruby/build/master' I, [2024-05-04T08:57:15.541446 #3672658] INFO -- : make[1]: Nothing to be done for 'trans'. I, [2024-05-04T08:57:15.541459 #3672658] INFO -- : make[1]: Leaving directory '/home/opc/ruby/build/master' I, [2024-05-04T08:57:16.213930 #3672658] INFO -- : making encs I, [2024-05-04T08:57:16.266521 #3672658] INFO -- : make[1]: Leaving directory '/home/opc/ruby/build/master' I, [2024-05-04T08:57:16.267212 #3672658] INFO -- : generating makefile exts.mk I, [2024-05-04T08:57:16.267433 #3672658] INFO -- : make[1]: Entering directory '/home/opc/ruby/build/master' I, [2024-05-04T08:57:16.267460 #3672658] INFO -- : make[1]: Nothing to be done for 'encs'. I, [2024-05-04T08:57:16.267472 #3672658] INFO -- : make[1]: Leaving directory '/home/opc/ruby/build/master' I, [2024-05-04T08:57:16.325926 #3672658] INFO -- : exts.mk unchanged I, [2024-05-04T08:57:16.330763 #3672658] INFO -- : make[1]: Entering directory '/home/opc/ruby/build/master' I, [2024-05-04T08:57:16.435227 #3672658] INFO -- : make[2]: Entering directory '/home/opc/ruby/build/master/ext/coverage' I, [2024-05-04T08:57:16.436018 #3672658] INFO -- : make[2]: Entering directory '/home/opc/ruby/build/master/ext/digest' I, [2024-05-04T08:57:16.436957 #3672658] INFO -- : make[2]: Entering directory '/home/opc/ruby/build/master/ext/date' I, [2024-05-04T08:57:16.440235 #3672658] INFO -- : make[2]: Leaving directory '/home/opc/ruby/build/master/ext/coverage' I, [2024-05-04T08:57:16.442467 #3672658] INFO -- : make[2]: Leaving directory '/home/opc/ruby/build/master/ext/date' I, [2024-05-04T08:57:16.447784 #3672658] INFO -- : make[2]: Leaving directory '/home/opc/ruby/build/master/ext/digest' I, [2024-05-04T08:57:16.451877 #3672658] INFO -- : make[2]: Entering directory '/home/opc/ruby/build/master/ext/io/console' I, [2024-05-04T08:57:16.454658 #3672658] INFO -- : make[2]: Entering directory '/home/opc/ruby/build/master/ext/fiddle' I, [2024-05-04T08:57:16.456943 #3672658] INFO -- : make[2]: Leaving directory '/home/opc/ruby/build/master/ext/io/console' I, [2024-05-04T08:57:16.458716 #3672658] INFO -- : make[2]: Entering directory '/home/opc/ruby/build/master/ext/json' I, [2024-05-04T08:57:16.461041 #3672658] INFO -- : make[2]: Entering directory '/home/opc/ruby/build/master/ext/monitor' I, [2024-05-04T08:57:16.464748 #3672658] INFO -- : make[2]: Leaving directory '/home/opc/ruby/build/master/ext/fiddle' I, [2024-05-04T08:57:16.467951 #3672658] INFO -- : make[2]: Leaving directory '/home/opc/ruby/build/master/ext/monitor' I, [2024-05-04T08:57:16.470795 #3672658] INFO -- : make[2]: Entering directory '/home/opc/ruby/build/master/ext/objspace' I, [2024-05-04T08:57:16.472692 #3672658] INFO -- : make[2]: Leaving directory '/home/opc/ruby/build/master/ext/json' I, [2024-05-04T08:57:16.476715 #3672658] INFO -- : make[2]: Leaving directory '/home/opc/ruby/build/master/ext/objspace' I, [2024-05-04T08:57:16.476902 #3672658] INFO -- : make[2]: Entering directory '/home/opc/ruby/build/master/ext/pathname' I, [2024-05-04T08:57:16.483288 #3672658] INFO -- : make[2]: Entering directory '/home/opc/ruby/build/master/ext/psych' I, [2024-05-04T08:57:16.484173 #3672658] INFO -- : make[2]: Leaving directory '/home/opc/ruby/build/master/ext/pathname' I, [2024-05-04T08:57:16.487665 #3672658] INFO -- : make[2]: Entering directory '/home/opc/ruby/build/master/ext/openssl' I, [2024-05-04T08:57:16.490416 #3672658] INFO -- : make[2]: Entering directory '/home/opc/ruby/build/master/ext/pty' I, [2024-05-04T08:57:16.493072 #3672658] INFO -- : make[2]: Leaving directory '/home/opc/ruby/build/master/ext/pty' I, [2024-05-04T08:57:16.504535 #3672658] INFO -- : make[2]: Leaving directory '/home/opc/ruby/build/master/ext/psych' I, [2024-05-04T08:57:16.506464 #3672658] INFO -- : make[2]: Entering directory '/home/opc/ruby/build/master/ext/rubyvm' I, [2024-05-04T08:57:16.509979 #3672658] INFO -- : make[2]: Leaving directory '/home/opc/ruby/build/master/ext/openssl' I, [2024-05-04T08:57:16.510019 #3672658] INFO -- : make[2]: Leaving directory '/home/opc/ruby/build/master/ext/rubyvm' I, [2024-05-04T08:57:16.510031 #3672658] INFO -- : make[2]: Entering directory '/home/opc/ruby/build/master/ext/ripper' I, [2024-05-04T08:57:16.515970 #3672658] INFO -- : make[2]: Leaving directory '/home/opc/ruby/build/master/ext/ripper' I, [2024-05-04T08:57:16.521877 #3672658] INFO -- : make[2]: Entering directory '/home/opc/ruby/build/master/ext/socket' I, [2024-05-04T08:57:16.522919 #3672658] INFO -- : make[2]: Entering directory '/home/opc/ruby/build/master/.bundle/gems/bigdecimal-3.1.7/ext/bigdecimal' I, [2024-05-04T08:57:16.523657 #3672658] INFO -- : make[2]: Entering directory '/home/opc/ruby/build/master/.bundle/gems/debug-1.9.2/ext/debug' I, [2024-05-04T08:57:16.532661 #3672658] INFO -- : make[2]: Leaving directory '/home/opc/ruby/build/master/ext/socket' I, [2024-05-04T08:57:16.535164 #3672658] INFO -- : make[2]: Entering directory '/home/opc/ruby/build/master/.bundle/gems/nkf-0.2.0/ext/nkf' I, [2024-05-04T08:57:16.555091 #3672658] INFO -- : make[2]: Leaving directory '/home/opc/ruby/build/master/.bundle/gems/debug-1.9.2/ext/debug' I, [2024-05-04T08:57:16.557704 #3672658] INFO -- : make[2]: Entering directory '/home/opc/ruby/build/master/.bundle/gems/racc-1.7.3/ext/racc/cparse' I, [2024-05-04T08:57:16.558337 #3672658] INFO -- : make[2]: Leaving directory '/home/opc/ruby/build/master/.bundle/gems/bigdecimal-3.1.7/ext/bigdecimal' I, [2024-05-04T08:57:16.561893 #3672658] INFO -- : make[2]: Entering directory '/home/opc/ruby/build/master/.bundle/gems/rbs-3.4.4/ext/rbs_extension' I, [2024-05-04T08:57:16.567620 #3672658] INFO -- : make[2]: Leaving directory '/home/opc/ruby/build/master/.bundle/gems/nkf-0.2.0/ext/nkf' I, [2024-05-04T08:57:16.570402 #3672658] INFO -- : make[2]: Entering directory '/home/opc/ruby/build/master/.bundle/gems/syslog-0.1.2/ext/syslog' I, [2024-05-04T08:57:16.590247 #3672658] INFO -- : make[2]: Leaving directory '/home/opc/ruby/build/master/.bundle/gems/racc-1.7.3/ext/racc/cparse' I, [2024-05-04T08:57:16.594644 #3672658] INFO -- : make[2]: Leaving directory '/home/opc/ruby/build/master/.bundle/gems/rbs-3.4.4/ext/rbs_extension' I, [2024-05-04T08:57:16.601962 #3672658] INFO -- : make[2]: Leaving directory '/home/opc/ruby/build/master/.bundle/gems/syslog-0.1.2/ext/syslog' I, [2024-05-04T08:57:16.605236 #3672658] INFO -- : make[2]: Entering directory '/home/opc/ruby/build/master/ext/digest/sha2' I, [2024-05-04T08:57:16.611571 #3672658] INFO -- : make[2]: Leaving directory '/home/opc/ruby/build/master/ext/digest/sha2' I, [2024-05-04T08:57:16.649194 #3672658] INFO -- : make[2]: Entering directory '/home/opc/ruby/build/master' I, [2024-05-04T08:57:16.733067 #3672658] INFO -- : make[2]: 'ruby' is up to date. I, [2024-05-04T08:57:16.733183 #3672658] INFO -- : make[2]: Leaving directory '/home/opc/ruby/build/master' I, [2024-05-04T08:57:16.733314 #3672658] INFO -- : make[1]: Leaving directory '/home/opc/ruby/build/master' I, [2024-05-04T08:57:16.737746 #3672658] INFO -- : make[1]: Entering directory '/home/opc/ruby/build/master' I, [2024-05-04T08:57:16.737794 #3672658] INFO -- : make[1]: Nothing to be done for 'note'. I, [2024-05-04T08:57:16.737813 #3672658] INFO -- : make[1]: Leaving directory '/home/opc/ruby/build/master' I, [2024-05-04T08:57:16.737949 #3672658] INFO -- : ./miniruby -I/home/opc/ruby/src/master/lib -I. -I.ext/common /home/opc/ruby/src/master/tool/runruby.rb --extout=.ext -- --disable-gems -r./aarch64-linux-fake /home/opc/ruby/src/master/tool/rbinstall.rb --make="make" --dest-dir="" --extout=".ext" --ext-build-dir="./ext" --mflags="-j3 --jobserver-auth=4,5" --make-flags=" -j3 --jobserver-auth=4,5" --data-mode=0644 --prog-mode=0755 --installed-list .installed.list --mantype="doc" --gnumake --install=all --exclude=doc I, [2024-05-04T08:57:16.885469 #3672658] INFO -- : Installing to I, [2024-05-04T08:57:16.885539 #3672658] INFO -- : installing binary commands: /home/opc/ruby/install/master/bin I, [2024-05-04T08:57:16.897383 #3672658] INFO -- : installing base libraries: /home/opc/ruby/install/master/lib I, [2024-05-04T08:57:16.897889 #3672658] INFO -- : installing arch files: /home/opc/ruby/install/master/lib/ruby/3.4.0+0/aarch64-linux I, [2024-05-04T08:57:16.898035 #3672658] INFO -- : installing pkgconfig data: /home/opc/ruby/install/master/lib/pkgconfig I, [2024-05-04T08:57:16.898088 #3672658] INFO -- : installing extension objects: /home/opc/ruby/install/master/lib/ruby/3.4.0+0/aarch64-linux I, [2024-05-04T08:57:16.910586 #3672658] INFO -- : installing extension objects: /home/opc/ruby/install/master/lib/ruby/site_ruby/3.4.0+0/aarch64-linux I, [2024-05-04T08:57:16.910627 #3672658] INFO -- : installing extension objects: /home/opc/ruby/install/master/lib/ruby/vendor_ruby/3.4.0+0/aarch64-linux I, [2024-05-04T08:57:16.910716 #3672658] INFO -- : installing extension headers: /home/opc/ruby/install/master/include/ruby-3.4.0+0/aarch64-linux I, [2024-05-04T08:57:16.911006 #3672658] INFO -- : installing extension scripts: /home/opc/ruby/install/master/lib/ruby/3.4.0+0 I, [2024-05-04T08:57:16.920062 #3672658] INFO -- : installing extension scripts: /home/opc/ruby/install/master/lib/ruby/site_ruby/3.4.0+0 I, [2024-05-04T08:57:16.920081 #3672658] INFO -- : installing extension scripts: /home/opc/ruby/install/master/lib/ruby/vendor_ruby/3.4.0+0 I, [2024-05-04T08:57:16.920092 #3672658] INFO -- : installing extension headers: /home/opc/ruby/install/master/include/ruby-3.4.0+0/ruby I, [2024-05-04T08:57:16.920211 #3672658] INFO -- : installing command scripts: /home/opc/ruby/install/master/bin I, [2024-05-04T08:57:16.920346 #3672658] INFO -- : installing library scripts: /home/opc/ruby/install/master/lib/ruby/3.4.0+0 I, [2024-05-04T08:57:17.007858 #3672658] INFO -- : installing common headers: /home/opc/ruby/install/master/include/ruby-3.4.0+0 I, [2024-05-04T08:57:17.022031 #3672658] INFO -- : installing manpages: /home/opc/ruby/install/master/share/man/man1 I, [2024-05-04T08:57:17.022311 #3672658] INFO -- : installing default gems from lib: /home/opc/ruby/install/master/lib/ruby/gems/3.4.0+0 I, [2024-05-04T08:57:17.061908 #3672658] INFO -- : benchmark 0.3.0 I, [2024-05-04T08:57:17.074875 #3672658] INFO -- : bundler 2.6.0.dev I, [2024-05-04T08:57:17.079493 #3672658] INFO -- : cgi 0.4.1 I, [2024-05-04T08:57:17.080650 #3672658] INFO -- : delegate 0.3.1 I, [2024-05-04T08:57:17.081802 #3672658] INFO -- : did_you_mean 1.6.3 I, [2024-05-04T08:57:17.082920 #3672658] INFO -- : english 0.8.0 I, [2024-05-04T08:57:17.083985 #3672658] INFO -- : erb 4.0.4 I, [2024-05-04T08:57:17.086681 #3672658] INFO -- : error_highlight 0.6.0 I, [2024-05-04T08:57:17.087757 #3672658] INFO -- : fileutils 1.7.2 I, [2024-05-04T08:57:17.088880 #3672658] INFO -- : find 0.2.0 I, [2024-05-04T08:57:17.090027 #3672658] INFO -- : forwardable 1.3.3 I, [2024-05-04T08:57:17.091095 #3672658] INFO -- : ipaddr 1.2.6 I, [2024-05-04T08:57:17.092168 #3672658] INFO -- : irb 1.13.0 I, [2024-05-04T08:57:17.094759 #3672658] INFO -- : logger 1.6.0 I, [2024-05-04T08:57:17.095845 #3672658] INFO -- : net-http 0.4.1 I, [2024-05-04T08:57:17.098740 #3672658] INFO -- : net-protocol 0.2.2 I, [2024-05-04T08:57:17.099870 #3672658] INFO -- : open-uri 0.4.1 I, [2024-05-04T08:57:17.101028 #3672658] INFO -- : open3 0.2.1 I, [2024-05-04T08:57:17.102170 #3672658] INFO -- : optparse 0.5.0 I, [2024-05-04T08:57:17.103277 #3672658] INFO -- : ostruct 0.6.0 I, [2024-05-04T08:57:17.104330 #3672658] INFO -- : pp 0.5.0 I, [2024-05-04T08:57:17.105510 #3672658] INFO -- : prettyprint 0.2.0 I, [2024-05-04T08:57:17.106615 #3672658] INFO -- : prism 0.27.0 I, [2024-05-04T08:57:17.107779 #3672658] INFO -- : pstore 0.1.3 I, [2024-05-04T08:57:17.109117 #3672658] INFO -- : rdoc 6.6.3.1 I, [2024-05-04T08:57:17.113001 #3672658] INFO -- : readline 0.0.4 I, [2024-05-04T08:57:17.114122 #3672658] INFO -- : reline 0.5.5 I, [2024-05-04T08:57:17.115257 #3672658] INFO -- : resolv 0.4.0 I, [2024-05-04T08:57:17.116353 #3672658] INFO -- : ruby2_keywords 0.0.5 I, [2024-05-04T08:57:17.117510 #3672658] INFO -- : securerandom 0.3.1 I, [2024-05-04T08:57:17.118597 #3672658] INFO -- : set 1.1.0 I, [2024-05-04T08:57:17.119684 #3672658] INFO -- : shellwords 0.2.0 I, [2024-05-04T08:57:17.120823 #3672658] INFO -- : singleton 0.2.0 I, [2024-05-04T08:57:17.121962 #3672658] INFO -- : syntax_suggest 2.0.0 I, [2024-05-04T08:57:17.126030 #3672658] INFO -- : tempfile 0.2.1 I, [2024-05-04T08:57:17.127152 #3672658] INFO -- : time 0.3.0 I, [2024-05-04T08:57:17.128282 #3672658] INFO -- : timeout 0.4.1 I, [2024-05-04T08:57:17.129455 #3672658] INFO -- : tmpdir 0.2.0 I, [2024-05-04T08:57:17.130605 #3672658] INFO -- : tsort 0.2.0 I, [2024-05-04T08:57:17.131690 #3672658] INFO -- : un 0.3.0 I, [2024-05-04T08:57:17.132815 #3672658] INFO -- : uri 0.13.0 I, [2024-05-04T08:57:17.133997 #3672658] INFO -- : weakref 0.1.3 I, [2024-05-04T08:57:17.135093 #3672658] INFO -- : yaml 0.3.0 I, [2024-05-04T08:57:17.135996 #3672658] INFO -- : installing default gems from ext: /home/opc/ruby/install/master/lib/ruby/gems/3.4.0+0 I, [2024-05-04T08:57:17.145425 #3672658] INFO -- : date 3.3.4 I, [2024-05-04T08:57:17.147977 #3672658] INFO -- : digest 3.1.1 I, [2024-05-04T08:57:17.149162 #3672658] INFO -- : etc 1.4.3 I, [2024-05-04T08:57:17.150298 #3672658] INFO -- : fcntl 1.1.0 I, [2024-05-04T08:57:17.151395 #3672658] INFO -- : fiddle 1.1.3 I, [2024-05-04T08:57:17.152513 #3672658] INFO -- : io-console 0.7.2 I, [2024-05-04T08:57:17.153662 #3672658] INFO -- : io-nonblock 0.3.0 I, [2024-05-04T08:57:17.154738 #3672658] INFO -- : io-wait 0.3.1 I, [2024-05-04T08:57:17.155789 #3672658] INFO -- : json 2.7.2 I, [2024-05-04T08:57:17.157285 #3672658] INFO -- : openssl 3.2.0 I, [2024-05-04T08:57:17.158431 #3672658] INFO -- : pathname 0.3.0 I, [2024-05-04T08:57:17.159917 #3672658] INFO -- : psych 5.1.2 I, [2024-05-04T08:57:17.161200 #3672658] INFO -- : stringio 3.1.1 I, [2024-05-04T08:57:17.162369 #3672658] INFO -- : strscan 3.1.1 I, [2024-05-04T08:57:17.163454 #3672658] INFO -- : zlib 3.1.0 I, [2024-05-04T08:57:17.164369 #3672658] INFO -- : installing bundled gems: /home/opc/ruby/install/master/lib/ruby/gems/3.4.0+0 I, [2024-05-04T08:57:17.165013 #3672658] INFO -- : minitest 5.22.3 I, [2024-05-04T08:57:17.179029 #3672658] INFO -- : rake 13.2.1 I, [2024-05-04T08:57:17.192376 #3672658] INFO -- : test-unit 3.6.2 I, [2024-05-04T08:57:17.208338 #3672658] INFO -- : rexml 3.2.6 I, [2024-05-04T08:57:17.222041 #3672658] INFO -- : rss 0.3.0 I, [2024-05-04T08:57:17.231789 #3672658] INFO -- : net-ftp 0.3.4 I, [2024-05-04T08:57:17.235372 #3672658] INFO -- : net-imap 0.4.10 I, [2024-05-04T08:57:17.249921 #3672658] INFO -- : net-pop 0.1.2 I, [2024-05-04T08:57:17.254213 #3672658] INFO -- : net-smtp 0.5.0 I, [2024-05-04T08:57:17.257407 #3672658] INFO -- : matrix 0.4.2 I, [2024-05-04T08:57:17.263214 #3672658] INFO -- : prime 0.1.2 I, [2024-05-04T08:57:17.273950 #3672658] INFO -- : rbs 3.4.4 I, [2024-05-04T08:57:17.372302 #3672658] INFO -- : typeprof 0.21.11 I, [2024-05-04T08:57:17.380217 #3672658] INFO -- : debug 1.9.2 I, [2024-05-04T08:57:17.389882 #3672658] INFO -- : racc 1.7.3 I, [2024-05-04T08:57:17.399373 #3672658] INFO -- : mutex_m 0.2.0 I, [2024-05-04T08:57:17.402313 #3672658] INFO -- : getoptlong 0.2.1 I, [2024-05-04T08:57:17.407958 #3672658] INFO -- : base64 0.2.0 I, [2024-05-04T08:57:17.410421 #3672658] INFO -- : bigdecimal 3.1.7 I, [2024-05-04T08:57:17.416621 #3672658] INFO -- : observer 0.1.2 I, [2024-05-04T08:57:17.419532 #3672658] INFO -- : abbrev 0.1.2 I, [2024-05-04T08:57:17.422517 #3672658] INFO -- : resolv-replace 0.1.1 I, [2024-05-04T08:57:17.425532 #3672658] INFO -- : rinda 0.2.0 I, [2024-05-04T08:57:17.428812 #3672658] INFO -- : drb 2.2.1 I, [2024-05-04T08:57:17.433225 #3672658] INFO -- : nkf 0.2.0 I, [2024-05-04T08:57:17.440681 #3672658] INFO -- : syslog 0.1.2 I, [2024-05-04T08:57:17.445059 #3672658] INFO -- : csv 3.3.0 I, [2024-05-04T08:57:17.454149 #3672658] INFO -- : installing bundled gem cache: /home/opc/ruby/install/master/lib/ruby/gems/3.4.0+0/cache I, [2024-05-04T08:57:17.455928 #3672658] INFO -- : skipped bundled gems: I, [2024-05-04T08:57:17.455947 #3672658] INFO -- : power_assert-2.0.4dev.gem not found in bundled_gems I, [2024-05-04T08:57:17.458994 #3672658] INFO -- : $$$[end] "make install -j3" exit with 0. I, [2024-05-04T08:57:17.459152 #3672658] INFO -- : $$$[beg] make yes-btest TESTOPTS='-q -j3' I, [2024-05-04T08:57:39.594187 #3672658] INFO -- : PASS all 1935 tests E, [2024-05-04T08:57:39.596031 #3672658] ERROR -- : I, [2024-05-04T08:57:39.596147 #3672658] INFO -- : $$$[end] "make yes-btest TESTOPTS='-q -j3'" exit with 0. I, [2024-05-04T08:57:39.596587 #3672658] INFO -- : $$$[beg] make yes-test-basic TESTS='-j3' I, [2024-05-04T08:57:39.689933 #3672658] INFO -- : BASERUBY = /usr/local/bin/ruby --disable=gems I, [2024-05-04T08:57:39.690005 #3672658] INFO -- : CC = gcc I, [2024-05-04T08:57:39.690016 #3672658] INFO -- : LD = ld I, [2024-05-04T08:57:39.690025 #3672658] INFO -- : LDSHARED = gcc -shared I, [2024-05-04T08:57:39.690045 #3672658] INFO -- : CFLAGS = -O3 -fno-fast-math -ggdb3 -Wall -Wextra -Wdeprecated-declarations -Wdiv-by-zero -Wduplicated-cond -Wimplicit-function-declaration -Wimplicit-int -Wpointer-arith -Wwrite-strings -Wold-style-definition -Wimplicit-fallthrough=0 -Wmissing-noreturn -Wno-cast-function-type -Wno-constant-logical-operand -Wno-long-long -Wno-missing-field-initializers -Wno-overlength-strings -Wno-packed-bitfield-compat -Wno-parentheses-equality -Wno-self-assign -Wno-tautological-compare -Wno-unused-parameter -Wno-unused-value -Wsuggest-attribute=format -Wsuggest-attribute=noreturn -Wunused-variable -Wmisleading-indentation -Wundef I, [2024-05-04T08:57:39.690055 #3672658] INFO -- : XCFLAGS = -U_FORTIFY_SOURCE -D_FORTIFY_SOURCE=2 -fstack-protector-strong -msign-return-address=all -fno-strict-overflow -fvisibility=hidden -fexcess-precision=standard -DRUBY_EXPORT -fPIE -I. -I.ext/include/aarch64-linux -I/home/opc/ruby/src/master/include -I/home/opc/ruby/src/master -I/home/opc/ruby/src/master/prism -I/home/opc/ruby/src/master/enc/unicode/15.0.0 I, [2024-05-04T08:57:39.690076 #3672658] INFO -- : CPPFLAGS = I, [2024-05-04T08:57:39.690084 #3672658] INFO -- : DLDFLAGS = -Wl,--compress-debug-sections=zlib -fstack-protector-strong -pie I, [2024-05-04T08:57:39.690093 #3672658] INFO -- : SOLIBS = -lz -lrt -lrt -ldl -lcrypt -lm -lpthread I, [2024-05-04T08:57:39.691510 #3672658] INFO -- : LANG = en_US.UTF-8 I, [2024-05-04T08:57:39.691523 #3672658] INFO -- : LC_ALL = I, [2024-05-04T08:57:39.691530 #3672658] INFO -- : LC_CTYPE = I, [2024-05-04T08:57:39.691538 #3672658] INFO -- : MFLAGS = I, [2024-05-04T08:57:39.691546 #3672658] INFO -- : RUSTC = rustc I, [2024-05-04T08:57:39.691554 #3672658] INFO -- : YJIT_RUSTC_ARGS = --crate-name=yjit --crate-type=staticlib --edition=2021 -g -C lto=thin -C opt-level=3 -C overflow-checks=on '--out-dir=/home/opc/ruby/build/master/yjit/target/release/' /home/opc/ruby/src/master/yjit/src/lib.rs I, [2024-05-04T08:57:39.691566 #3672658] INFO -- : gcc (GCC) 8.5.0 20210514 (Red Hat 8.5.0-10.1.0.1) I, [2024-05-04T08:57:39.691574 #3672658] INFO -- : Copyright (C) 2018 Free Software Foundation, Inc. I, [2024-05-04T08:57:39.691582 #3672658] INFO -- : This is free software; see the source for copying conditions. There is NO I, [2024-05-04T08:57:39.691589 #3672658] INFO -- : warranty; not even for MERCHANTABILITY or FITNESS FOR A PARTICULAR PURPOSE. I, [2024-05-04T08:57:39.691597 #3672658] INFO -- : I, [2024-05-04T08:57:39.850005 #3672658] INFO -- : Checking leaked global symbols...none I, [2024-05-04T08:57:39.903775 #3672658] INFO -- : /home/opc/ruby/src/master/basictest/test.rb:assignment ....................................................................................................................................................................................................................................................................................................................................................................................OK 372 I, [2024-05-04T08:57:39.903849 #3672658] INFO -- : /home/opc/ruby/src/master/basictest/test.rb:condition ..OK 2 I, [2024-05-04T08:57:39.903872 #3672658] INFO -- : /home/opc/ruby/src/master/basictest/test.rb:if/unless ...OK 3 I, [2024-05-04T08:57:39.903924 #3672658] INFO -- : /home/opc/ruby/src/master/basictest/test.rb:case .....OK 5 I, [2024-05-04T08:57:39.904589 #3672658] INFO -- : /home/opc/ruby/src/master/basictest/test.rb:while/until ........OK 8 I, [2024-05-04T08:57:39.904725 #3672658] INFO -- : /home/opc/ruby/src/master/basictest/test.rb:exception ..........OK 10 I, [2024-05-04T08:57:39.905428 #3672658] INFO -- : /home/opc/ruby/src/master/basictest/test.rb:array .......................................OK 39 I, [2024-05-04T08:57:39.905731 #3672658] INFO -- : /home/opc/ruby/src/master/basictest/test.rb:hash ...........................OK 27 I, [2024-05-04T08:57:39.907498 #3672658] INFO -- : /home/opc/ruby/src/master/basictest/test.rb:iterator ...........................................................................................................OK 107 I, [2024-05-04T08:57:39.908322 #3672658] INFO -- : /home/opc/ruby/src/master/basictest/test.rb:float ................................................................................OK 80 I, [2024-05-04T08:57:39.911870 #3672658] INFO -- : /home/opc/ruby/src/master/basictest/test.rb:bignum ...............................OK 31 I, [2024-05-04T08:57:39.913528 #3672658] INFO -- : /home/opc/ruby/src/master/basictest/test.rb:string & char ..............................................................OK 62 I, [2024-05-04T08:57:39.913606 #3672658] INFO -- : /home/opc/ruby/src/master/basictest/test.rb:assignment ..........OK 10 I, [2024-05-04T08:57:39.913680 #3672658] INFO -- : /home/opc/ruby/src/master/basictest/test.rb:call ......OK 6 I, [2024-05-04T08:57:39.913814 #3672658] INFO -- : /home/opc/ruby/src/master/basictest/test.rb:proc .........OK 9 I, [2024-05-04T08:57:40.014060 #3672658] INFO -- : /home/opc/ruby/src/master/basictest/test.rb:signal ..OK 2 I, [2024-05-04T08:57:40.015508 #3672658] INFO -- : /home/opc/ruby/src/master/basictest/test.rb:eval ...........................OK 27 I, [2024-05-04T08:57:40.149780 #3672658] INFO -- : /home/opc/ruby/src/master/basictest/test.rb:system ........OK 8 I, [2024-05-04T08:57:40.149853 #3672658] INFO -- : /home/opc/ruby/src/master/basictest/test.rb:const .....OK 5 I, [2024-05-04T08:57:40.149920 #3672658] INFO -- : /home/opc/ruby/src/master/basictest/test.rb:clone .....OK 5 I, [2024-05-04T08:57:40.150109 #3672658] INFO -- : /home/opc/ruby/src/master/basictest/test.rb:marshal ....OK 4 I, [2024-05-04T08:57:40.150187 #3672658] INFO -- : /home/opc/ruby/src/master/basictest/test.rb:pack ....OK 4 I, [2024-05-04T08:57:40.150249 #3672658] INFO -- : /home/opc/ruby/src/master/basictest/test.rb:math ..OK 2 I, [2024-05-04T08:57:40.150308 #3672658] INFO -- : /home/opc/ruby/src/master/basictest/test.rb:struct ......OK 6 I, [2024-05-04T08:57:40.150472 #3672658] INFO -- : /home/opc/ruby/src/master/basictest/test.rb:variable ............OK 12 I, [2024-05-04T08:57:40.150511 #3672658] INFO -- : /home/opc/ruby/src/master/basictest/test.rb:trace ...OK 3 I, [2024-05-04T08:57:40.150639 #3672658] INFO -- : /home/opc/ruby/src/master/basictest/test.rb:defined? ............OK 12 I, [2024-05-04T08:57:40.150725 #3672658] INFO -- : /home/opc/ruby/src/master/basictest/test.rb:alias ......OK 6 I, [2024-05-04T08:57:40.151213 #3672658] INFO -- : /home/opc/ruby/src/master/basictest/test.rb:path .......................OK 23 I, [2024-05-04T08:57:40.219236 #3672658] INFO -- : /home/opc/ruby/src/master/basictest/test.rb:gc ....OK 4 I, [2024-05-04T08:57:40.221895 #3672658] INFO -- : I, [2024-05-04T08:57:40.221950 #3672658] INFO -- : test succeeded I, [2024-05-04T08:57:40.222467 #3672658] INFO -- : $$$[end] "make yes-test-basic TESTS='-j3'" exit with 0. I, [2024-05-04T08:57:40.222652 #3672658] INFO -- : $$$[beg] make yes-test-all TESTOPTS='--stderr-on-failure' TESTS='-j3' I, [2024-05-04T08:57:40.346769 #3672658] INFO -- : BASERUBY = /usr/local/bin/ruby --disable=gems I, [2024-05-04T08:57:40.346842 #3672658] INFO -- : CC = gcc I, [2024-05-04T08:57:40.346853 #3672658] INFO -- : LD = ld I, [2024-05-04T08:57:40.346864 #3672658] INFO -- : LDSHARED = gcc -shared I, [2024-05-04T08:57:40.346874 #3672658] INFO -- : CFLAGS = -O3 -fno-fast-math -ggdb3 -Wall -Wextra -Wdeprecated-declarations -Wdiv-by-zero -Wduplicated-cond -Wimplicit-function-declaration -Wimplicit-int -Wpointer-arith -Wwrite-strings -Wold-style-definition -Wimplicit-fallthrough=0 -Wmissing-noreturn -Wno-cast-function-type -Wno-constant-logical-operand -Wno-long-long -Wno-missing-field-initializers -Wno-overlength-strings -Wno-packed-bitfield-compat -Wno-parentheses-equality -Wno-self-assign -Wno-tautological-compare -Wno-unused-parameter -Wno-unused-value -Wsuggest-attribute=format -Wsuggest-attribute=noreturn -Wunused-variable -Wmisleading-indentation -Wundef I, [2024-05-04T08:57:40.346883 #3672658] INFO -- : XCFLAGS = -U_FORTIFY_SOURCE -D_FORTIFY_SOURCE=2 -fstack-protector-strong -msign-return-address=all -fno-strict-overflow -fvisibility=hidden -fexcess-precision=standard -DRUBY_EXPORT -fPIE -I. -I.ext/include/aarch64-linux -I/home/opc/ruby/src/master/include -I/home/opc/ruby/src/master -I/home/opc/ruby/src/master/prism -I/home/opc/ruby/src/master/enc/unicode/15.0.0 I, [2024-05-04T08:57:40.346892 #3672658] INFO -- : CPPFLAGS = I, [2024-05-04T08:57:40.346901 #3672658] INFO -- : DLDFLAGS = -Wl,--compress-debug-sections=zlib -fstack-protector-strong -pie I, [2024-05-04T08:57:40.346910 #3672658] INFO -- : SOLIBS = -lz -lrt -lrt -ldl -lcrypt -lm -lpthread I, [2024-05-04T08:57:40.346918 #3672658] INFO -- : LANG = en_US.UTF-8 I, [2024-05-04T08:57:40.346926 #3672658] INFO -- : LC_ALL = I, [2024-05-04T08:57:40.346935 #3672658] INFO -- : LC_CTYPE = I, [2024-05-04T08:57:40.346943 #3672658] INFO -- : MFLAGS = I, [2024-05-04T08:57:40.346952 #3672658] INFO -- : RUSTC = rustc I, [2024-05-04T08:57:40.346960 #3672658] INFO -- : YJIT_RUSTC_ARGS = --crate-name=yjit --crate-type=staticlib --edition=2021 -g -C lto=thin -C opt-level=3 -C overflow-checks=on '--out-dir=/home/opc/ruby/build/master/yjit/target/release/' /home/opc/ruby/src/master/yjit/src/lib.rs I, [2024-05-04T08:57:40.347665 #3672658] INFO -- : gcc (GCC) 8.5.0 20210514 (Red Hat 8.5.0-10.1.0.1) I, [2024-05-04T08:57:40.347681 #3672658] INFO -- : Copyright (C) 2018 Free Software Foundation, Inc. I, [2024-05-04T08:57:40.347690 #3672658] INFO -- : This is free software; see the source for copying conditions. There is NO I, [2024-05-04T08:57:40.347699 #3672658] INFO -- : warranty; not even for MERCHANTABILITY or FITNESS FOR A PARTICULAR PURPOSE. I, [2024-05-04T08:57:40.347707 #3672658] INFO -- : I, [2024-05-04T08:57:40.349690 #3672658] INFO -- : generating enc.mk I, [2024-05-04T08:57:40.592597 #3672658] INFO -- : making enc I, [2024-05-04T08:57:40.620070 #3672658] INFO -- : make[1]: Entering directory '/home/opc/ruby/build/master' I, [2024-05-04T08:57:40.620147 #3672658] INFO -- : make[1]: Nothing to be done for 'enc'. I, [2024-05-04T08:57:40.620158 #3672658] INFO -- : make[1]: Leaving directory '/home/opc/ruby/build/master' I, [2024-05-04T08:57:40.620908 #3672658] INFO -- : making srcs under enc I, [2024-05-04T08:57:40.662902 #3672658] INFO -- : make[1]: Entering directory '/home/opc/ruby/build/master' I, [2024-05-04T08:57:40.662977 #3672658] INFO -- : make[1]: Nothing to be done for 'srcs'. I, [2024-05-04T08:57:40.662987 #3672658] INFO -- : make[1]: Leaving directory '/home/opc/ruby/build/master' I, [2024-05-04T08:57:40.664099 #3672658] INFO -- : generating transdb.h I, [2024-05-04T08:57:40.807373 #3672658] INFO -- : transdb.h unchanged I, [2024-05-04T08:57:40.808721 #3672658] INFO -- : making trans I, [2024-05-04T08:57:40.857206 #3672658] INFO -- : make[1]: Entering directory '/home/opc/ruby/build/master' I, [2024-05-04T08:57:40.857279 #3672658] INFO -- : make[1]: Nothing to be done for 'trans'. I, [2024-05-04T08:57:40.857289 #3672658] INFO -- : make[1]: Leaving directory '/home/opc/ruby/build/master' I, [2024-05-04T08:57:40.858012 #3672658] INFO -- : making encs I, [2024-05-04T08:57:40.910698 #3672658] INFO -- : make[1]: Entering directory '/home/opc/ruby/build/master' I, [2024-05-04T08:57:40.910780 #3672658] INFO -- : make[1]: Nothing to be done for 'encs'. I, [2024-05-04T08:57:40.910791 #3672658] INFO -- : make[1]: Leaving directory '/home/opc/ruby/build/master' I, [2024-05-04T08:57:40.912729 #3672658] INFO -- : generating makefiles ext/configure-ext.mk I, [2024-05-04T08:57:40.952527 #3672658] INFO -- : ext/configure-ext.mk updated I, [2024-05-04T08:57:40.955926 #3672658] INFO -- : make[1]: Entering directory '/home/opc/ruby/build/master' I, [2024-05-04T08:57:42.990366 #3672658] INFO -- : make[1]: Leaving directory '/home/opc/ruby/build/master' I, [2024-05-04T08:57:42.991066 #3672658] INFO -- : generating makefile exts.mk I, [2024-05-04T08:57:43.049746 #3672658] INFO -- : exts.mk unchanged I, [2024-05-04T08:57:43.054852 #3672658] INFO -- : make[1]: Entering directory '/home/opc/ruby/build/master' I, [2024-05-04T08:57:43.352550 #3672658] INFO -- : make[2]: Entering directory '/home/opc/ruby/build/master/ext/coverage' I, [2024-05-04T08:57:43.357240 #3672658] INFO -- : make[2]: Leaving directory '/home/opc/ruby/build/master/ext/coverage' I, [2024-05-04T08:57:43.362909 #3672658] INFO -- : make[2]: Entering directory '/home/opc/ruby/build/master/ext/date' I, [2024-05-04T08:57:43.368242 #3672658] INFO -- : make[2]: Leaving directory '/home/opc/ruby/build/master/ext/date' I, [2024-05-04T08:57:43.371695 #3672658] INFO -- : make[2]: Entering directory '/home/opc/ruby/build/master/ext/digest' I, [2024-05-04T08:57:43.380542 #3672658] INFO -- : make[2]: Leaving directory '/home/opc/ruby/build/master/ext/digest' I, [2024-05-04T08:57:43.402866 #3672658] INFO -- : make[2]: Entering directory '/home/opc/ruby/build/master/ext/digest/sha2' I, [2024-05-04T08:57:43.407900 #3672658] INFO -- : make[2]: Leaving directory '/home/opc/ruby/build/master/ext/digest/sha2' I, [2024-05-04T08:57:43.426359 #3672658] INFO -- : make[2]: Entering directory '/home/opc/ruby/build/master/ext/fiddle' I, [2024-05-04T08:57:43.436527 #3672658] INFO -- : make[2]: Leaving directory '/home/opc/ruby/build/master/ext/fiddle' I, [2024-05-04T08:57:43.440973 #3672658] INFO -- : make[2]: Entering directory '/home/opc/ruby/build/master/ext/io/console' I, [2024-05-04T08:57:43.445175 #3672658] INFO -- : make[2]: Leaving directory '/home/opc/ruby/build/master/ext/io/console' I, [2024-05-04T08:57:43.456022 #3672658] INFO -- : make[2]: Entering directory '/home/opc/ruby/build/master/ext/json' I, [2024-05-04T08:57:43.465373 #3672658] INFO -- : make[2]: Leaving directory '/home/opc/ruby/build/master/ext/json' I, [2024-05-04T08:57:43.478615 #3672658] INFO -- : make[2]: Entering directory '/home/opc/ruby/build/master/ext/monitor' I, [2024-05-04T08:57:43.482770 #3672658] INFO -- : make[2]: Leaving directory '/home/opc/ruby/build/master/ext/monitor' I, [2024-05-04T08:57:43.488759 #3672658] INFO -- : make[2]: Entering directory '/home/opc/ruby/build/master/ext/objspace' I, [2024-05-04T08:57:43.494704 #3672658] INFO -- : make[2]: Leaving directory '/home/opc/ruby/build/master/ext/objspace' I, [2024-05-04T08:57:43.514903 #3672658] INFO -- : make[2]: Entering directory '/home/opc/ruby/build/master/ext/openssl' I, [2024-05-04T08:57:43.536360 #3672658] INFO -- : make[2]: Leaving directory '/home/opc/ruby/build/master/ext/openssl' I, [2024-05-04T08:57:43.540635 #3672658] INFO -- : make[2]: Entering directory '/home/opc/ruby/build/master/ext/pathname' I, [2024-05-04T08:57:43.544815 #3672658] INFO -- : make[2]: Leaving directory '/home/opc/ruby/build/master/ext/pathname' I, [2024-05-04T08:57:43.551029 #3672658] INFO -- : make[2]: Entering directory '/home/opc/ruby/build/master/ext/psych' I, [2024-05-04T08:57:43.572665 #3672658] INFO -- : make[2]: Leaving directory '/home/opc/ruby/build/master/ext/psych' I, [2024-05-04T08:57:43.577154 #3672658] INFO -- : make[2]: Entering directory '/home/opc/ruby/build/master/ext/pty' I, [2024-05-04T08:57:43.581335 #3672658] INFO -- : make[2]: Leaving directory '/home/opc/ruby/build/master/ext/pty' I, [2024-05-04T08:57:43.594671 #3672658] INFO -- : make[2]: Entering directory '/home/opc/ruby/build/master/ext/ripper' I, [2024-05-04T08:57:43.602844 #3672658] INFO -- : make[2]: Leaving directory '/home/opc/ruby/build/master/ext/ripper' I, [2024-05-04T08:57:43.605028 #3672658] INFO -- : make[2]: Entering directory '/home/opc/ruby/build/master/ext/rubyvm' I, [2024-05-04T08:57:43.608395 #3672658] INFO -- : make[2]: Leaving directory '/home/opc/ruby/build/master/ext/rubyvm' I, [2024-05-04T08:57:43.620621 #3672658] INFO -- : make[2]: Entering directory '/home/opc/ruby/build/master/ext/socket' I, [2024-05-04T08:57:43.631402 #3672658] INFO -- : make[2]: Leaving directory '/home/opc/ruby/build/master/ext/socket' I, [2024-05-04T08:57:43.646947 #3672658] INFO -- : make[2]: Entering directory '/home/opc/ruby/build/master/.bundle/gems/bigdecimal-3.1.7/ext/bigdecimal' I, [2024-05-04T08:57:43.677933 #3672658] INFO -- : make[2]: Leaving directory '/home/opc/ruby/build/master/.bundle/gems/bigdecimal-3.1.7/ext/bigdecimal' I, [2024-05-04T08:57:43.680552 #3672658] INFO -- : make[2]: Entering directory '/home/opc/ruby/build/master/.bundle/gems/debug-1.9.2/ext/debug' I, [2024-05-04T08:57:43.711459 #3672658] INFO -- : make[2]: Leaving directory '/home/opc/ruby/build/master/.bundle/gems/debug-1.9.2/ext/debug' I, [2024-05-04T08:57:43.714060 #3672658] INFO -- : make[2]: Entering directory '/home/opc/ruby/build/master/.bundle/gems/nkf-0.2.0/ext/nkf' I, [2024-05-04T08:57:43.746405 #3672658] INFO -- : make[2]: Leaving directory '/home/opc/ruby/build/master/.bundle/gems/nkf-0.2.0/ext/nkf' I, [2024-05-04T08:57:43.748975 #3672658] INFO -- : make[2]: Entering directory '/home/opc/ruby/build/master/.bundle/gems/racc-1.7.3/ext/racc/cparse' I, [2024-05-04T08:57:43.779319 #3672658] INFO -- : make[2]: Leaving directory '/home/opc/ruby/build/master/.bundle/gems/racc-1.7.3/ext/racc/cparse' I, [2024-05-04T08:57:43.782349 #3672658] INFO -- : make[2]: Entering directory '/home/opc/ruby/build/master/.bundle/gems/rbs-3.4.4/ext/rbs_extension' I, [2024-05-04T08:57:43.812960 #3672658] INFO -- : make[2]: Leaving directory '/home/opc/ruby/build/master/.bundle/gems/rbs-3.4.4/ext/rbs_extension' I, [2024-05-04T08:57:43.815497 #3672658] INFO -- : make[2]: Entering directory '/home/opc/ruby/build/master/.bundle/gems/syslog-0.1.2/ext/syslog' I, [2024-05-04T08:57:43.846033 #3672658] INFO -- : make[2]: Leaving directory '/home/opc/ruby/build/master/.bundle/gems/syslog-0.1.2/ext/syslog' I, [2024-05-04T08:57:43.884195 #3672658] INFO -- : make[2]: Entering directory '/home/opc/ruby/build/master' I, [2024-05-04T08:57:43.968760 #3672658] INFO -- : make[2]: 'ruby' is up to date. I, [2024-05-04T08:57:43.968846 #3672658] INFO -- : make[2]: Leaving directory '/home/opc/ruby/build/master' I, [2024-05-04T08:57:43.968957 #3672658] INFO -- : make[1]: Leaving directory '/home/opc/ruby/build/master' I, [2024-05-04T08:57:43.973353 #3672658] INFO -- : make[1]: Entering directory '/home/opc/ruby/build/master' I, [2024-05-04T08:57:43.973400 #3672658] INFO -- : make[1]: Nothing to be done for 'note'. I, [2024-05-04T08:57:43.973427 #3672658] INFO -- : make[1]: Leaving directory '/home/opc/ruby/build/master' I, [2024-05-04T08:57:44.086633 #3672658] INFO -- : Run options: I, [2024-05-04T08:57:44.086709 #3672658] INFO -- : --seed=3858 I, [2024-05-04T08:57:44.086720 #3672658] INFO -- : "--ruby=./miniruby -I/home/opc/ruby/src/master/lib -I. -I.ext/common /home/opc/ruby/src/master/tool/runruby.rb --extout=.ext -- --disable-gems" I, [2024-05-04T08:57:44.086729 #3672658] INFO -- : --excludes-dir=/home/opc/ruby/src/master/test/.excludes I, [2024-05-04T08:57:44.086738 #3672658] INFO -- : --name=!/memory_leak/ I, [2024-05-04T08:57:44.086747 #3672658] INFO -- : --stderr-on-failure I, [2024-05-04T08:57:44.086755 #3672658] INFO -- : -j3 I, [2024-05-04T08:57:44.086763 #3672658] INFO -- : I, [2024-05-04T08:57:44.086772 #3672658] INFO -- : # Running tests: I, [2024-05-04T08:57:44.086780 #3672658] INFO -- : I, [2024-05-04T08:57:44.218301 #3672658] INFO -- : [ 1/885] 3713513=test_rendering I, [2024-05-04T08:57:44.226231 #3672658] INFO -- : [ 2/885] 3713512=desugar_compiler_test I, [2024-05-04T08:57:44.275702 #3672658] INFO -- : [ 3/885] 3713514=test_gem_source_local I, [2024-05-04T08:57:44.280206 #3672658] INFO -- : [ 4/885] 3713513=test_win32ole I, [2024-05-04T08:57:44.287357 #3672658] INFO -- : [ 5/885] 3713513=test_internal_ivar I, [2024-05-04T08:57:44.298097 #3672658] INFO -- : [ 6/885] 3713513=test_gem_gemcutter_utilities I, [2024-05-04T08:57:44.318294 #3672658] INFO -- : [ 7/885] 3713512=test_rdoc_task I, [2024-05-04T08:57:44.323725 #3672658] INFO -- : [ 8/885] 3713512=test_backtrace I, [2024-05-04T08:57:44.688680 #3672658] INFO -- : [ 9/885] 3713514=test_tracepoint I, [2024-05-04T08:57:44.914016 #3672658] INFO -- : [ 10/885] 3713513=test_settracefunc I, [2024-05-04T08:57:44.921447 #3672658] INFO -- : [ 11/885] 3713514=test_gem_text I, [2024-05-04T08:57:44.969596 #3672658] INFO -- : [ 12/885] 3713514=test_gem_commands_push_command I, [2024-05-04T08:57:45.552029 #3672658] INFO -- : [ 13/885] 3713514=locals_test I, [2024-05-04T08:57:45.634440 #3672658] INFO -- : [ 14/885] 3713512=test_too_many_dummy_encodings I, [2024-05-04T08:57:45.640600 #3672658] INFO -- : [ 15/885] 3713512=test_method_cache I, [2024-05-04T08:57:45.643093 #3672658] INFO -- : [ 16/885] 3713512=test_sprintf_comb I, [2024-05-04T08:57:45.699956 #3672658] INFO -- : [ 17/885] 3713513=encoding_test I, [2024-05-04T08:57:45.801028 #3672658] INFO -- : [ 18/885] 3713512=test_scan_args I, [2024-05-04T08:57:45.811479 #3672658] INFO -- : [ 19/885] 3713512=test_gem_commands_specification_command I, [2024-05-04T08:57:45.856604 #3672658] INFO -- : [ 20/885] 3713513=test_gem_request I, [2024-05-04T08:57:46.094163 #3672658] INFO -- : [ 21/885] 3713514=test_gem_commands_which_command I, [2024-05-04T08:57:46.133183 #3672658] INFO -- : [ 22/885] 3713514=test_gem_package_old I, [2024-05-04T08:57:46.162402 #3672658] INFO -- : [ 23/885] 3713512=test_pty I, [2024-05-04T08:57:46.169331 #3672658] INFO -- : [ 24/885] 3713513=test_gem_dependency_installer I, [2024-05-04T08:57:46.172788 #3672658] INFO -- : .Leaked file descriptor: TestPTY#test_open_with_block: 8 # I, [2024-05-04T08:57:46.196791 #3672658] INFO -- : [ 25/885] 3713514=test_httpCOMMAND PID USER FD TYPE DEVICE SIZE/OFF NODE NAME I, [2024-05-04T08:57:46.196851 #3672658] INFO -- : ruby 3713512 opc 8r REG 252,0 6940392 13705429 /var/lib/sss/mc/group I, [2024-05-04T08:57:46.200098 #3672658] INFO -- : I, [2024-05-04T08:57:46.211187 #3672658] INFO -- : [ 26/885] 3713514=test_hash I, [2024-05-04T08:57:46.668870 #3672658] INFO -- : [ 27/885] 3713512=parser_test I, [2024-05-04T08:57:46.680848 #3672658] INFO -- : [ 28/885] 3713512=test_filter I, [2024-05-04T08:57:46.718862 #3672658] INFO -- : [ 29/885] 3713512=test_parser_events I, [2024-05-04T08:57:46.782117 #3672658] INFO -- : [ 30/885] 3713512=test_pkcs12 I, [2024-05-04T08:57:47.493454 #3672658] INFO -- : [ 31/885] 3713512=test_gem_remote_fetcher I, [2024-05-04T08:57:48.745660 #3672658] INFO -- : [ 32/885] 3713513=test_json_tree I, [2024-05-04T08:57:48.755690 #3672658] INFO -- : [ 33/885] 3713513=test_koi8 I, [2024-05-04T08:57:48.821025 #3672658] INFO -- : [ 34/885] 3713513=test_argf I, [2024-05-04T08:57:49.488410 #3672658] INFO -- : [ 35/885] 3713512=test_x509name I, [2024-05-04T08:57:49.504692 #3672658] INFO -- : [ 36/885] 3713512=test_yaml I, [2024-05-04T08:57:49.541979 #3672658] INFO -- : [ 37/885] 3713514=test_yjit I, [2024-05-04T08:57:49.542299 #3672658] INFO -- : [ 38/885] 3713514=test_cclass I, [2024-05-04T08:57:49.594014 #3672658] INFO -- : [ 39/885] 3713512=test_gem_uninstaller I, [2024-05-04T08:57:49.667381 #3672658] INFO -- : [ 40/885] 3713514=test_gem_dependency I, [2024-05-04T08:57:49.820008 #3672658] INFO -- : [ 41/885] 3713514=test_m17n I, [2024-05-04T08:57:49.904742 #3672658] INFO -- : [ 42/885] 3713514=test_method I, [2024-05-04T08:57:50.856111 #3672658] INFO -- : [ 43/885] 3713512=test_rdoc_markup_to_rdoc I, [2024-05-04T08:57:51.030442 #3672658] INFO -- : [ 44/885] 3713512=test_severity I, [2024-05-04T08:57:51.043630 #3672658] INFO -- : [ 45/885] 3713512=test_ractor I, [2024-05-04T08:57:51.044109 #3672658] INFO -- : [ 46/885] 3713512=test_case I, [2024-05-04T08:57:51.050973 #3672658] INFO -- : [ 47/885] 3713512=test_gem_package_tar_writer I, [2024-05-04T08:57:51.177558 #3672658] INFO -- : [ 48/885] 3713512=test_str2big I, [2024-05-04T08:57:51.177739 #3672658] INFO -- : [ 49/885] 3713512=test_set I, [2024-05-04T08:57:51.199255 #3672658] INFO -- : [ 50/885] 3713512=test_utf16 I, [2024-05-04T08:57:51.255329 #3672658] INFO -- : [ 51/885] 3713512=test_http I, [2024-05-04T08:57:52.431906 #3672658] INFO -- : [ 52/885] 3713513=attribute_write_test I, [2024-05-04T08:57:52.461226 #3672658] INFO -- : [ 53/885] 3713513=test_sizeof I, [2024-05-04T08:57:53.680543 #3672658] INFO -- : [ 54/885] 3713514=test_date_attr I, [2024-05-04T08:57:53.695236 #3672658] INFO -- : [ 55/885] 3713514=test_gem_request_set_lockfile_parser I, [2024-05-04T08:57:53.859564 #3672658] INFO -- : [ 56/885] 3713514=test_face I, [2024-05-04T08:57:53.873199 #3672658] INFO -- : [ 57/885] 3713514=warnings_test I, [2024-05-04T08:57:53.884800 #3672658] INFO -- : [ 58/885] 3713514=test_stringchar I, [2024-05-04T08:57:53.951994 #3672658] INFO -- : [ 59/885] 3713514=test_econv I, [2024-05-04T08:57:54.788471 #3672658] INFO -- : [ 60/885] 3713513=test_gem_install_update_options I, [2024-05-04T08:57:54.799985 #3672658] INFO -- : [ 61/885] 3713514=test_gem_resolver_vendor_set I, [2024-05-04T08:57:54.841902 #3672658] INFO -- : [ 62/885] 3713514=test_condition I, [2024-05-04T08:57:54.846228 #3672658] INFO -- : [ 63/885] 3713514=test_cp949 I, [2024-05-04T08:57:54.847132 #3672658] INFO -- : [ 64/885] 3713514=test_jaro_winkler I, [2024-05-04T08:57:54.857241 #3672658] INFO -- : [ 65/885] 3713514=test_sleep I, [2024-05-04T08:57:54.923228 #3672658] INFO -- : [ 66/885] 3713513=test_mixed_unicode_escapes I, [2024-05-04T08:57:54.943536 #3672658] INFO -- : [ 67/885] 3713513=test_fileutils I, [2024-05-04T08:57:55.208920 #3672658] INFO -- : .Leaked file descriptor: TestFileUtils#test_chown: 10 # I, [2024-05-04T08:57:55.241998 #3672658] INFO -- : COMMAND PID USER FD TYPE DEVICE SIZE/OFF NODE NAME I, [2024-05-04T08:57:55.242065 #3672658] INFO -- : ruby 3713513 opc 10r REG 252,0 6940392 13705429 /var/lib/sss/mc/group I, [2024-05-04T08:57:55.349966 #3672658] INFO -- : Leaked file descriptor: TestFileUtils#test_chown_error: 11 # I, [2024-05-04T08:57:55.377171 #3672658] INFO -- : COMMAND PID USER FD TYPE DEVICE SIZE/OFF NODE NAME I, [2024-05-04T08:57:55.377240 #3672658] INFO -- : ruby 3713513 opc 11r REG 252,0 9253600 13705411 /var/lib/sss/mc/passwd I, [2024-05-04T08:57:55.507440 #3672658] INFO -- : [ 68/885] 3713513=test_gem_dependency_resolution_error I, [2024-05-04T08:57:55.686479 #3672658] INFO -- : [ 69/885] 3713513=test_stack I, [2024-05-04T08:57:56.290912 #3672658] INFO -- : [ 70/885] 3713513=test_windows_1252 I, [2024-05-04T08:57:56.355283 #3672658] INFO -- : [ 71/885] 3713513=test_sorted_set I, [2024-05-04T08:57:56.488160 #3672658] INFO -- : [ 72/885] 3713513=test_emoji I, [2024-05-04T08:57:56.679190 #3672658] INFO -- : [ 73/885] 3713513=test_rdoc_cross_reference I, [2024-05-04T08:57:56.904176 #3672658] INFO -- : [ 74/885] 3713514=test_parse I, [2024-05-04T08:57:57.090674 #3672658] INFO -- : [ 75/885] 3713513=test_rdoc_class_module I, [2024-05-04T08:57:57.351920 #3672658] INFO -- : [ 76/885] 3713514=test_method_cache I, [2024-05-04T08:57:57.356902 #3672658] INFO -- : [ 77/885] 3713514=test_win32ole_variable I, [2024-05-04T08:57:57.357916 #3672658] INFO -- : [ 78/885] 3713514=test_gem_specification I, [2024-05-04T08:57:57.598184 #3672658] INFO -- : [ 79/885] 3713513=test_pkey_rsa I, [2024-05-04T08:57:57.880735 #3672658] INFO -- : [ 80/885] 3713513=test_flush I, [2024-05-04T08:57:57.889829 #3672658] INFO -- : [ 81/885] 3713513=test_numhash I, [2024-05-04T08:57:57.896113 #3672658] INFO -- : [ 82/885] 3713513=test_system I, [2024-05-04T08:57:58.726344 #3672658] INFO -- : [ 83/885] 3713513=test_gc I, [2024-05-04T08:57:58.728756 #3672658] INFO -- : [ 84/885] 3713513=test_qsort I, [2024-05-04T08:57:58.735829 #3672658] INFO -- : [ 85/885] 3713513=comments_test I, [2024-05-04T08:57:58.742908 #3672658] INFO -- : [ 86/885] 3713513=test_math I, [2024-05-04T08:57:58.760993 #3672658] INFO -- : [ 87/885] 3713513=test_iso_8859 I, [2024-05-04T08:57:58.809705 #3672658] INFO -- : [ 88/885] 3713513=ripper_test I, [2024-05-04T08:57:59.362079 #3672658] INFO -- : [ 89/885] 3713513=test_libs I, [2024-05-04T08:57:59.379249 #3672658] INFO -- : [ 90/885] 3713513=test_safe_load I, [2024-05-04T08:57:59.383518 #3672658] INFO -- : [ 91/885] 3713513=test_sprintf I, [2024-05-04T08:57:59.569669 #3672658] INFO -- : [ 92/885] 3713513=test_recorder I, [2024-05-04T08:57:59.572231 #3672658] INFO -- : [ 93/885] 3713513=test_yaml_special_cases I, [2024-05-04T08:57:59.579685 #3672658] INFO -- : [ 94/885] 3713513=test_gem_commands_sources_command I, [2024-05-04T08:57:59.675417 #3672658] INFO -- : [ 95/885] 3713514=test_name_error I, [2024-05-04T08:57:59.761844 #3672658] INFO -- : [ 96/885] 3713514=json_addition_test I, [2024-05-04T08:57:59.778130 #3672658] INFO -- : [ 97/885] 3713514=test_gem_source_list I, [2024-05-04T08:57:59.781336 #3672658] INFO -- : [ 98/885] 3713513=index_write_test I, [2024-05-04T08:57:59.787792 #3672658] INFO -- : [ 99/885] 3713513=test_rdoc_parser_rd I, [2024-05-04T08:57:59.794464 #3672658] INFO -- : [100/885] 3713513=test_const I, [2024-05-04T08:57:59.803497 #3672658] INFO -- : [101/885] 3713513=test_exit I, [2024-05-04T08:57:59.852766 #3672658] INFO -- : [102/885] 3713514=test_class I, [2024-05-04T08:57:59.878577 #3672658] INFO -- : [103/885] 3713513=test_open-uri I, [2024-05-04T08:57:59.894319 #3672658] INFO -- : [104/885] 3713512=test_case I, [2024-05-04T08:57:59.988766 #3672658] INFO -- : [105/885] 3713512=test_enumerator I, [2024-05-04T08:58:00.375125 #3672658] INFO -- : [106/885] 3713513=test_enc_associate I, [2024-05-04T08:58:00.847302 #3672658] INFO -- : [107/885] 3713513=test_rdoc_context I, [2024-05-04T08:58:01.632169 #3672658] INFO -- : [108/885] 3713513=test_gem_command_manager I, [2024-05-04T08:58:01.823343 #3672658] INFO -- : [109/885] 3713513=test_array I, [2024-05-04T08:58:01.836638 #3672658] INFO -- : [110/885] 3713513=test_rdoc_generator_json_index I, [2024-05-04T08:58:01.867577 #3672658] INFO -- : [111/885] 3713513=test_nil2vtempty I, [2024-05-04T08:58:01.875648 #3672658] INFO -- : [112/885] 3713513=test_date_time I, [2024-05-04T08:58:01.884899 #3672658] INFO -- : [113/885] 3713513=test_framework I, [2024-05-04T08:58:01.897171 #3672658] INFO -- : [114/885] 3713513=test_inadvertent_creation I, [2024-05-04T08:58:01.997254 #3672658] INFO -- : [115/885] 3713513=test_ansi_with_terminfo I, [2024-05-04T08:58:02.031781 #3672658] INFO -- : [116/885] 3713513=test_weakmap I, [2024-05-04T08:58:03.828616 #3672658] INFO -- : [117/885] 3713514=test_coderange I, [2024-05-04T08:58:03.865444 #3672658] INFO -- : [118/885] 3713514=test_pack I, [2024-05-04T08:58:03.882431 #3672658] INFO -- : [119/885] 3713514=test_cgi_tag_helper I, [2024-05-04T08:58:03.913387 #3672658] INFO -- : [120/885] 3713514=test_pinned I, [2024-05-04T08:58:03.941830 #3672658] INFO -- : [121/885] 3713514=test_string I, [2024-05-04T08:58:03.961828 #3672658] INFO -- : [122/885] 3713514=test_iterator I, [2024-05-04T08:58:04.039627 #3672658] INFO -- : [123/885] 3713514=test_gem_commands_install_command I, [2024-05-04T08:58:06.145292 #3672658] INFO -- : [124/885] 3713514=test_kernel I, [2024-05-04T08:58:06.829271 #3672658] INFO -- : [125/885] 3713514=test_rendering I, [2024-05-04T08:58:06.852279 #3672658] INFO -- : [126/885] 3713514=test_gem_rdoc I, [2024-05-04T08:58:07.009438 #3672658] INFO -- : [127/885] 3713514=test_dot_dot I, [2024-05-04T08:58:07.018559 #3672658] INFO -- : [128/885] 3713514=pattern_test I, [2024-05-04T08:58:07.043432 #3672658] INFO -- : [129/885] 3713514=test_shapes I, [2024-05-04T08:58:07.052224 #3672658] INFO -- : [130/885] 3713514=test_did_you_mean I, [2024-05-04T08:58:07.140794 #3672658] INFO -- : [131/885] 3713514=test_rdoc_extend I, [2024-05-04T08:58:07.155663 #3672658] INFO -- : [132/885] 3713514=test_cesu8 I, [2024-05-04T08:58:07.164127 #3672658] INFO -- : [133/885] 3713514=test_err_in_callback I, [2024-05-04T08:58:07.174336 #3672658] INFO -- : [134/885] 3713514=test_method_name_check I, [2024-05-04T08:58:07.218437 #3672658] INFO -- : [135/885] 3713514=test_storage I, [2024-05-04T08:58:07.232527 #3672658] INFO -- : [136/885] 3713514=test_merge_keys I, [2024-05-04T08:58:07.348514 #3672658] INFO -- : [137/885] 3713514=test_dir_m17n I, [2024-05-04T08:58:07.760871 #3672658] INFO -- : [138/885] 3713513=test_memory_view I, [2024-05-04T08:58:07.996920 #3672658] INFO -- : [139/885] 3713513=test_array_create I, [2024-05-04T08:58:08.006564 #3672658] INFO -- : [140/885] 3713513=test_complex I, [2024-05-04T08:58:08.092275 #3672658] INFO -- : [141/885] 3713513=test_threadgroup I, [2024-05-04T08:58:08.446571 #3672658] INFO -- : [142/885] 3713514=!Nothing_to_test I, [2024-05-04T08:58:08.451998 #3672658] INFO -- : [143/885] 3713514=test_process I, [2024-05-04T08:58:08.477386 #3672658] INFO -- : [144/885] 3713514=test_forwardable I, [2024-05-04T08:58:08.494122 #3672658] INFO -- : [145/885] 3713514=test_fd_setsize I, [2024-05-04T08:58:08.495976 #3672658] INFO -- : [146/885] 3713514=test_normalize I, [2024-05-04T08:58:08.502000 #3672658] INFO -- : [147/885] 3713514=test_emoji_breaks I, [2024-05-04T08:58:08.515758 #3672658] INFO -- : [148/885] 3713514=test_gem_commands_open_command I, [2024-05-04T08:58:08.636738 #3672658] INFO -- : [149/885] 3713514=test_verbose I, [2024-05-04T08:58:08.668950 #3672658] INFO -- : [150/885] 3713514=test_assignment I, [2024-05-04T08:58:09.113594 #3672658] INFO -- : [151/885] 3713513=test_gem_update_suggestion I, [2024-05-04T08:58:09.245040 #3672658] INFO -- : [152/885] 3713513=test_rdoc_generator_darkfish I, [2024-05-04T08:58:09.599439 #3672658] INFO -- : [153/885] 3713513=test_gem_resolver_lock_set I, [2024-05-04T08:58:09.623902 #3672658] INFO -- : [154/885] 3713513=test_random I, [2024-05-04T08:58:09.628016 #3672658] INFO -- : [155/885] 3713513=test_undef I, [2024-05-04T08:58:09.637718 #3672658] INFO -- : [156/885] 3713513=test_gem_command I, [2024-05-04T08:58:09.762780 #3672658] INFO -- : [157/885] 3713513=test_asn1 I, [2024-05-04T08:58:09.780312 #3672658] INFO -- : [158/885] 3713513=test_pp I, [2024-05-04T08:58:09.817531 #3672658] INFO -- : [159/885] 3713513=test_gem_impossible_dependencies_error I, [2024-05-04T08:58:09.826841 #3672658] INFO -- : [160/885] 3713513=test_exception I, [2024-05-04T08:58:09.962995 #3672658] INFO -- : [161/885] 3713513=test_raise_exception I, [2024-05-04T08:58:10.043811 #3672658] INFO -- : [162/885] 3713514=test_arith_seq_beg_len_step I, [2024-05-04T08:58:10.056617 #3672658] INFO -- : [163/885] 3713514=test_noarg I, [2024-05-04T08:58:10.176152 #3672658] INFO -- : [164/885] 3713514=test_gem_resolver_requirement_list I, [2024-05-04T08:58:10.180066 #3672658] INFO -- : [165/885] 3713514=memsize_test I, [2024-05-04T08:58:10.186693 #3672658] INFO -- : [166/885] 3713514=test_utf32 I, [2024-05-04T08:58:10.200407 #3672658] INFO -- : [167/885] 3713514=test_gem_resolver_git_specification I, [2024-05-04T08:58:10.467146 #3672658] INFO -- : [168/885] 3713513=test_basicinstructions I, [2024-05-04T08:58:10.529146 #3672658] INFO -- : [169/885] 3713514=test_date_ractor I, [2024-05-04T08:58:10.546572 #3672658] INFO -- : [170/885] 3713513=test_erb I, [2024-05-04T08:58:10.639065 #3672658] INFO -- : [171/885] 3713513=test_gem_security I, [2024-05-04T08:58:10.761906 #3672658] INFO -- : [172/885] 3713514=test_key_actor_emacs I, [2024-05-04T08:58:10.876652 #3672658] INFO -- : [173/885] 3713514=test_hash I, [2024-05-04T08:58:10.892430 #3672658] INFO -- : [174/885] 3713514=test_variable I, [2024-05-04T08:58:10.987429 #3672658] INFO -- : [175/885] 3713514=test_optarg I, [2024-05-04T08:58:11.061067 #3672658] INFO -- : [176/885] 3713514=test_gem_commands_pristine_command I, [2024-05-04T08:58:12.516714 #3672658] INFO -- : [177/885] 3713514=test_rdoc_tom_doc I, [2024-05-04T08:58:12.543973 #3672658] INFO -- : [178/885] 3713514=test_prettyprint I, [2024-05-04T08:58:12.562527 #3672658] INFO -- : [179/885] 3713514=test_gem_uri_formatter I, [2024-05-04T08:58:12.598855 #3672658] INFO -- : [180/885] 3713514=test_cgi_util I, [2024-05-04T08:58:12.681243 #3672658] INFO -- : [181/885] 3713512=test_ole_methods I, [2024-05-04T08:58:12.748777 #3672658] INFO -- : [182/885] 3713512=test_clone I, [2024-05-04T08:58:12.795520 #3672658] INFO -- : [183/885] 3713514=test_enc_raise I, [2024-05-04T08:58:12.804773 #3672658] INFO -- : [184/885] 3713514=test_queue I, [2024-05-04T08:58:12.814257 #3672658] INFO -- : [185/885] 3713514=test_boolean I, [2024-05-04T08:58:12.825794 #3672658] INFO -- : [186/885] 3713514=test_gem_resolver_lock_specification I, [2024-05-04T08:58:12.885867 #3672658] INFO -- : [187/885] 3713512=test_dryrun I, [2024-05-04T08:58:12.904523 #3672658] INFO -- : [188/885] 3713514=test_rdoc_i18n_locale I, [2024-05-04T08:58:12.916552 #3672658] INFO -- : [189/885] 3713512=test_gc_compact I, [2024-05-04T08:58:12.929651 #3672658] INFO -- : [190/885] 3713514=regexp_test I, [2024-05-04T08:58:12.957882 #3672658] INFO -- : [191/885] 3713514=test_remote_fetch_error I, [2024-05-04T08:58:12.989127 #3672658] INFO -- : [192/885] 3713514=test_show_source I, [2024-05-04T08:58:12.998467 #3672658] INFO -- : [193/885] 3713514=test_yield I, [2024-05-04T08:58:15.365859 #3672658] INFO -- : [194/885] 3713512=test_rubyoptions I, [2024-05-04T08:58:16.049532 #3672658] INFO -- : [195/885] 3713514=test_data_error I, [2024-05-04T08:58:16.055126 #3672658] INFO -- : [196/885] 3713514=test_files_sample I, [2024-05-04T08:58:16.140742 #3672658] INFO -- : [197/885] 3713514=test_rdoc_stats I, [2024-05-04T08:58:16.186479 #3672658] INFO -- : [198/885] 3713514=test_optimization I, [2024-05-04T08:58:18.916916 #3672658] INFO -- : [199/885] 3713513=test_force_exit I, [2024-05-04T08:58:18.972051 #3672658] INFO -- : [200/885] 3713513=test_rdoc_store I, [2024-05-04T08:58:19.651864 #3672658] INFO -- : [201/885] 3713513=test_shift_jis I, [2024-05-04T08:58:19.653872 #3672658] INFO -- : [202/885] 3713513=test_key_event_record I, [2024-05-04T08:58:19.674421 #3672658] INFO -- : [203/885] 3713513=test_date_parse I, [2024-05-04T08:58:19.783432 #3672658] INFO -- : [204/885] 3713513=test_mdns I, [2024-05-04T08:58:19.856596 #3672658] INFO -- : [205/885] 3713513=test_open3 I, [2024-05-04T08:58:21.758627 #3672658] INFO -- : [206/885] 3713512=test_thread I, [2024-05-04T08:58:21.764701 #3672658] INFO -- : [207/885] 3713512=test_arity I, [2024-05-04T08:58:21.776305 #3672658] INFO -- : [208/885] 3713512=test_pkey_ec I, [2024-05-04T08:58:21.794514 #3672658] INFO -- : [209/885] 3713512=test_svcb_https I, [2024-05-04T08:58:21.799166 #3672658] INFO -- : [210/885] 3713512=test_buffering I, [2024-05-04T08:58:21.802083 #3672658] INFO -- : [211/885] 3713512=test_gem_ext_cargo_builder_unit I, [2024-05-04T08:58:21.840305 #3672658] INFO -- : [212/885] 3713512=test_case_mapping I, [2024-05-04T08:58:21.853340 #3672658] INFO -- : [213/885] 3713512=test_rational I, [2024-05-04T08:58:21.896257 #3672658] INFO -- : [214/885] 3713512=test_rdoc_rubygems_hook I, [2024-05-04T08:58:22.015835 #3672658] INFO -- : [215/885] 3713512=test_gem_resolver_api_specification I, [2024-05-04T08:58:22.070528 #3672658] INFO -- : [216/885] 3713512=test_ractor I, [2024-05-04T08:58:22.088873 #3672658] INFO -- : [217/885] 3713512=test_webauthn_listener I, [2024-05-04T08:58:22.233723 #3672658] INFO -- : [218/885] 3713512=test_set I, [2024-05-04T08:58:22.311668 #3672658] INFO -- : [219/885] 3713512=test_rdoc_method_attr I, [2024-05-04T08:58:22.424186 #3672658] INFO -- : [220/885] 3713513=test_enumerable I, [2024-05-04T08:58:22.442216 #3672658] INFO -- : [221/885] 3713512=static_literals_test I, [2024-05-04T08:58:22.454762 #3672658] INFO -- : [222/885] 3713512=test_tree_spell_checker I, [2024-05-04T08:58:22.460283 #3672658] INFO -- : [223/885] 3713513=test_grapheme_breaks I, [2024-05-04T08:58:22.476548 #3672658] INFO -- : [224/885] 3713512=test_hash_create I, [2024-05-04T08:58:22.483362 #3672658] INFO -- : [225/885] 3713512=test_gem_spec_fetcher I, [2024-05-04T08:58:22.492715 #3672658] INFO -- : [226/885] 3713513=test_yamldbm I, [2024-05-04T08:58:22.496826 #3672658] INFO -- : [227/885] 3713513=test_default_gems I, [2024-05-04T08:58:22.549562 #3672658] INFO -- : [228/885] 3713513=test_switch_hitter I, [2024-05-04T08:58:22.564015 #3672658] INFO -- : [229/885] 3713513=test_unicode_escape I, [2024-05-04T08:58:22.649831 #3672658] INFO -- : [230/885] 3713513=test_gbk I, [2024-05-04T08:58:22.654827 #3672658] INFO -- : [231/885] 3713513=test_backtrace I, [2024-05-04T08:58:22.664863 #3672658] INFO -- : [232/885] 3713513=test_gem_commands_dependency_command I, [2024-05-04T08:58:22.679514 #3672658] INFO -- : [233/885] 3713512=test_win32ole_typelib I, [2024-05-04T08:58:22.684589 #3672658] INFO -- : [234/885] 3713512=test_external_new I, [2024-05-04T08:58:22.698025 #3672658] INFO -- : [235/885] 3713512=test_pkey I, [2024-05-04T08:58:22.708427 #3672658] INFO -- : [236/885] 3713512=test_bigzero I, [2024-05-04T08:58:22.709639 #3672658] INFO -- : [237/885] 3713512=test_gem_platform I, [2024-05-04T08:58:22.768053 #3672658] INFO -- : [238/885] 3713513=test_gem_commands_query_command I, [2024-05-04T08:58:22.831095 #3672658] INFO -- : [239/885] 3713512=test_null I, [2024-05-04T08:58:22.831930 #3672658] INFO -- : [240/885] 3713512=test_ractor I, [2024-05-04T08:58:22.898257 #3672658] INFO -- : [241/885] 3713512=test_memory_view I, [2024-05-04T08:58:22.912010 #3672658] INFO -- : [242/885] 3713512=test_data I, [2024-05-04T08:58:22.924881 #3672658] INFO -- : [243/885] 3713512=test_pkey_dh I, [2024-05-04T08:58:22.974161 #3672658] INFO -- : [244/885] 3713514=test_multi_irb_commands I, [2024-05-04T08:58:22.992719 #3672658] INFO -- : [245/885] 3713514=test_m17n_comb I, [2024-05-04T08:58:23.435190 #3672658] INFO -- : [246/885] 3713513=test_input_method I, [2024-05-04T08:58:23.486323 #3672658] INFO -- : [247/885] 3713513=test_io I, [2024-05-04T08:58:23.680269 #3672658] INFO -- : [248/885] 3713513=test_rdoc_i18n_text I, [2024-05-04T08:58:23.693014 #3672658] INFO -- : [249/885] 3713513=test_literal I, [2024-05-04T08:58:24.223923 #3672658] INFO -- : [250/885] 3713513=test_gem_unsatisfiable_dependency_error I, [2024-05-04T08:58:24.237084 #3672658] INFO -- : [251/885] 3713512=test_thread I, [2024-05-04T08:58:24.254970 #3672658] INFO -- : [252/885] 3713513=test_gem_util I, [2024-05-04T08:58:24.408235 #3672658] INFO -- : [253/885] 3713513=test_config I, [2024-05-04T08:58:24.459419 #3672658] INFO -- : [254/885] 3713513=test_complex2 I, [2024-05-04T08:58:24.468845 #3672658] INFO -- : [255/885] 3713512=test_gem_security_signer I, [2024-05-04T08:58:24.471160 #3672658] INFO -- : [256/885] 3713513=test_syntax I, [2024-05-04T08:58:24.560621 #3672658] INFO -- : [257/885] 3713512=test_scalar I, [2024-05-04T08:58:24.584663 #3672658] INFO -- : [258/885] 3713512=test_class_name_check I, [2024-05-04T08:58:24.629336 #3672658] INFO -- : [259/885] 3713512=test_basicsocket I, [2024-05-04T08:58:24.656822 #3672658] INFO -- : [260/885] 3713512=test_zsh_completion I, [2024-05-04T08:58:24.662883 #3672658] INFO -- : [261/885] 3713512=test_gem_commands_environment_command I, [2024-05-04T08:58:24.718722 #3672658] INFO -- : [262/885] 3713512=test_pkcs7 I, [2024-05-04T08:58:24.888450 #3672658] INFO -- : [263/885] 3713512=test_pack I, [2024-05-04T08:58:25.064504 #3672658] INFO -- : [264/885] 3713512=test_deprecated I, [2024-05-04T08:58:25.075062 #3672658] INFO -- : [265/885] 3713512=test_rdoc_context_section I, [2024-05-04T08:58:25.078344 #3672658] INFO -- : [266/885] 3713512=test_io_buffer I, [2024-05-04T08:58:25.203750 #3672658] INFO -- : [267/885] 3713512=test_optparse I, [2024-05-04T08:58:25.257347 #3672658] INFO -- : [268/885] 3713512=test_bash_completion I, [2024-05-04T08:58:25.269021 #3672658] INFO -- : [269/885] 3713512=test_exception I, [2024-05-04T08:58:26.077903 #3672658] INFO -- : [270/885] 3713514=test_files_test_2 I, [2024-05-04T08:58:26.091691 #3672658] INFO -- : [271/885] 3713514=test_div I, [2024-05-04T08:58:26.133675 #3672658] INFO -- : [272/885] 3713514=test_rdoc_markup_to_html_crossref I, [2024-05-04T08:58:26.486870 #3672658] INFO -- : [273/885] 3713514=test_fstring I, [2024-05-04T08:58:26.546108 #3672658] INFO -- : [274/885] 3713514=test_numeric I, [2024-05-04T08:58:26.552584 #3672658] INFO -- : [275/885] 3713514=test_singleton I, [2024-05-04T08:58:26.555940 #3672658] INFO -- : [276/885] 3713514=test_word I, [2024-05-04T08:58:26.571621 #3672658] INFO -- : [277/885] 3713514=test_rdoc_require I, [2024-05-04T08:58:26.630100 #3672658] INFO -- : [278/885] 3713514=test_gem_ext_rake_builder I, [2024-05-04T08:58:27.253681 #3672658] INFO -- : [279/885] 3713514=test_key_name_check I, [2024-05-04T08:58:27.264803 #3672658] INFO -- : [280/885] 3713514=test_rdoc_markup_to_bs I, [2024-05-04T08:58:27.299680 #3672658] INFO -- : [281/885] 3713514=test_rdoc_markup_raw I, [2024-05-04T08:58:27.397185 #3672658] INFO -- : [282/885] 3713514=test_timeout I, [2024-05-04T08:58:27.843678 #3672658] INFO -- : [283/885] 3713512=test_rdoc_alias I, [2024-05-04T08:58:27.855901 #3672658] INFO -- : [284/885] 3713512=test_instrumentation_api I, [2024-05-04T08:58:28.204216 #3672658] INFO -- : [285/885] 3713514=test_weakref I, [2024-05-04T08:58:28.391884 #3672658] INFO -- : [286/885] 3713514=ruby_parser_test I, [2024-05-04T08:58:28.405261 #3672658] INFO -- : [287/885] 3713514=test_gem_commands_stale_command I, [2024-05-04T08:58:28.520432 #3672658] INFO -- : [288/885] 3713514=test_date_strftime I, [2024-05-04T08:58:28.853274 #3672658] INFO -- : [289/885] 3713514=json_parser_test I, [2024-05-04T08:58:28.890660 #3672658] INFO -- : [290/885] 3713514=test_ws I, [2024-05-04T08:58:28.896206 #3672658] INFO -- : [291/885] 3713514=test_rdoc_markup_to_tt_only I, [2024-05-04T08:58:28.943273 #3672658] INFO -- : [292/885] 3713514=test_gem_commands_cert_command I, [2024-05-04T08:58:30.765701 #3672658] INFO -- : [293/885] 3713514=test_httpresponses I, [2024-05-04T08:58:30.813220 #3672658] INFO -- : [294/885] 3713514=test_rdoc_constant I, [2024-05-04T08:58:30.816706 #3672658] INFO -- : [295/885] 3713512=test_deprecate I, [2024-05-04T08:58:30.871507 #3672658] INFO -- : [296/885] 3713512=test_generic I, [2024-05-04T08:58:30.898659 #3672658] INFO -- : [297/885] 3713514=test_rdoc_markup_to_html_snippet I, [2024-05-04T08:58:30.904327 #3672658] INFO -- : [298/885] 3713512=test_common I, [2024-05-04T08:58:30.976627 #3672658] INFO -- : [299/885] 3713514=test_rdoc_encoding I, [2024-05-04T08:58:31.006886 #3672658] INFO -- : [300/885] 3713514=test_win32ole_variant_outarg I, [2024-05-04T08:58:31.014314 #3672658] INFO -- : [301/885] 3713514=test_postponed_job I, [2024-05-04T08:58:31.111950 #3672658] INFO -- : [302/885] 3713512=test_key_actor_vi I, [2024-05-04T08:58:31.269375 #3672658] INFO -- : [303/885] 3713512=test_rdoc_markdown I, [2024-05-04T08:58:31.333210 #3672658] INFO -- : [304/885] 3713514=test_gem_request_set_lockfile I, [2024-05-04T08:58:31.545970 #3672658] INFO -- : [305/885] 3713512=test_iseq_load I, [2024-05-04T08:58:31.832443 #3672658] INFO -- : [306/885] 3713514=test_rdoc_markup_parser I, [2024-05-04T08:58:31.862595 #3672658] INFO -- : [307/885] 3713513=test_rdoc_markup_indented_paragraph I, [2024-05-04T08:58:31.870245 #3672658] INFO -- : [308/885] 3713513=test_have_library I, [2024-05-04T08:58:31.897962 #3672658] INFO -- : [309/885] 3713514=test_stream I, [2024-05-04T08:58:31.918141 #3672658] INFO -- : [310/885] 3713514=test_ns_spki I, [2024-05-04T08:58:31.920018 #3672658] INFO -- : [311/885] 3713514=test_require I, [2024-05-04T08:58:31.927604 #3672658] INFO -- : [312/885] 3713514=test_stringify_symbols I, [2024-05-04T08:58:31.948744 #3672658] INFO -- : [313/885] 3713514=test_objspace I, [2024-05-04T08:58:32.697370 #3672658] INFO -- : [314/885] 3713512=test_rdoc_text I, [2024-05-04T08:58:32.729965 #3672658] INFO -- : [315/885] 3713513=library_symbols_test I, [2024-05-04T08:58:32.736938 #3672658] INFO -- : [316/885] 3713513=test_typeddata I, [2024-05-04T08:58:32.786215 #3672658] INFO -- : [317/885] 3713512=test_gem_commands_fetch_command I, [2024-05-04T08:58:32.946005 #3672658] INFO -- : [318/885] 3713512=test_tsort I, [2024-05-04T08:58:32.955926 #3672658] INFO -- : [319/885] 3713512=test_securerandom I, [2024-05-04T08:58:32.982019 #3672658] INFO -- : [320/885] 3713513=test_gem_dependency_list I, [2024-05-04T08:58:32.993352 #3672658] INFO -- : [321/885] 3713512=test_gem_commands_outdated_command I, [2024-05-04T08:58:33.052418 #3672658] INFO -- : [322/885] 3713512=test_rdoc_parser_changelog I, [2024-05-04T08:58:33.101368 #3672658] INFO -- : [323/885] 3713513=parameters_signature_test I, [2024-05-04T08:58:33.109471 #3672658] INFO -- : [324/885] 3713513=json_fixtures_test I, [2024-05-04T08:58:33.124632 #3672658] INFO -- : [325/885] 3713512=test_gem_doctor I, [2024-05-04T08:58:33.128703 #3672658] INFO -- : [326/885] 3713513=test_len I, [2024-05-04T08:58:33.134162 #3672658] INFO -- : [327/885] 3713513=test_pack I, [2024-05-04T08:58:33.179977 #3672658] INFO -- : [328/885] 3713512=test_io_wait I, [2024-05-04T08:58:33.384218 #3672658] INFO -- : [329/885] 3713513=test_kwargs I, [2024-05-04T08:58:33.394139 #3672658] INFO -- : [330/885] 3713513=test_rdoc_parser_c I, [2024-05-04T08:58:33.510536 #3672658] INFO -- : [331/885] 3713512=parse_test I, [2024-05-04T08:58:33.658392 #3672658] INFO -- : [332/885] 3713513=test_rdoc_code_object I, [2024-05-04T08:58:33.990442 #3672658] INFO -- : [333/885] 3713513=test_process I, [2024-05-04T08:58:36.379444 #3672658] INFO -- : [334/885] 3713512=test_gem_source_specific_file I, [2024-05-04T08:58:36.460420 #3672658] INFO -- : [335/885] 3713512=test_provider I, [2024-05-04T08:58:36.466950 #3672658] INFO -- : [336/885] 3713512=test_euc_kr I, [2024-05-04T08:58:36.480047 #3672658] INFO -- : [337/885] 3713512=test_bmethod I, [2024-05-04T08:58:36.489208 #3672658] INFO -- : [338/885] 3713512=redundant_return_test I, [2024-05-04T08:58:36.496465 #3672658] INFO -- : [339/885] 3713512=test_string_processing I, [2024-05-04T08:58:36.496938 #3672658] INFO -- : [340/885] 3713512=test_random_formatter I, [2024-05-04T08:58:36.513286 #3672658] INFO -- : [341/885] 3713512=test_rand I, [2024-05-04T08:58:36.851571 #3672658] INFO -- : [342/885] 3713512=test_rdoc_markup_attributes I, [2024-05-04T08:58:36.860864 #3672658] INFO -- : [343/885] 3713512=test_encoding I, [2024-05-04T08:58:37.043688 #3672658] INFO -- : [344/885] 3713512=test_hmac I, [2024-05-04T08:58:37.053083 #3672658] INFO -- : [345/885] 3713512=test_rdoc_generator_markup I, [2024-05-04T08:58:37.065773 #3672658] INFO -- : [346/885] 3713512=test_find I, [2024-05-04T08:58:37.424853 #3672658] INFO -- : [347/885] 3713512=test_constant I, [2024-05-04T08:58:39.097988 #3672658] INFO -- : [348/885] 3713512=test_gem_request_connection_pools I, [2024-05-04T08:58:40.207623 #3672658] INFO -- : [349/885] 3713512=test_init I, [2024-05-04T08:58:40.526504 #3672658] INFO -- : [350/885] 3713512=test_rat I, [2024-05-04T08:58:40.540400 #3672658] INFO -- : [351/885] 3713512=test_numeric I, [2024-05-04T08:58:40.611261 #3672658] INFO -- : [352/885] 3713512=test_bug-3571 I, [2024-05-04T08:58:40.620560 #3672658] INFO -- : [353/885] 3713512=test_yamlstore I, [2024-05-04T08:58:40.748964 #3672658] INFO -- : [354/885] 3713512=test_flags I, [2024-05-04T08:58:41.198403 #3672658] INFO -- : [355/885] 3713512=test_file I, [2024-05-04T08:58:41.221358 #3672658] INFO -- : [356/885] 3713512=test_time I, [2024-05-04T08:58:41.337594 #3672658] INFO -- : [357/885] 3713512=test_gem_commands_owner_command I, [2024-05-04T08:58:41.999489 #3672658] INFO -- : [358/885] 3713512=test_nextafter I, [2024-05-04T08:58:42.090666 #3672658] INFO -- : [359/885] 3713512=test_capacity I, [2024-05-04T08:58:42.095854 #3672658] INFO -- : [360/885] 3713512=parse_comments_test I, [2024-05-04T08:58:42.100928 #3672658] INFO -- : [361/885] 3713512=test_win32ole_method_event I, [2024-05-04T08:58:42.112072 #3672658] INFO -- : [362/885] 3713512=test_tcp I, [2024-05-04T08:58:42.260970 #3672658] INFO -- : [363/885] 3713512=test_integer I, [2024-05-04T08:58:42.283341 #3672658] INFO -- : [364/885] 3713512=test_gem_name_tuple I, [2024-05-04T08:58:42.306805 #3672658] INFO -- : [365/885] 3713512=test_rdoc_markup_to_table_of_contents I, [2024-05-04T08:58:42.342885 #3672658] INFO -- : [366/885] 3713512=test_gem_requirement I, [2024-05-04T08:58:42.526563 #3672658] INFO -- : [367/885] 3713512=test_pipe I, [2024-05-04T08:58:42.669773 #3672658] INFO -- : [368/885] 3713512=test_string I, [2024-05-04T08:58:51.128413 #3672658] INFO -- : [369/885] 3713513=test_macro I, [2024-05-04T08:58:51.138609 #3672658] INFO -- : [370/885] 3713513=test_gem_commands_server_command I, [2024-05-04T08:58:51.147597 #3672658] INFO -- : [371/885] 3713513=test_gem_resolver_activation_request I, [2024-05-04T08:58:51.167472 #3672658] INFO -- : [372/885] 3713513=test_function I, [2024-05-04T08:58:51.392259 #3672658] INFO -- : [373/885] 3713513=test_resource I, [2024-05-04T08:58:51.411774 #3672658] INFO -- : [374/885] 3713513=test_gem_package_tar_reader_entry I, [2024-05-04T08:58:51.684771 #3672658] INFO -- : [375/885] 3713513=test_gem_uri I, [2024-05-04T08:58:51.725290 #3672658] INFO -- : [376/885] 3713513=test_yield_block I, [2024-05-04T08:58:51.730295 #3672658] INFO -- : [377/885] 3713513=test_bug-5832 I, [2024-05-04T08:58:51.775369 #3672658] INFO -- : [378/885] 3713513=test_c_struct_builder I, [2024-05-04T08:58:51.983061 #3672658] INFO -- : [379/885] 3713513=test_path_to_class I, [2024-05-04T08:58:51.988031 #3672658] INFO -- : [380/885] 3713513=test_enumerator I, [2024-05-04T08:58:51.996526 #3672658] INFO -- : [381/885] 3713513=test_reqarg I, [2024-05-04T08:58:52.362412 #3672658] INFO -- : [382/885] 3713513=test_gem_version I, [2024-05-04T08:58:52.483277 #3672658] INFO -- : [383/885] 3713513=test_spell_checker I, [2024-05-04T08:58:52.592303 #3672658] INFO -- : [384/885] 3713513=test_gem_ext_ext_conf_builder I, [2024-05-04T08:58:53.589883 #3672658] INFO -- : [385/885] 3713513=test_frozen_error I, [2024-05-04T08:58:53.591902 #3672658] INFO -- : [386/885] 3713513=test_console_attr I, [2024-05-04T08:58:53.617658 #3672658] INFO -- : [387/885] 3713513=test_proc I, [2024-05-04T08:58:54.634417 #3672658] INFO -- : [388/885] 3713513=test_gem_ext_cargo_builder I, [2024-05-04T08:58:54.663313 #3672658] INFO -- : [389/885] 3713513=test_gem_commands_unpack_command I, [2024-05-04T08:58:55.013620 #3672658] INFO -- : [390/885] 3713513=test_rdoc_options I, [2024-05-04T08:58:55.618739 #3672658] INFO -- : [391/885] 3713513=test_zlib I, [2024-05-04T08:59:03.259451 #3672658] INFO -- : [392/885] 3713513=test_pstore I, [2024-05-04T08:59:03.467464 #3672658] INFO -- : [393/885] 3713513=test_ubf_async_safe I, [2024-05-04T08:59:03.483445 #3672658] INFO -- : [394/885] 3713513=test_gem_version_option I, [2024-05-04T08:59:03.597694 #3672658] INFO -- : [395/885] 3713513=test_win32ole_record I, [2024-05-04T08:59:03.598405 #3672658] INFO -- : [396/885] 3713513=test_rdoc_include I, [2024-05-04T08:59:03.639495 #3672658] INFO -- : [397/885] 3713513=test_date_compat I, [2024-05-04T08:59:03.649317 #3672658] INFO -- : [398/885] 3713513=test_yaml_tree I, [2024-05-04T08:59:03.674673 #3672658] INFO -- : [399/885] 3713513=test_gem_commands_yank_command I, [2024-05-04T08:59:04.216399 #3672658] INFO -- : [400/885] 3713513=test_command I, [2024-05-04T08:59:04.457065 #3672658] INFO -- : [401/885] 3713513=test_euc_tw I, [2024-05-04T08:59:04.467183 #3672658] INFO -- : [402/885] 3713513=test_gem_resolver_dependency_request I, [2024-05-04T08:59:04.553621 #3672658] INFO -- : [403/885] 3713513=test_cstr I, [2024-05-04T08:59:05.850655 #3672658] INFO -- : [404/885] 3713514=test_gem_resolver_specification I, [2024-05-04T08:59:05.887744 #3672658] INFO -- : [405/885] 3713514=test_big2str I, [2024-05-04T08:59:05.902485 #3672658] INFO -- : [406/885] 3713514=test_logger I, [2024-05-04T08:59:05.922771 #3672658] INFO -- : [407/885] 3713514=test_pkey_dsa I, [2024-05-04T08:59:06.227471 #3672658] INFO -- : [408/885] 3713513=test_import I, [2024-05-04T08:59:06.706364 #3672658] INFO -- : [409/885] 3713512=test_human_typo I, [2024-05-04T08:59:06.712076 #3672658] INFO -- : [410/885] 3713512=test_wait I, [2024-05-04T08:59:06.766250 #3672658] INFO -- : [411/885] 3713512=test_nil I, [2024-05-04T08:59:06.776024 #3672658] INFO -- : [412/885] 3713512=test_psych I, [2024-05-04T08:59:06.814230 #3672658] INFO -- : [413/885] 3713512=test_io_buffer I, [2024-05-04T08:59:06.877435 #3672658] INFO -- : [414/885] 3713512=test_kdf I, [2024-05-04T08:59:06.944538 #3672658] INFO -- : [415/885] 3713512=test_ldap I, [2024-05-04T08:59:06.951929 #3672658] INFO -- : [416/885] 3713512=test_passing_block I, [2024-05-04T08:59:06.957682 #3672658] INFO -- : [417/885] 3713512=test_defined I, [2024-05-04T08:59:07.039094 #3672658] INFO -- : [418/885] 3713512=test_nowrite I, [2024-05-04T08:59:07.100220 #3672658] INFO -- : [419/885] 3713512=test_thread_queue I, [2024-05-04T08:59:08.228276 #3672658] INFO -- : [420/885] 3713513=test_gem_config_file I, [2024-05-04T08:59:08.478263 #3672658] INFO -- : [421/885] 3713513=json_string_matching_test I, [2024-05-04T08:59:08.484682 #3672658] INFO -- : [422/885] 3713513=test_comparable I, [2024-05-04T08:59:08.486769 #3672658] INFO -- : [423/885] 3713513=test_yjit_exit_locations I, [2024-05-04T08:59:08.492798 #3672658] INFO -- : [424/885] 3713513=test_rdoc_rdoc I, [2024-05-04T08:59:08.551070 #3672658] INFO -- : [425/885] 3713513=test_type_completor I, [2024-05-04T08:59:08.563518 #3672658] INFO -- : [426/885] 3713513=test_rdoc_normal_module I, [2024-05-04T08:59:08.592434 #3672658] INFO -- : [427/885] 3713513=test_io_timeout I, [2024-05-04T08:59:08.598188 #3672658] INFO -- : [428/885] 3713514=test_rdoc_markdown_test I, [2024-05-04T08:59:08.602836 #3672658] INFO -- : [429/885] 3713513=test_rdoc_generator_pot_po_entry I, [2024-05-04T08:59:08.613246 #3672658] INFO -- : [430/885] 3713513=test_erb_m17n I, [2024-05-04T08:59:08.621759 #3672658] INFO -- : [431/885] 3713513=test_timeout I, [2024-05-04T08:59:08.629310 #3672658] INFO -- : [432/885] 3713513=test_date_conv I, [2024-05-04T08:59:08.633162 #3672658] INFO -- : [433/885] 3713513=test_rdoc_markup_verbatim I, [2024-05-04T08:59:08.643618 #3672658] INFO -- : [434/885] 3713513=test_webauthn_poller I, [2024-05-04T08:59:08.808079 #3672658] INFO -- : [435/885] 3713513=test_egrep_cpp I, [2024-05-04T08:59:08.889169 #3672658] INFO -- : [436/885] 3713513=test_frozen I, [2024-05-04T08:59:08.894213 #3672658] INFO -- : [437/885] 3713513=test_serialize_subclasses I, [2024-05-04T08:59:08.906468 #3672658] INFO -- : [438/885] 3713513=test_gem_resolver_index_specification I, [2024-05-04T08:59:08.960948 #3672658] INFO -- : [439/885] 3713513=test_tree_builder I, [2024-05-04T08:59:08.968472 #3672658] INFO -- : [440/885] 3713513=test_date I, [2024-05-04T08:59:08.973591 #3672658] INFO -- : [441/885] 3713513=test_big5 I, [2024-05-04T08:59:09.001133 #3672658] INFO -- : [442/885] 3713513=test_gem_commands_update_command I, [2024-05-04T08:59:09.779218 #3672658] INFO -- : [443/885] 3713514=test_protect I, [2024-05-04T08:59:09.792853 #3672658] INFO -- : [444/885] 3713514=test_pathname I, [2024-05-04T08:59:10.026995 #3672658] INFO -- : [445/885] 3713514=test_fnmatch I, [2024-05-04T08:59:10.076757 #3672658] INFO -- : [446/885] 3713514=test_coverage I, [2024-05-04T08:59:10.489638 #3672658] INFO -- : [447/885] 3713513=test_tempfile I, [2024-05-04T08:59:10.677267 #3672658] INFO -- : [448/885] 3713513=test_http_request I, [2024-05-04T08:59:10.682733 #3672658] INFO -- : [449/885] 3713513=test_store I, [2024-05-04T08:59:10.822878 #3672658] INFO -- : [450/885] 3713514=test_rdoc_markup_pre_process I, [2024-05-04T08:59:10.948529 #3672658] INFO -- : [451/885] 3713513=json_common_interface_test I, [2024-05-04T08:59:10.954734 #3672658] INFO -- : [452/885] 3713514=test_string I, [2024-05-04T08:59:10.963899 #3672658] INFO -- : [453/885] 3713513=test_function_entry I, [2024-05-04T08:59:10.964870 #3672658] INFO -- : [454/885] 3713513=test_error_highlight I, [2024-05-04T08:59:10.977407 #3672658] INFO -- : [455/885] 3713514=test_rdoc_any_method I, [2024-05-04T08:59:11.352397 #3672658] INFO -- : [456/885] 3713514=test_raise I, [2024-05-04T08:59:11.360141 #3672658] INFO -- : [457/885] 3713514=test_complexrational I, [2024-05-04T08:59:11.363610 #3672658] INFO -- : [458/885] 3713514=version_test I, [2024-05-04T08:59:11.368402 #3672658] INFO -- : [459/885] 3713514=test_files_lib I, [2024-05-04T08:59:11.372515 #3672658] INFO -- : [460/885] 3713514=test_help I, [2024-05-04T08:59:11.377321 #3672658] INFO -- : [461/885] 3713514=test_string_memory I, [2024-05-04T08:59:11.547316 #3672658] INFO -- : [462/885] 3713514=test_enumerator_kw I, [2024-05-04T08:59:11.549242 #3672658] INFO -- : [463/885] 3713514=test_line_editor I, [2024-05-04T08:59:11.562054 #3672658] INFO -- : [464/885] 3713514=test_marshalable I, [2024-05-04T08:59:11.571476 #3672658] INFO -- : [465/885] 3713514=reflection_test I, [2024-05-04T08:59:11.580159 #3672658] INFO -- : [466/885] 3713514=test_cgi_session I, [2024-05-04T08:59:11.593580 #3672658] INFO -- : [467/885] 3713514=test_notimplement I, [2024-05-04T08:59:11.601254 #3672658] INFO -- : [468/885] 3713514=test_c_union_entity I, [2024-05-04T08:59:11.632052 #3672658] INFO -- : [469/885] 3713513=test_dns I, [2024-05-04T08:59:11.735786 #3672658] INFO -- : [470/885] 3713514=test_x509crl I, [2024-05-04T08:59:11.835222 #3672658] INFO -- : [471/885] 3713514=test_rdoc_markup_heading I, [2024-05-04T08:59:11.865759 #3672658] INFO -- : [472/885] 3713514=test_io_console I, [2024-05-04T08:59:11.880326 #3672658] INFO -- : [473/885] 3713512=test_flip I, [2024-05-04T08:59:11.905372 #3672658] INFO -- : [474/885] 3713512=test_pattern_key_name_check I, [2024-05-04T08:59:11.911532 #3672658] INFO -- : [475/885] 3713512=test_profile_frames I, [2024-05-04T08:59:12.075717 #3672658] INFO -- : [476/885] 3713512=test_transcode I, [2024-05-04T08:59:12.137376 #3672658] INFO -- : [477/885] 3713513=test_refinement I, [2024-05-04T08:59:12.310007 #3672658] INFO -- : [478/885] 3713512=test_debug I, [2024-05-04T08:59:12.322544 #3672658] INFO -- : [479/885] 3713512=test_gem_commands_cleanup_command I, [2024-05-04T08:59:12.901173 #3672658] INFO -- : [480/885] 3713512=test_class2name I, [2024-05-04T08:59:12.912583 #3672658] INFO -- : [481/885] 3713512=test_digest_extend I, [2024-05-04T08:59:12.942994 #3672658] INFO -- : [482/885] 3713512=test_gem_ext_cmake_builder I, [2024-05-04T08:59:12.948627 #3672658] INFO -- : [483/885] 3713512=test_thread_fd_close I, [2024-05-04T08:59:12.992764 #3672658] INFO -- : [484/885] 3713512=test_last_thread I, [2024-05-04T08:59:14.008071 #3672658] INFO -- : [485/885] 3713512=test_getopts I, [2024-05-04T08:59:14.017857 #3672658] INFO -- : [486/885] 3713512=test_alias I, [2024-05-04T08:59:14.213540 #3672658] INFO -- : [487/885] 3713512=test_fips I, [2024-05-04T08:59:14.420657 #3672658] INFO -- : [488/885] 3713512=test_emitter I, [2024-05-04T08:59:14.442869 #3672658] INFO -- : [489/885] 3713512=test_compile_prism I, [2024-05-04T08:59:14.481749 #3672658] INFO -- : [490/885] 3713514=test_helper I, [2024-05-04T08:59:14.483674 #3672658] INFO -- : [491/885] 3713514=test_win32ole_event I, [2024-05-04T08:59:14.538020 #3672658] INFO -- : [492/885] 3713514=test_gem_commands_uninstall_command I, [2024-05-04T08:59:14.732807 #3672658] INFO -- : [493/885] 3713512=test_rdoc_markup_formatter I, [2024-05-04T08:59:14.743094 #3672658] INFO -- : [494/885] 3713512=test_pkg_config I, [2024-05-04T08:59:14.750255 #3672658] INFO -- : [495/885] 3713512=test_gem_available_set I, [2024-05-04T08:59:14.856935 #3672658] INFO -- : [496/885] 3713512=test_modify_expand I, [2024-05-04T08:59:14.876778 #3672658] INFO -- : [497/885] 3713512=errors_test I, [2024-05-04T08:59:14.940334 #3672658] INFO -- : [498/885] 3713512=test_convertible I, [2024-05-04T08:59:15.440220 #3672658] INFO -- : [499/885] 3713514=test_func I, [2024-05-04T08:59:15.676700 #3672658] INFO -- : [500/885] 3713513=test_config I, [2024-05-04T08:59:15.756356 #3672658] INFO -- : [501/885] 3713513=test_vm_dump I, [2024-05-04T08:59:15.765687 #3672658] INFO -- : [502/885] 3713513=json_encoding_test I, [2024-05-04T08:59:15.778607 #3672658] INFO -- : [503/885] 3713513=test_gem_source_vendor I, [2024-05-04T08:59:15.802120 #3672658] INFO -- : [504/885] 3713513=test_gem_resolver I, [2024-05-04T08:59:16.168265 #3672658] INFO -- : [505/885] 3713513=test_object I, [2024-05-04T08:59:16.480786 #3672658] INFO -- : [506/885] 3713513=test_dln I, [2024-05-04T08:59:16.530438 #3672658] INFO -- : [507/885] 3713513=unescape_test I, [2024-05-04T08:59:17.995582 #3672658] INFO -- : [508/885] 3713513=test_gem_commands_exec_command I, [2024-05-04T08:59:18.575233 #3672658] INFO -- : [509/885] 3713512=test_color_printer I, [2024-05-04T08:59:18.587650 #3672658] INFO -- : [510/885] 3713512=test_super I, [2024-05-04T08:59:19.387185 #3672658] INFO -- : [511/885] 3713514=test_readpartial I, [2024-05-04T08:59:19.404703 #3672658] INFO -- : [512/885] 3713513=test_httpresponse I, [2024-05-04T08:59:19.442736 #3672658] INFO -- : [513/885] 3713513=test_rdoc_parser_ruby I, [2024-05-04T08:59:19.782554 #3672658] INFO -- : [514/885] 3713514=test_x509req I, [2024-05-04T08:59:19.806484 #3672658] INFO -- : [515/885] 3713514=test_ifunless I, [2024-05-04T08:59:19.814388 #3672658] INFO -- : [516/885] 3713514=test_allocation I, [2024-05-04T08:59:19.893774 #3672658] INFO -- : [517/885] 3713512=test_gem_console_ui I, [2024-05-04T08:59:19.905331 #3672658] INFO -- : [518/885] 3713512=test_insns_leaf I, [2024-05-04T08:59:19.910722 #3672658] INFO -- : [519/885] 3713512=test_kill_ring I, [2024-05-04T08:59:19.926675 #3672658] INFO -- : [520/885] 3713512=test_addr I, [2024-05-04T08:59:19.944721 #3672658] INFO -- : [521/885] 3713512=test_mailto I, [2024-05-04T08:59:19.946744 #3672658] INFO -- : [522/885] 3713512=test_object I, [2024-05-04T08:59:19.957799 #3672658] INFO -- : [523/885] 3713512=test_member I, [2024-05-04T08:59:19.960118 #3672658] INFO -- : [524/885] 3713512=test_cgi_header I, [2024-05-04T08:59:19.972291 #3672658] INFO -- : [525/885] 3713512=format_errors_test I, [2024-05-04T08:59:19.976699 #3672658] INFO -- : [526/885] 3713512=test_case_options I, [2024-05-04T08:59:19.981449 #3672658] INFO -- : [527/885] 3713512=test_helper I, [2024-05-04T08:59:19.988768 #3672658] INFO -- : [528/885] 3713512=test_gem_resolver_api_set I, [2024-05-04T08:59:20.094703 #3672658] INFO -- : [529/885] 3713512=test_duplicate I, [2024-05-04T08:59:20.110701 #3672658] INFO -- : [530/885] 3713512=test_gem_installer I, [2024-05-04T08:59:20.135321 #3672658] INFO -- : [531/885] 3713513=test_bug_reporter I, [2024-05-04T08:59:20.316192 #3672658] INFO -- : [532/885] 3713513=test_ossl I, [2024-05-04T08:59:22.208187 #3672658] INFO -- : [533/885] 3713514=test_buffered_io I, [2024-05-04T08:59:22.215275 #3672658] INFO -- : [534/885] 3713514=compiler_test I, [2024-05-04T08:59:22.217239 #3672658] INFO -- : [535/885] 3713514=test_arith_seq_extract I, [2024-05-04T08:59:22.224209 #3672658] INFO -- : [536/885] 3713514=test_ruby_lex I, [2024-05-04T08:59:22.352273 #3672658] INFO -- : [537/885] 3713514=test_object_references I, [2024-05-04T08:59:22.395326 #3672658] INFO -- : [538/885] 3713514=test_gem_source_subpath_problem I, [2024-05-04T08:59:22.482950 #3672658] INFO -- : [539/885] 3713514=test_monitor I, [2024-05-04T08:59:22.700630 #3672658] INFO -- : [540/885] 3713514=test_beginendblock I, [2024-05-04T08:59:23.060816 #3672658] INFO -- : [541/885] 3713514=test_eval I, [2024-05-04T08:59:23.362681 #3672658] INFO -- : [542/885] 3713514=test_nofree I, [2024-05-04T08:59:23.390275 #3672658] INFO -- : [543/885] 3713514=test_regexp I, [2024-05-04T08:59:25.063542 #3672658] INFO -- : [544/885] 3713512=test_whileuntil I, [2024-05-04T08:59:25.078373 #3672658] INFO -- : [545/885] 3713512=test_rdoc_normal_class I, [2024-05-04T08:59:25.123964 #3672658] INFO -- : [546/885] 3713512=test_within_pipe I, [2024-05-04T08:59:25.192921 #3672658] INFO -- : [547/885] 3713512=test_pointer I, [2024-05-04T08:59:26.663999 #3672658] INFO -- : [548/885] 3713512=test_scalar_scanner I, [2024-05-04T08:59:26.673123 #3672658] INFO -- : [549/885] 3713512=test_rb_str_dup I, [2024-05-04T08:59:26.681281 #3672658] INFO -- : [550/885] 3713512=test_lambda I, [2024-05-04T08:59:26.763106 #3672658] INFO -- : [551/885] 3713512=test_trace I, [2024-05-04T08:59:26.774799 #3672658] INFO -- : [552/885] 3713512=test_gem_path_support I, [2024-05-04T08:59:26.814123 #3672658] INFO -- : [553/885] 3713512=test_arity I, [2024-05-04T08:59:26.819105 #3672658] INFO -- : [554/885] 3713512=test_win32ole_type_event I, [2024-05-04T08:59:26.861586 #3672658] INFO -- : [555/885] 3713512=test_keyword I, [2024-05-04T08:59:27.353701 #3672658] INFO -- : [556/885] 3713512=test_foreach I, [2024-05-04T08:59:27.364849 #3672658] INFO -- : [557/885] 3713512=test_rdoc_markup_to_html I, [2024-05-04T08:59:27.475529 #3672658] INFO -- : [558/885] 3713512=test_gem_resolver_installer_set I, [2024-05-04T08:59:27.733763 #3672658] INFO -- : [559/885] 3713512=test_append I, [2024-05-04T08:59:27.742012 #3672658] INFO -- : [560/885] 3713512=test_x509ext I, [2024-05-04T08:59:27.749486 #3672658] INFO -- : [561/885] 3713512=test_emitter I, [2024-05-04T08:59:27.760964 #3672658] INFO -- : [562/885] 3713512=test_summary I, [2024-05-04T08:59:27.824132 #3672658] INFO -- : [563/885] 3713512=test_helper_method I, [2024-05-04T08:59:27.912053 #3672658] INFO -- : [564/885] 3713512=test_config I, [2024-05-04T08:59:28.119501 #3672658] INFO -- : [565/885] 3713513=test_file I, [2024-05-04T08:59:28.229739 #3672658] INFO -- : [566/885] 3713512=bom_test I, [2024-05-04T08:59:28.267594 #3672658] INFO -- : [567/885] 3713512=test_ensured I, [2024-05-04T08:59:28.307375 #3672658] INFO -- : [568/885] 3713512=test_key_stroke I, [2024-05-04T08:59:28.315077 #3672658] INFO -- : [569/885] 3713512=test_rdoc_markup I, [2024-05-04T08:59:28.324159 #3672658] INFO -- : [570/885] 3713512=test_euc_jp I, [2024-05-04T08:59:28.331391 #3672658] INFO -- : [571/885] 3713512=test_alias_and_anchor I, [2024-05-04T08:59:28.337436 #3672658] INFO -- : [572/885] 3713512=test_popen_deadlock I, [2024-05-04T08:59:28.874605 #3672658] INFO -- : [573/885] 3713512=test_time I, [2024-05-04T08:59:29.036254 #3672658] INFO -- : [574/885] 3713512=test_symbol I, [2024-05-04T08:59:29.090105 #3672658] INFO -- : [575/885] 3713512=test_project_sanity I, [2024-05-04T08:59:29.104850 #3672658] INFO -- : [576/885] 3713512=location_test I, [2024-05-04T08:59:29.203964 #3672658] INFO -- : [577/885] 3713512=test_delegate I, [2024-05-04T08:59:29.218950 #3672658] INFO -- : [578/885] 3713512=test_chilled I, [2024-05-04T08:59:29.223915 #3672658] INFO -- : [579/885] 3713512=test_folderitem2_invokeverb I, [2024-05-04T08:59:29.230381 #3672658] INFO -- : [580/885] 3713512=test_set_len I, [2024-05-04T08:59:29.236647 #3672658] INFO -- : [581/885] 3713512=constant_path_node_test I, [2024-05-04T08:59:29.241705 #3672658] INFO -- : [582/885] 3713512=test_interned_str I, [2024-05-04T08:59:29.260916 #3672658] INFO -- : [583/885] 3713512=test_pattern_matching I, [2024-05-04T08:59:29.282353 #3672658] INFO -- : [584/885] 3713512=test_gc I, [2024-05-04T08:59:34.321291 #3672658] INFO -- : [585/885] 3713513=test_gem_request_set I, [2024-05-04T08:59:34.923955 #3672658] INFO -- : [586/885] 3713513=test_gem_bundler_version_finder I, [2024-05-04T08:59:34.980676 #3672658] INFO -- : [587/885] 3713513=ruby_api_test I, [2024-05-04T08:59:35.191829 #3672658] INFO -- : [588/885] 3713513=test_gem_resolver_index_set I, [2024-05-04T08:59:35.240337 #3672658] INFO -- : [589/885] 3713513=test_webauthn_listener_response I, [2024-05-04T08:59:38.047850 #3672658] INFO -- : [590/885] 3713513=test_sleep I, [2024-05-04T08:59:38.636085 #3672658] INFO -- : [591/885] 3713512=test_time_tz I, [2024-05-04T08:59:38.686810 #3672658] INFO -- : [592/885] 3713512=test_addrinfo I, [2024-05-04T08:59:38.720294 #3672658] INFO -- : Leaked file descriptor: TestSocketAddrinfo#test_addrinfo_timeout: 10 # I, [2024-05-04T08:59:38.755350 #3672658] INFO -- : COMMAND PID USER FD TYPE DEVICE SIZE/OFF NODE NAME I, [2024-05-04T08:59:38.755424 #3672658] INFO -- : ruby 3713512 opc 10u unix 0x0000000000000000 0t0 2834273789 type=STREAM I, [2024-05-04T08:59:38.832751 #3672658] INFO -- : [593/885] 3713512=test_to_ruby I, [2024-05-04T08:59:38.841528 #3672658] INFO -- : [594/885] 3713512=test_data I, [2024-05-04T08:59:38.906710 #3672658] INFO -- : [595/885] 3713512=test_bug-14834 I, [2024-05-04T08:59:38.918834 #3672658] INFO -- : [596/885] 3713512=test_socket I, [2024-05-04T08:59:39.817438 #3672658] INFO -- : [597/885] 3713512=test_terminfo I, [2024-05-04T08:59:39.826826 #3672658] INFO -- : [598/885] 3713512=test_inlinecache I, [2024-05-04T08:59:39.890458 #3672658] INFO -- : [599/885] 3713512=test_thread I, [2024-05-04T08:59:40.284726 #3672658] INFO -- : [600/885] 3713513=test_reline I, [2024-05-04T08:59:40.479546 #3672658] INFO -- : [601/885] 3713513=test_gem_commands_build_command I, [2024-05-04T08:59:40.978934 #3672658] INFO -- : [602/885] 3713513=test_ellipsize I, [2024-05-04T08:59:41.007506 #3672658] INFO -- : [603/885] 3713513=test_call I, [2024-05-04T08:59:41.363435 #3672658] INFO -- : [604/885] 3713513=test_windows_1251 I, [2024-05-04T08:59:41.376623 #3672658] INFO -- : [605/885] 3713513=test_gem_ext_builder I, [2024-05-04T08:59:42.484368 #3672658] INFO -- : [606/885] 3713513=test_history I, [2024-05-04T08:59:46.173655 #3672658] INFO -- : [607/885] 3713513=test_to_ary_concat I, [2024-05-04T08:59:46.182192 #3672658] INFO -- : [608/885] 3713513=test_parser I, [2024-05-04T08:59:46.198022 #3672658] INFO -- : [609/885] 3713513=test_rdoc_markup_to_label I, [2024-05-04T08:59:46.240030 #3672658] INFO -- : [610/885] 3713513=test_gem_resolver_best_set I, [2024-05-04T08:59:46.327579 #3672658] INFO -- : [611/885] 3713513=test_cgi_core I, [2024-05-04T08:59:46.351944 #3672658] INFO -- : [612/885] 3713513=test_gem I, [2024-05-04T08:59:48.716154 #3672658] INFO -- : [613/885] 3713513=test_registry I, [2024-05-04T08:59:48.719931 #3672658] INFO -- : [614/885] 3713513=test_ansi_without_terminfo I, [2024-05-04T08:59:48.730105 #3672658] INFO -- : [615/885] 3713513=json_generator_test I, [2024-05-04T08:59:48.854760 #3672658] INFO -- : [616/885] 3713513=test_ractor I, [2024-05-04T08:59:48.884076 #3672658] INFO -- : [617/885] 3713513=test_gem_resolver_conflict I, [2024-05-04T08:59:48.929788 #3672658] INFO -- : [618/885] 3713513=test_ractor I, [2024-05-04T08:59:49.259419 #3672658] INFO -- : [619/885] 3713513=test_ssl I, [2024-05-04T08:59:49.284071 #3672658] INFO -- : [620/885] 3713512=test_gem_commands_help_command I, [2024-05-04T08:59:49.364864 #3672658] INFO -- : [621/885] 3713512=test_scheduler I, [2024-05-04T08:59:49.464795 #3672658] INFO -- : [622/885] 3713513=test_enc_str_buf_cat I, [2024-05-04T08:59:49.479443 #3672658] INFO -- : [623/885] 3713514=test_bignum I, [2024-05-04T08:59:49.494622 #3672658] INFO -- : [624/885] 3713513=newline_test I, [2024-05-04T08:59:49.543980 #3672658] INFO -- : [625/885] 3713512=test_rdoc_markup_hard_break I, [2024-05-04T08:59:49.546568 #3672658] INFO -- : [626/885] 3713512=test_nesting_parser I, [2024-05-04T08:59:49.566667 #3672658] INFO -- : [627/885] 3713512=test_marshal I, [2024-05-04T08:59:49.578331 #3672658] INFO -- : [628/885] 3713513=test_ancdata I, [2024-05-04T08:59:49.589225 #3672658] INFO -- : [629/885] 3713513=ractor_test I, [2024-05-04T08:59:49.648877 #3672658] INFO -- : [630/885] 3713513=test_rdoc_servlet I, [2024-05-04T08:59:49.764898 #3672658] INFO -- : [631/885] 3713513=test_coder I, [2024-05-04T08:59:49.783721 #3672658] INFO -- : [632/885] 3713513=test_symbol I, [2024-05-04T08:59:51.066250 #3672658] INFO -- : [633/885] 3713512=test_gem_commands_search_command I, [2024-05-04T08:59:51.079428 #3672658] INFO -- : [634/885] 3713512=test_context I, [2024-05-04T08:59:51.176670 #3672658] INFO -- : [635/885] 3713512=test_udp I, [2024-05-04T08:59:51.193617 #3672658] INFO -- : [636/885] 3713512=test_gem_commands_contents_command I, [2024-05-04T08:59:51.325564 #3672658] INFO -- : [637/885] 3713512=test_formatter I, [2024-05-04T08:59:51.338391 #3672658] INFO -- : [638/885] 3713512=test_unix I, [2024-05-04T08:59:51.569800 #3672658] INFO -- : [639/885] 3713512=test_integer I, [2024-05-04T08:59:53.389268 #3672658] INFO -- : [640/885] 3713514=test_have_func I, [2024-05-04T08:59:54.016171 #3672658] INFO -- : [641/885] 3713512=test_date_marshal I, [2024-05-04T08:59:54.034181 #3672658] INFO -- : [642/885] 3713512=test_gem_commands_list_command I, [2024-05-04T08:59:54.045076 #3672658] INFO -- : [643/885] 3713512=test_date_new I, [2024-05-04T08:59:54.058262 #3672658] INFO -- : [644/885] 3713512=test_configuration I, [2024-05-04T08:59:54.172306 #3672658] INFO -- : [645/885] 3713512=test_gem_resolver_local_specification I, [2024-05-04T08:59:54.215159 #3672658] INFO -- : [646/885] 3713512=test_trick I, [2024-05-04T08:59:54.535081 #3672658] INFO -- : [647/885] 3713514=test_ractor I, [2024-05-04T08:59:54.544209 #3672658] INFO -- : [648/885] 3713514=test_stream I, [2024-05-04T08:59:54.551241 #3672658] INFO -- : [649/885] 3713514=test_address_resolve I, [2024-05-04T08:59:54.567980 #3672658] INFO -- : [650/885] 3713514=test_rdoc_attr I, [2024-05-04T08:59:54.573731 #3672658] INFO -- : [651/885] 3713514=test_locale I, [2024-05-04T08:59:54.666256 #3672658] INFO -- : [652/885] 3713514=test_ts I, [2024-05-04T08:59:54.947156 #3672658] INFO -- : [653/885] 3713514=test_rbconfig I, [2024-05-04T08:59:54.965168 #3672658] INFO -- : [654/885] 3713514=test_num2int I, [2024-05-04T08:59:54.990301 #3672658] INFO -- : [655/885] 3713514=test_gem_commands_signin_command I, [2024-05-04T08:59:55.135906 #3672658] INFO -- : [656/885] 3713513=test_range I, [2024-05-04T08:59:55.157304 #3672658] INFO -- : [657/885] 3713514=test_iter_break I, [2024-05-04T08:59:55.159098 #3672658] INFO -- : [658/885] 3713514=test_extlibs I, [2024-05-04T08:59:55.962861 #3672658] INFO -- : [659/885] 3713513=test_enum I, [2024-05-04T08:59:56.833553 #3672658] INFO -- : [660/885] 3713514=test_rdoc_markup_include I, [2024-05-04T08:59:56.836474 #3672658] INFO -- : [661/885] 3713514=test_recursion I, [2024-05-04T08:59:56.843905 #3672658] INFO -- : [662/885] 3713514=test_require I, [2024-05-04T08:59:56.916376 #3672658] INFO -- : [663/885] 3713512=test_config I, [2024-05-04T08:59:57.012242 #3672658] INFO -- : [664/885] 3713512=test_ostruct I, [2024-05-04T08:59:57.020371 #3672658] INFO -- : [665/885] 3713513=test_depth_first I, [2024-05-04T08:59:57.027357 #3672658] INFO -- : [666/885] 3713513=test_change_word I, [2024-05-04T08:59:57.039350 #3672658] INFO -- : [667/885] 3713513=test_custom_command I, [2024-05-04T08:59:57.050086 #3672658] INFO -- : [668/885] 3713513=test_rdoc_parser_markdown I, [2024-05-04T08:59:57.088635 #3672658] INFO -- : [669/885] 3713513=test_cparser I, [2024-05-04T08:59:57.165927 #3672658] INFO -- : [670/885] 3713512=test_rubyvm I, [2024-05-04T08:59:57.197433 #3672658] INFO -- : [671/885] 3713512=fuzzer_test I, [2024-05-04T08:59:57.228795 #3672658] INFO -- : [672/885] 3713512=test_c_struct_entry I, [2024-05-04T08:59:58.262185 #3672658] INFO -- : [673/885] 3713512=test_struct I, [2024-05-04T08:59:58.268164 #3672658] INFO -- : [674/885] 3713512=static_inspect_test I, [2024-05-04T08:59:58.271531 #3672658] INFO -- : [675/885] 3713514=test_lock_native_thread I, [2024-05-04T08:59:58.277940 #3672658] INFO -- : [676/885] 3713512=test_gem_package_task I, [2024-05-04T08:59:58.302170 #3672658] INFO -- : [677/885] 3713512=test_resize I, [2024-05-04T08:59:58.306169 #3672658] INFO -- : [678/885] 3713512=test_win32ole_param I, [2024-05-04T08:59:58.314455 #3672658] INFO -- : [679/885] 3713512=test_key_error I, [2024-05-04T08:59:58.323673 #3672658] INFO -- : [680/885] 3713512=test_fiber I, [2024-05-04T08:59:58.564396 #3672658] INFO -- : [681/885] 3713514=test_gem_commands_mirror I, [2024-05-04T08:59:58.590343 #3672658] INFO -- : [682/885] 3713514=test_engine I, [2024-05-04T08:59:59.049195 #3672658] INFO -- : [683/885] 3713514=test_module I, [2024-05-04T08:59:59.170820 #3672658] INFO -- : [684/885] 3713513=test_erb_command I, [2024-05-04T08:59:59.196187 #3672658] INFO -- : [685/885] 3713513=test_gem_security_trust_dir I, [2024-05-04T08:59:59.258873 #3672658] INFO -- : [686/885] 3713513=test_gem_validator I, [2024-05-04T08:59:59.275909 #3672658] INFO -- : [687/885] 3713513=test_gem_source_installed I, [2024-05-04T08:59:59.329659 #3672658] INFO -- : [688/885] 3713513=test_usrmarshal I, [2024-05-04T08:59:59.510632 #3672658] INFO -- : [689/885] 3713513=test_integer_comb I, [2024-05-04T09:00:01.941052 #3672658] INFO -- : [690/885] 3713514=test_bundled_ca I, [2024-05-04T09:00:02.115950 #3672658] INFO -- : [691/885] 3713513=test_load I, [2024-05-04T09:00:02.175403 #3672658] INFO -- : [692/885] 3713513=test_abi I, [2024-05-04T09:00:02.415211 #3672658] INFO -- : [693/885] 3713513=test_ssl I, [2024-05-04T09:00:03.315746 #3672658] INFO -- : [694/885] 3713514=test_objectspace I, [2024-05-04T09:00:04.271813 #3672658] INFO -- : [695/885] 3713514=test_require I, [2024-05-04T09:00:04.474873 #3672658] INFO -- : [696/885] 3713512=test_my_integer I, [2024-05-04T09:00:04.490060 #3672658] INFO -- : [697/885] 3713512=test_gem_resolver_composed_set I, [2024-05-04T09:00:04.518035 #3672658] INFO -- : [698/885] 3713512=test_debugger_integration I, [2024-05-04T09:00:04.527288 #3672658] INFO -- : [699/885] 3713512=test_not I, [2024-05-04T09:00:04.537596 #3672658] INFO -- : [700/885] 3713512=test_cgi_cookie I, [2024-05-04T09:00:04.548343 #3672658] INFO -- : [701/885] 3713512=test_tracer I, [2024-05-04T09:00:04.558795 #3672658] INFO -- : [702/885] 3713512=test_rdoc_markup_attribute_manager I, [2024-05-04T09:00:04.599002 #3672658] INFO -- : [703/885] 3713512=test_wss I, [2024-05-04T09:00:04.640669 #3672658] INFO -- : [704/885] 3713512=test_option I, [2024-05-04T09:00:04.774805 #3672658] INFO -- : [705/885] 3713512=test_x509store I, [2024-05-04T09:00:05.270380 #3672658] INFO -- : [706/885] 3713512=test_rdoc_rd_block_parser I, [2024-05-04T09:00:05.311099 #3672658] INFO -- : [707/885] 3713512=test_rdoc_markup_to_joined_paragraph I, [2024-05-04T09:00:05.324984 #3672658] INFO -- : [708/885] 3713512=test_rdoc_markup_to_markdown I, [2024-05-04T09:00:05.375495 #3672658] INFO -- : [709/885] 3713512=test_rdoc_generator_pot I, [2024-05-04T09:00:05.388586 #3672658] INFO -- : [710/885] 3713512=test_rdoc_rd I, [2024-05-04T09:00:05.405286 #3672658] INFO -- : [711/885] 3713512=test_gem_gem_runner I, [2024-05-04T09:00:05.510276 #3672658] INFO -- : [712/885] 3713512=test_require_lib I, [2024-05-04T09:00:06.860897 #3672658] INFO -- : [713/885] 3713514=test_metaclass I, [2024-05-04T09:00:06.884690 #3672658] INFO -- : [714/885] 3713514=test_rdoc_rd_inline_parser I, [2024-05-04T09:00:06.920356 #3672658] INFO -- : [715/885] 3713514=test_win32ole_type I, [2024-05-04T09:00:06.921927 #3672658] INFO -- : [716/885] 3713514=test_load I, [2024-05-04T09:00:06.926714 #3672658] INFO -- : [717/885] 3713514=test_gem_source_lock I, [2024-05-04T09:00:07.037746 #3672658] INFO -- : [718/885] 3713514=test_update I, [2024-05-04T09:00:07.052995 #3672658] INFO -- : [719/885] 3713514=test_cipher I, [2024-05-04T09:00:07.071062 #3672658] INFO -- : [720/885] 3713514=test_new I, [2024-05-04T09:00:07.076899 #3672658] INFO -- : [721/885] 3713514=test_rdoc_markup_paragraph I, [2024-05-04T09:00:07.083017 #3672658] INFO -- : [722/885] 3713514=test_x509cert I, [2024-05-04T09:00:07.187049 #3672658] INFO -- : [723/885] 3713514=test_irb I, [2024-05-04T09:00:07.467664 #3672658] INFO -- : [724/885] 3713514=test_bn I, [2024-05-04T09:00:07.480254 #3672658] INFO -- : [725/885] 3713514=test_variable_name_check I, [2024-05-04T09:00:07.600006 #3672658] INFO -- : [726/885] 3713514=test_require_path_check I, [2024-05-04T09:00:07.770322 #3672658] INFO -- : [727/885] 3713514=test_logdevice I, [2024-05-04T09:00:08.476685 #3672658] INFO -- : [728/885] 3713512=test_ast I, [2024-05-04T09:00:08.660669 #3672658] INFO -- : [729/885] 3713514=test_protocol I, [2024-05-04T09:00:08.968641 #3672658] INFO -- : [730/885] 3713514=test_evaluation I, [2024-05-04T09:00:08.970471 #3672658] INFO -- : [731/885] 3713514=test_files_test I, [2024-05-04T09:00:08.990241 #3672658] INFO -- : [732/885] 3713514=test_weakkeymap I, [2024-05-04T09:00:12.564847 #3672658] INFO -- : [733/885] 3713514=test_rdoc_markup_to_ansi I, [2024-05-04T09:00:12.607029 #3672658] INFO -- : [734/885] 3713514=test_object_create_start I, [2024-05-04T09:00:12.624349 #3672658] INFO -- : [735/885] 3713514=test_https I, [2024-05-04T09:00:12.784095 #3672658] INFO -- : [736/885] 3713514=test_gem_commands_info_command I, [2024-05-04T09:00:12.869946 #3672658] INFO -- : [737/885] 3713513=test_gem_request_set_gem_dependency_api I, [2024-05-04T09:00:12.891072 #3672658] INFO -- : [738/885] 3713514=test_name_error_extension I, [2024-05-04T09:00:12.898741 #3672658] INFO -- : [739/885] 3713514=test_completion I, [2024-05-04T09:00:13.378781 #3672658] INFO -- : [740/885] 3713513=test_file_exhaustive I, [2024-05-04T09:00:13.610236 #3672658] INFO -- : [741/885] 3713514=test_delete I, [2024-05-04T09:00:13.626948 #3672658] INFO -- : [742/885] 3713514=test_rdoc_markup_document I, [2024-05-04T09:00:13.642307 #3672658] INFO -- : [743/885] 3713514=test_gem_security_policy I, [2024-05-04T09:00:14.130132 #3672658] INFO -- : [744/885] 3713514=parse_stream_test I, [2024-05-04T09:00:14.141676 #3672658] INFO -- : [745/885] 3713514=test_handle I, [2024-05-04T09:00:15.094500 #3672658] INFO -- : [746/885] 3713514=test_io_wait_uncommon I, [2024-05-04T09:00:15.118763 #3672658] INFO -- : [747/885] 3713514=test_continuation I, [2024-05-04T09:00:15.132610 #3672658] INFO -- : [748/885] 3713514=test_gem_silent_ui I, [2024-05-04T09:00:15.191037 #3672658] INFO -- : [749/885] 3713514=test_signal I, [2024-05-04T09:00:17.247918 #3672658] INFO -- : [750/885] 3713514=test_fixnum I, [2024-05-04T09:00:17.276372 #3672658] INFO -- : [751/885] 3713514=test_gem_ci_detector I, [2024-05-04T09:00:17.283724 #3672658] INFO -- : [752/885] 3713514=test_gem_package_tar_header I, [2024-05-04T09:00:17.387186 #3672658] INFO -- : [753/885] 3713514=test_ssl_session I, [2024-05-04T09:00:18.238768 #3672658] INFO -- : [754/885] 3713514=test_case_comprehensive I, [2024-05-04T09:00:24.168460 #3672658] INFO -- : [755/885] 3713513=test_logperiod I, [2024-05-04T09:00:24.171633 #3672658] INFO -- : [756/885] 3713513=test_rational2 I, [2024-05-04T09:00:24.186460 #3672658] INFO -- : [757/885] 3713513=test_placearg I, [2024-05-04T09:00:24.265198 #3672658] INFO -- : [758/885] 3713513=test_rdoc_token_stream I, [2024-05-04T09:00:24.323393 #3672658] INFO -- : [759/885] 3713513=test_mutex I, [2024-05-04T09:00:25.411278 #3672658] INFO -- : [760/885] 3713513=test_type I, [2024-05-04T09:00:25.424479 #3672658] INFO -- : [761/885] 3713513=heredoc_dedent_test I, [2024-05-04T09:00:25.435933 #3672658] INFO -- : [762/885] 3713513=test_tmpdir I, [2024-05-04T09:00:25.521239 #3672658] INFO -- : [763/885] 3713513=test_struct I, [2024-05-04T09:00:26.090815 #3672658] INFO -- : [764/885] 3713513=test_dup I, [2024-05-04T09:00:26.302844 #3672658] INFO -- : [765/885] 3713513=test_rdoc_single_class I, [2024-05-04T09:00:26.312838 #3672658] INFO -- : [766/885] 3713513=test_acceptable I, [2024-05-04T09:00:26.391333 #3672658] INFO -- : [767/885] 3713513=test_gem_ext_cargo_builder_link_flag_converter I, [2024-05-04T09:00:26.570940 #3672658] INFO -- : [768/885] 3713513=test_gem_local_remote_options I, [2024-05-04T09:00:26.644275 #3672658] INFO -- : [769/885] 3713513=test_gem_safe_marshal I, [2024-05-04T09:00:27.892454 #3672658] INFO -- : [770/885] 3713513=test_ractor I, [2024-05-04T09:00:27.951741 #3672658] INFO -- : [771/885] 3713513=test_sexp I, [2024-05-04T09:00:27.965960 #3672658] INFO -- : [772/885] 3713513=test_httpheader I, [2024-05-04T09:00:27.994813 #3672658] INFO -- : [773/885] 3713513=test_rdoc_ri_driver I, [2024-05-04T09:00:28.483266 #3672658] INFO -- : [774/885] 3713513=test_signedness I, [2024-05-04T09:00:30.369500 #3672658] INFO -- : [775/885] 3713513=test_gem_resolver_git_set I, [2024-05-04T09:00:31.002241 #3672658] INFO -- : [776/885] 3713513=test_gem_commands_check_command I, [2024-05-04T09:00:31.040903 #3672658] INFO -- : [777/885] 3713513=test_digest I, [2024-05-04T09:00:31.838986 #3672658] INFO -- : [778/885] 3713513=test_gem_resolver_installed_specification I, [2024-05-04T09:00:31.932265 #3672658] INFO -- : [779/885] 3713513=test_exception_at_throwing I, [2024-05-04T09:00:31.999329 #3672658] INFO -- : [780/885] 3713513=test_ractor I, [2024-05-04T09:00:32.072512 #3672658] INFO -- : [781/885] 3713513=test_stringscanner I, [2024-05-04T09:00:32.128068 #3672658] INFO -- : [782/885] 3713513=json_generic_object_test I, [2024-05-04T09:00:32.188744 #3672658] INFO -- : [783/885] 3713513=test_fiddle I, [2024-05-04T09:00:32.386758 #3672658] INFO -- : [784/885] 3713513=test_gem_resolver_vendor_specification I, [2024-05-04T09:00:32.439645 #3672658] INFO -- : [785/885] 3713513=test_date_arith I, [2024-05-04T09:00:32.547643 #3672658] INFO -- : [786/885] 3713513=test_benchmark I, [2024-05-04T09:00:34.188186 #3672658] INFO -- : [787/885] 3713513=test_at_exit I, [2024-05-04T09:00:34.292423 #3672658] INFO -- : [788/885] 3713513=test_have_macro I, [2024-05-04T09:00:34.507425 #3672658] INFO -- : [789/885] 3713513=test_mkmf I, [2024-05-04T09:00:34.522723 #3672658] INFO -- : [790/885] 3713513=test_gem_source I, [2024-05-04T09:00:34.943118 #3672658] INFO -- : [791/885] 3713513=test_class I, [2024-05-04T09:00:34.956953 #3672658] INFO -- : [792/885] 3713513=test_autoload I, [2024-05-04T09:00:39.120710 #3672658] INFO -- : [793/885] 3713514=test_gem_package I, [2024-05-04T09:00:39.280750 #3672658] INFO -- : [794/885] 3713513=test_array I, [2024-05-04T09:00:39.989234 #3672658] INFO -- : [795/885] 3713514=test_eval_history I, [2024-05-04T09:00:40.006355 #3672658] INFO -- : [796/885] 3713514=dispatcher_test I, [2024-05-04T09:00:40.028916 #3672658] INFO -- : [797/885] 3713514=test_unicode I, [2024-05-04T09:00:40.037430 #3672658] INFO -- : [798/885] 3713514=test_win32ole_method I, [2024-05-04T09:00:40.047453 #3672658] INFO -- : [799/885] 3713514=test_lexer I, [2024-05-04T09:00:40.094378 #3672658] INFO -- : [800/885] 3713514=test_regex_casefold I, [2024-05-04T09:00:40.594111 #3672658] INFO -- : [801/885] 3713514=test_gem_source_git I, [2024-05-04T09:00:41.616244 #3672658] INFO -- : [802/885] 3713514=test_ripper I, [2024-05-04T09:00:41.917396 #3672658] INFO -- : [803/885] 3713514=test_assembler I, [2024-05-04T09:00:41.920811 #3672658] INFO -- : [804/885] 3713514=test_stringio I, [2024-05-04T09:00:42.069253 #3672658] INFO -- : [805/885] 3713514=test_thread_cv I, [2024-05-04T09:00:42.685505 #3672658] INFO -- : [806/885] 3713514=test_files_ext I, [2024-05-04T09:00:42.690262 #3672658] INFO -- : [807/885] 3713514=test_random I, [2024-05-04T09:00:42.728242 #3672658] INFO -- : [808/885] 3713514=test_iseq I, [2024-05-04T09:00:43.324825 #3672658] INFO -- : [809/885] 3713514=test_primitive I, [2024-05-04T09:00:43.343680 #3672658] INFO -- : [810/885] 3713514=test_rdoc_ri_paths I, [2024-05-04T09:00:43.384835 #3672658] INFO -- : [811/885] 3713514=test_parser I, [2024-05-04T09:00:43.412203 #3672658] INFO -- : [812/885] 3713514=command_line_test I, [2024-05-04T09:00:43.425695 #3672658] INFO -- : [813/885] 3713514=test_gem_commands_signout_command I, [2024-05-04T09:00:43.452484 #3672658] INFO -- : [814/885] 3713514=test_gem_package_tar_reader I, [2024-05-04T09:00:43.533063 #3672658] INFO -- : [815/885] 3713514=test_env I, [2024-05-04T09:00:46.267841 #3672658] INFO -- : [816/885] 3713514=test_pair I, [2024-05-04T09:00:51.561571 #3672658] INFO -- : [817/885] 3713514=test_win32ole_variant_m I, [2024-05-04T09:00:51.588056 #3672658] INFO -- : [818/885] 3713514=test_gem_commands_setup_command I, [2024-05-04T09:00:52.484333 #3672658] INFO -- : [819/885] 3713514=test_history I, [2024-05-04T09:00:52.537341 #3672658] INFO -- : [820/885] 3713514=test_eval I, [2024-05-04T09:00:52.547006 #3672658] INFO -- : [821/885] 3713514=test_document I, [2024-05-04T09:00:52.563812 #3672658] INFO -- : [822/885] 3713514=test_gem_safe_yaml I, [2024-05-04T09:00:52.572220 #3672658] INFO -- : [823/885] 3713514=test_singleton_function I, [2024-05-04T09:00:52.583683 #3672658] INFO -- : [824/885] 3713514=test_ftp I, [2024-05-04T09:00:52.594321 #3672658] INFO -- : [825/885] 3713514=test_sockopt I, [2024-05-04T09:00:52.608545 #3672658] INFO -- : [826/885] 3713514=test_gem_source_fetch_problem I, [2024-05-04T09:00:52.630294 #3672658] INFO -- : [827/885] 3713514=test_rdoc_comment I, [2024-05-04T09:00:52.679192 #3672658] INFO -- : [828/885] 3713514=test_encoding I, [2024-05-04T09:00:52.702519 #3672658] INFO -- : [829/885] 3713514=test_install I, [2024-05-04T09:00:52.896742 #3672658] INFO -- : [830/885] 3713514=test_cgi_multipart I, [2024-05-04T09:00:53.056779 #3672658] INFO -- : [831/885] 3713514=test_lazy_enumerator I, [2024-05-04T09:00:53.489779 #3672658] INFO -- : [832/885] 3713514=test_gem_request_set_lockfile_tokenizer I, [2024-05-04T09:00:53.585345 #3672658] INFO -- : [833/885] 3713514=integer_parse_test I, [2024-05-04T09:00:53.595269 #3672658] INFO -- : [834/885] 3713514=test_autoconf I, [2024-05-04T09:00:53.611774 #3672658] INFO -- : [835/885] 3713514=test_ractor_compatibility I, [2024-05-04T09:00:53.650625 #3672658] INFO -- : [836/885] 3713512=test_arithmetic_sequence I, [2024-05-04T09:00:53.673934 #3672658] INFO -- : [837/885] 3713512=test_find_executable I, [2024-05-04T09:00:53.680637 #3672658] INFO -- : [838/885] 3713512=test_win32ole_param_event I, [2024-05-04T09:00:53.695680 #3672658] INFO -- : [839/885] 3713512=test_rdoc_parser I, [2024-05-04T09:00:53.736077 #3672658] INFO -- : [840/885] 3713512=test_https_proxy I, [2024-05-04T09:00:53.737037 #3672658] INFO -- : [841/885] 3713512=test_etc I, [2024-05-04T09:00:53.767547 #3672658] INFO -- : Leaked file descriptor: TestEtc#test_getlogin: 11 # I, [2024-05-04T09:00:53.801891 #3672658] INFO -- : [842/885] 3713513=test_gem_commands_rebuild_commandCOMMAND PID USER FD TYPE DEVICE SIZE/OFF NODE NAME I, [2024-05-04T09:00:53.801965 #3672658] INFO -- : ruby 3713512 opc 11r REG 252,0 9253600 13705411 /var/lib/sss/mc/passwd I, [2024-05-04T09:00:53.857147 #3672658] INFO -- : I, [2024-05-04T09:00:53.911272 #3672658] INFO -- : [843/885] 3713513=test_nomethod_error I, [2024-05-04T09:00:53.917249 #3672658] INFO -- : [844/885] 3713513=test_stat I, [2024-05-04T09:00:53.922973 #3672658] INFO -- : [845/885] 3713513=test_x509attr I, [2024-05-04T09:00:53.937797 #3672658] INFO -- : [846/885] 3713513=test_printf I, [2024-05-04T09:00:53.971223 #3672658] INFO -- : [847/885] 3713513=test_workspace I, [2024-05-04T09:00:53.982728 #3672658] INFO -- : [848/885] 3713512=test_cgi_modruby I, [2024-05-04T09:00:53.984643 #3672658] INFO -- : [849/885] 3713514=magic_comment_test I, [2024-05-04T09:00:53.991163 #3672658] INFO -- : [850/885] 3713512=test_win32ole_variant I, [2024-05-04T09:00:53.992729 #3672658] INFO -- : [851/885] 3713512=test_io I, [2024-05-04T09:00:53.999729 #3672658] INFO -- : [852/885] 3713514=test_uncorrectable_name_check I, [2024-05-04T09:00:54.001831 #3672658] INFO -- : [853/885] 3713514=test_files_test_1 I, [2024-05-04T09:00:54.080770 #3672658] INFO -- : [854/885] 3713514=test_dir I, [2024-05-04T09:00:54.087047 #3672658] INFO -- : [855/885] 3713513=test_rubygems I, [2024-05-04T09:00:54.179617 #3672658] INFO -- : Leaked file descriptor: TestDir#test_home: 10 # I, [2024-05-04T09:00:54.179940 #3672658] INFO -- : Leaked file descriptor: TestDir#test_home: 11 # I, [2024-05-04T09:00:54.216628 #3672658] INFO -- : COMMAND PID USER FD TYPE DEVICE SIZE/OFF NODE NAME I, [2024-05-04T09:00:54.216705 #3672658] INFO -- : ruby 3713514 opc 10r REG 252,0 9253600 13705411 /var/lib/sss/mc/passwd I, [2024-05-04T09:00:54.216716 #3672658] INFO -- : ruby 3713514 opc 11u unix 0x0000000000000000 0t0 2834280221 type=STREAM I, [2024-05-04T09:00:54.291800 #3672658] INFO -- : [856/885] 3713513=test_resolve_symbol I, [2024-05-04T09:00:54.344645 #3672658] INFO -- : [857/885] 3713513=test_closure I, [2024-05-04T09:00:54.475497 #3672658] INFO -- : [858/885] 3713514=test_digest I, [2024-05-04T09:00:54.486714 #3672658] INFO -- : [859/885] 3713514=test_path I, [2024-05-04T09:00:54.499758 #3672658] INFO -- : [860/885] 3713514=test_rdoc_rd_inline I, [2024-05-04T09:00:54.511349 #3672658] INFO -- : [861/885] 3713514=test_gb18030 I, [2024-05-04T09:00:54.516606 #3672658] INFO -- : [862/885] 3713514=test_propertyputref I, [2024-05-04T09:00:54.524042 #3672658] INFO -- : [863/885] 3713514=test_reline_key I, [2024-05-04T09:00:54.542944 #3672658] INFO -- : [864/885] 3713514=test_gem_commands_lock_command I, [2024-05-04T09:00:54.622144 #3672658] INFO -- : [865/885] 3713514=test_unicode_normalize I, [2024-05-04T09:00:57.131236 #3672658] INFO -- : [866/885] 3713513=test_rdoc_generator_ri I, [2024-05-04T09:00:57.143566 #3672658] INFO -- : [867/885] 3713513=test_gem_stream_ui I, [2024-05-04T09:00:57.309167 #3672658] INFO -- : [868/885] 3713513=test_io_m17n I, [2024-05-04T09:00:58.693619 #3672658] INFO -- : [869/885] 3713513=test_rdoc_top_level I, [2024-05-04T09:00:59.064742 #3672658] INFO -- : [870/885] 3713513=test_float I, [2024-05-04T09:00:59.204215 #3672658] INFO -- : [871/885] 3713514=test_gem_stub_specification I, [2024-05-04T09:00:59.380415 #3672658] INFO -- : [872/885] 3713514=test_cmethod I, [2024-05-04T09:00:59.392913 #3672658] INFO -- : [873/885] 3713514=test_color I, [2024-05-04T09:00:59.481055 #3672658] INFO -- : [874/885] 3713514=json_ext_parser_test I, [2024-05-04T09:00:59.505846 #3672658] INFO -- : [875/885] 3713514=test_gem_ext_configure_builder I, [2024-05-04T09:00:59.546744 #3672658] INFO -- : [876/885] 3713514=test_nonblock I, [2024-05-04T09:00:59.571907 #3672658] INFO -- : [877/885] 3713514=test_rdoc_parser_simple I, [2024-05-04T09:00:59.622634 #3672658] INFO -- : [878/885] 3713514=test_ipaddr I, [2024-05-04T09:00:59.669777 #3672658] INFO -- : [879/885] 3713514=test_scanner_events I, [2024-05-04T09:00:59.707093 #3672658] INFO -- : [880/885] 3713514=test_ocsp I, [2024-05-04T09:00:59.801473 #3672658] INFO -- : [881/885] 3713514=test_omap I, [2024-05-04T09:00:59.815433 #3672658] INFO -- : [882/885] 3713514=test_date_strptime I, [2024-05-04T09:00:59.938361 #3672658] INFO -- : [883/885] 3713514=test_shellwords I, [2024-05-04T09:00:59.966031 #3672658] INFO -- : [884/885] 3713514=test_mul I, [2024-05-04T09:00:59.978160 #3672658] INFO -- : [885/885] 3713514=test_rdoc_generator_pot_po I, [2024-05-04T09:01:07.323819 #3672658] INFO -- : Finished tests in 203.250523s, 129.1362 tests/s, 45994.6616 assertions/s. E, [2024-05-04T09:01:07.324025 #3672658] ERROR -- : Children under /tmp/rubytest.pzb90c: E, [2024-05-04T09:01:07.324158 #3672658] ERROR -- : * drwx------ 4 28 2024-05-04 09:00:53 +0000 gem_rebuild20240504-3713513-25a1qt/ E, [2024-05-04T09:01:07.324176 #3672658] ERROR -- : * drwxrwxr-x 2 40 2024-05-04 09:00:53 +0000 old/ E, [2024-05-04T09:01:07.324213 #3672658] ERROR -- : * -rw-rw-r-- 1 4096 2024-05-04 09:00:53 +0000 rebuild_test_gem-1.0.0.gem E, [2024-05-04T09:01:07.324373 #3672658] ERROR -- : * drwxrwxr-x 2 40 2024-05-04 09:00:53 +0000 new/ E, [2024-05-04T09:01:07.324388 #3672658] ERROR -- : * -rw-rw-r-- 1 4096 2024-05-04 09:00:53 +0000 rebuild_test_gem-1.0.0.gem I, [2024-05-04T09:01:07.330420 #3672658] INFO -- : 26247 tests, 9348439 assertions, 0 failures, 0 errors, 320 skips I, [2024-05-04T09:01:07.330463 #3672658] INFO -- : I, [2024-05-04T09:01:07.330475 #3672658] INFO -- : ruby -v: ruby 3.4.0dev (2024-05-04T03:32:34Z master bd42f0898d) [aarch64-linux] I, [2024-05-04T09:01:07.331402 #3672658] INFO -- : $$$[end] "make yes-test-all TESTOPTS='--stderr-on-failure' TESTS='-j3'" exit with 0. I, [2024-05-04T09:01:07.331554 #3672658] INFO -- : $$$[beg] make yes-test-rubyspec MSPECOPT='--error-output stderr --debug -j' TESTS='-j3' I, [2024-05-04T09:01:07.461281 #3672658] INFO -- : BASERUBY = /usr/local/bin/ruby --disable=gems I, [2024-05-04T09:01:07.461365 #3672658] INFO -- : CC = gcc I, [2024-05-04T09:01:07.461376 #3672658] INFO -- : LD = ld I, [2024-05-04T09:01:07.461385 #3672658] INFO -- : LDSHARED = gcc -shared I, [2024-05-04T09:01:07.461395 #3672658] INFO -- : CFLAGS = -O3 -fno-fast-math -ggdb3 -Wall -Wextra -Wdeprecated-declarations -Wdiv-by-zero -Wduplicated-cond -Wimplicit-function-declaration -Wimplicit-int -Wpointer-arith -Wwrite-strings -Wold-style-definition -Wimplicit-fallthrough=0 -Wmissing-noreturn -Wno-cast-function-type -Wno-constant-logical-operand -Wno-long-long -Wno-missing-field-initializers -Wno-overlength-strings -Wno-packed-bitfield-compat -Wno-parentheses-equality -Wno-self-assign -Wno-tautological-compare -Wno-unused-parameter -Wno-unused-value -Wsuggest-attribute=format -Wsuggest-attribute=noreturn -Wunused-variable -Wmisleading-indentation -Wundef I, [2024-05-04T09:01:07.461408 #3672658] INFO -- : XCFLAGS = -U_FORTIFY_SOURCE -D_FORTIFY_SOURCE=2 -fstack-protector-strong -msign-return-address=all -fno-strict-overflow -fvisibility=hidden -fexcess-precision=standard -DRUBY_EXPORT -fPIE -I. -I.ext/include/aarch64-linux -I/home/opc/ruby/src/master/include -I/home/opc/ruby/src/master -I/home/opc/ruby/src/master/prism -I/home/opc/ruby/src/master/enc/unicode/15.0.0 I, [2024-05-04T09:01:07.461418 #3672658] INFO -- : CPPFLAGS = I, [2024-05-04T09:01:07.461426 #3672658] INFO -- : DLDFLAGS = -Wl,--compress-debug-sections=zlib -fstack-protector-strong -pie I, [2024-05-04T09:01:07.461435 #3672658] INFO -- : SOLIBS = -lz -lrt -lrt -ldl -lcrypt -lm -lpthread I, [2024-05-04T09:01:07.461444 #3672658] INFO -- : LANG = en_US.UTF-8 I, [2024-05-04T09:01:07.461452 #3672658] INFO -- : LC_ALL = I, [2024-05-04T09:01:07.461460 #3672658] INFO -- : LC_CTYPE = I, [2024-05-04T09:01:07.461468 #3672658] INFO -- : MFLAGS = I, [2024-05-04T09:01:07.461476 #3672658] INFO -- : RUSTC = rustc I, [2024-05-04T09:01:07.461484 #3672658] INFO -- : YJIT_RUSTC_ARGS = --crate-name=yjit --crate-type=staticlib --edition=2021 -g -C lto=thin -C opt-level=3 -C overflow-checks=on '--out-dir=/home/opc/ruby/build/master/yjit/target/release/' /home/opc/ruby/src/master/yjit/src/lib.rs I, [2024-05-04T09:01:07.462242 #3672658] INFO -- : gcc (GCC) 8.5.0 20210514 (Red Hat 8.5.0-10.1.0.1) I, [2024-05-04T09:01:07.462260 #3672658] INFO -- : Copyright (C) 2018 Free Software Foundation, Inc. I, [2024-05-04T09:01:07.462269 #3672658] INFO -- : This is free software; see the source for copying conditions. There is NO I, [2024-05-04T09:01:07.462278 #3672658] INFO -- : warranty; not even for MERCHANTABILITY or FITNESS FOR A PARTICULAR PURPOSE. I, [2024-05-04T09:01:07.462287 #3672658] INFO -- : I, [2024-05-04T09:01:07.464396 #3672658] INFO -- : generating enc.mk I, [2024-05-04T09:01:07.701713 #3672658] INFO -- : making enc I, [2024-05-04T09:01:07.729284 #3672658] INFO -- : make[1]: Entering directory '/home/opc/ruby/build/master' I, [2024-05-04T09:01:07.729357 #3672658] INFO -- : make[1]: Nothing to be done for 'enc'. I, [2024-05-04T09:01:07.729368 #3672658] INFO -- : make[1]: Leaving directory '/home/opc/ruby/build/master' I, [2024-05-04T09:01:07.730311 #3672658] INFO -- : making srcs under enc I, [2024-05-04T09:01:07.772247 #3672658] INFO -- : make[1]: Entering directory '/home/opc/ruby/build/master' I, [2024-05-04T09:01:07.772293 #3672658] INFO -- : make[1]: Nothing to be done for 'srcs'. I, [2024-05-04T09:01:07.772304 #3672658] INFO -- : make[1]: Leaving directory '/home/opc/ruby/build/master' I, [2024-05-04T09:01:07.773552 #3672658] INFO -- : generating transdb.h I, [2024-05-04T09:01:07.921008 #3672658] INFO -- : transdb.h unchanged I, [2024-05-04T09:01:07.922380 #3672658] INFO -- : making trans I, [2024-05-04T09:01:07.970958 #3672658] INFO -- : make[1]: Entering directory '/home/opc/ruby/build/master' I, [2024-05-04T09:01:07.971029 #3672658] INFO -- : make[1]: Nothing to be done for 'trans'. I, [2024-05-04T09:01:07.971040 #3672658] INFO -- : make[1]: Leaving directory '/home/opc/ruby/build/master' I, [2024-05-04T09:01:07.971916 #3672658] INFO -- : making encs I, [2024-05-04T09:01:08.024383 #3672658] INFO -- : make[1]: Entering directory '/home/opc/ruby/build/master' I, [2024-05-04T09:01:08.024459 #3672658] INFO -- : make[1]: Nothing to be done for 'encs'. I, [2024-05-04T09:01:08.024471 #3672658] INFO -- : make[1]: Leaving directory '/home/opc/ruby/build/master' I, [2024-05-04T09:01:08.026535 #3672658] INFO -- : generating makefiles ext/configure-ext.mk I, [2024-05-04T09:01:08.067202 #3672658] INFO -- : ext/configure-ext.mk updated I, [2024-05-04T09:01:08.070974 #3672658] INFO -- : make[1]: Entering directory '/home/opc/ruby/build/master' I, [2024-05-04T09:01:10.230754 #3672658] INFO -- : make[1]: Leaving directory '/home/opc/ruby/build/master' I, [2024-05-04T09:01:10.231339 #3672658] INFO -- : generating makefile exts.mk I, [2024-05-04T09:01:10.292391 #3672658] INFO -- : exts.mk unchanged I, [2024-05-04T09:01:10.297435 #3672658] INFO -- : make[1]: Entering directory '/home/opc/ruby/build/master' I, [2024-05-04T09:01:10.609206 #3672658] INFO -- : make[2]: Entering directory '/home/opc/ruby/build/master/ext/coverage' I, [2024-05-04T09:01:10.614994 #3672658] INFO -- : make[2]: Leaving directory '/home/opc/ruby/build/master/ext/coverage' I, [2024-05-04T09:01:10.620834 #3672658] INFO -- : make[2]: Entering directory '/home/opc/ruby/build/master/ext/date' I, [2024-05-04T09:01:10.626374 #3672658] INFO -- : make[2]: Leaving directory '/home/opc/ruby/build/master/ext/date' I, [2024-05-04T09:01:10.629932 #3672658] INFO -- : make[2]: Entering directory '/home/opc/ruby/build/master/ext/digest' I, [2024-05-04T09:01:10.639467 #3672658] INFO -- : make[2]: Leaving directory '/home/opc/ruby/build/master/ext/digest' I, [2024-05-04T09:01:10.662681 #3672658] INFO -- : make[2]: Entering directory '/home/opc/ruby/build/master/ext/digest/sha2' I, [2024-05-04T09:01:10.667751 #3672658] INFO -- : make[2]: Leaving directory '/home/opc/ruby/build/master/ext/digest/sha2' I, [2024-05-04T09:01:10.686472 #3672658] INFO -- : make[2]: Entering directory '/home/opc/ruby/build/master/ext/fiddle' I, [2024-05-04T09:01:10.696751 #3672658] INFO -- : make[2]: Leaving directory '/home/opc/ruby/build/master/ext/fiddle' I, [2024-05-04T09:01:10.701218 #3672658] INFO -- : make[2]: Entering directory '/home/opc/ruby/build/master/ext/io/console' I, [2024-05-04T09:01:10.705863 #3672658] INFO -- : make[2]: Leaving directory '/home/opc/ruby/build/master/ext/io/console' I, [2024-05-04T09:01:10.717177 #3672658] INFO -- : make[2]: Entering directory '/home/opc/ruby/build/master/ext/json' I, [2024-05-04T09:01:10.726890 #3672658] INFO -- : make[2]: Leaving directory '/home/opc/ruby/build/master/ext/json' I, [2024-05-04T09:01:10.740150 #3672658] INFO -- : make[2]: Entering directory '/home/opc/ruby/build/master/ext/monitor' I, [2024-05-04T09:01:10.744593 #3672658] INFO -- : make[2]: Leaving directory '/home/opc/ruby/build/master/ext/monitor' I, [2024-05-04T09:01:10.750791 #3672658] INFO -- : make[2]: Entering directory '/home/opc/ruby/build/master/ext/objspace' I, [2024-05-04T09:01:10.756924 #3672658] INFO -- : make[2]: Leaving directory '/home/opc/ruby/build/master/ext/objspace' I, [2024-05-04T09:01:10.775853 #3672658] INFO -- : make[2]: Entering directory '/home/opc/ruby/build/master/ext/openssl' I, [2024-05-04T09:01:10.797839 #3672658] INFO -- : make[2]: Leaving directory '/home/opc/ruby/build/master/ext/openssl' I, [2024-05-04T09:01:10.802213 #3672658] INFO -- : make[2]: Entering directory '/home/opc/ruby/build/master/ext/pathname' I, [2024-05-04T09:01:10.806600 #3672658] INFO -- : make[2]: Leaving directory '/home/opc/ruby/build/master/ext/pathname' I, [2024-05-04T09:01:10.812966 #3672658] INFO -- : make[2]: Entering directory '/home/opc/ruby/build/master/ext/psych' I, [2024-05-04T09:01:10.834801 #3672658] INFO -- : make[2]: Leaving directory '/home/opc/ruby/build/master/ext/psych' I, [2024-05-04T09:01:10.839320 #3672658] INFO -- : make[2]: Entering directory '/home/opc/ruby/build/master/ext/pty' I, [2024-05-04T09:01:10.843861 #3672658] INFO -- : make[2]: Leaving directory '/home/opc/ruby/build/master/ext/pty' I, [2024-05-04T09:01:10.857606 #3672658] INFO -- : make[2]: Entering directory '/home/opc/ruby/build/master/ext/ripper' I, [2024-05-04T09:01:10.865814 #3672658] INFO -- : make[2]: Leaving directory '/home/opc/ruby/build/master/ext/ripper' I, [2024-05-04T09:01:10.867918 #3672658] INFO -- : make[2]: Entering directory '/home/opc/ruby/build/master/ext/rubyvm' I, [2024-05-04T09:01:10.871595 #3672658] INFO -- : make[2]: Leaving directory '/home/opc/ruby/build/master/ext/rubyvm' I, [2024-05-04T09:01:10.883808 #3672658] INFO -- : make[2]: Entering directory '/home/opc/ruby/build/master/ext/socket' I, [2024-05-04T09:01:10.894853 #3672658] INFO -- : make[2]: Leaving directory '/home/opc/ruby/build/master/ext/socket' I, [2024-05-04T09:01:10.911047 #3672658] INFO -- : make[2]: Entering directory '/home/opc/ruby/build/master/.bundle/gems/bigdecimal-3.1.7/ext/bigdecimal' I, [2024-05-04T09:01:10.943643 #3672658] INFO -- : make[2]: Leaving directory '/home/opc/ruby/build/master/.bundle/gems/bigdecimal-3.1.7/ext/bigdecimal' I, [2024-05-04T09:01:10.946584 #3672658] INFO -- : make[2]: Entering directory '/home/opc/ruby/build/master/.bundle/gems/debug-1.9.2/ext/debug' I, [2024-05-04T09:01:10.979206 #3672658] INFO -- : make[2]: Leaving directory '/home/opc/ruby/build/master/.bundle/gems/debug-1.9.2/ext/debug' I, [2024-05-04T09:01:10.981892 #3672658] INFO -- : make[2]: Entering directory '/home/opc/ruby/build/master/.bundle/gems/nkf-0.2.0/ext/nkf' I, [2024-05-04T09:01:11.013772 #3672658] INFO -- : make[2]: Leaving directory '/home/opc/ruby/build/master/.bundle/gems/nkf-0.2.0/ext/nkf' I, [2024-05-04T09:01:11.016293 #3672658] INFO -- : make[2]: Entering directory '/home/opc/ruby/build/master/.bundle/gems/racc-1.7.3/ext/racc/cparse' I, [2024-05-04T09:01:11.048029 #3672658] INFO -- : make[2]: Leaving directory '/home/opc/ruby/build/master/.bundle/gems/racc-1.7.3/ext/racc/cparse' I, [2024-05-04T09:01:11.051113 #3672658] INFO -- : make[2]: Entering directory '/home/opc/ruby/build/master/.bundle/gems/rbs-3.4.4/ext/rbs_extension' I, [2024-05-04T09:01:11.083782 #3672658] INFO -- : make[2]: Leaving directory '/home/opc/ruby/build/master/.bundle/gems/rbs-3.4.4/ext/rbs_extension' I, [2024-05-04T09:01:11.086396 #3672658] INFO -- : make[2]: Entering directory '/home/opc/ruby/build/master/.bundle/gems/syslog-0.1.2/ext/syslog' I, [2024-05-04T09:01:11.119297 #3672658] INFO -- : make[2]: Leaving directory '/home/opc/ruby/build/master/.bundle/gems/syslog-0.1.2/ext/syslog' I, [2024-05-04T09:01:11.157644 #3672658] INFO -- : make[2]: Entering directory '/home/opc/ruby/build/master' I, [2024-05-04T09:01:11.247747 #3672658] INFO -- : make[2]: 'ruby' is up to date. I, [2024-05-04T09:01:11.247849 #3672658] INFO -- : make[2]: Leaving directory '/home/opc/ruby/build/master' I, [2024-05-04T09:01:11.247997 #3672658] INFO -- : make[1]: Leaving directory '/home/opc/ruby/build/master' I, [2024-05-04T09:01:11.252731 #3672658] INFO -- : make[1]: Entering directory '/home/opc/ruby/build/master' I, [2024-05-04T09:01:11.252813 #3672658] INFO -- : make[1]: Nothing to be done for 'note'. I, [2024-05-04T09:01:11.252824 #3672658] INFO -- : make[1]: Leaving directory '/home/opc/ruby/build/master' E, [2024-05-04T09:01:11.335796 #3672658] ERROR -- : $ /home/opc/ruby/build/master/miniruby -I/home/opc/ruby/src/master/lib /home/opc/ruby/src/master/tool/runruby.rb --archdir=/home/opc/ruby/build/master --extout=.ext -- /home/opc/ruby/src/master/spec/mspec/bin/mspec-run -B /home/opc/ruby/src/master/spec/default.mspec --error-output stderr --debug -fy -o /tmp/rubytest.oq2v52/1-mspec-multi-0 E, [2024-05-04T09:01:11.336200 #3672658] ERROR -- : $ /home/opc/ruby/build/master/miniruby -I/home/opc/ruby/src/master/lib /home/opc/ruby/src/master/tool/runruby.rb --archdir=/home/opc/ruby/build/master --extout=.ext -- /home/opc/ruby/src/master/spec/mspec/bin/mspec-run -B /home/opc/ruby/src/master/spec/default.mspec --error-output stderr --debug -fy -o /tmp/rubytest.oq2v52/2-mspec-multi-1 E, [2024-05-04T09:01:11.336566 #3672658] ERROR -- : $ /home/opc/ruby/build/master/miniruby -I/home/opc/ruby/src/master/lib /home/opc/ruby/src/master/tool/runruby.rb --archdir=/home/opc/ruby/build/master --extout=.ext -- /home/opc/ruby/src/master/spec/mspec/bin/mspec-run -B /home/opc/ruby/src/master/spec/default.mspec --error-output stderr --debug -fy -o /tmp/rubytest.oq2v52/3-mspec-multi-2 I, [2024-05-04T09:01:11.480188 #3672658] INFO -- : ruby 3.4.0dev (2024-05-04T03:32:34Z master bd42f0898d) [aarch64-linux] I, [2024-05-04T09:01:17.196903 #3672658] INFO -- : 0 ......................................................................... I, [2024-05-04T09:01:19.756885 #3672658] INFO -- : 73 ......................................................................... I, [2024-05-04T09:01:19.986336 #3672658] INFO -- : 146 ......................................................................... I, [2024-05-04T09:01:20.306376 #3672658] INFO -- : 219 ......................................................................... I, [2024-05-04T09:01:20.485891 #3672658] INFO -- : 292 ......................................................................... I, [2024-05-04T09:01:20.747852 #3672658] INFO -- : 365 ......................................................................... I, [2024-05-04T09:01:20.890418 #3672658] INFO -- : 438 ......................................................................... I, [2024-05-04T09:01:20.955459 #3672658] INFO -- : 511 ......................................................................... I, [2024-05-04T09:01:21.023080 #3672658] INFO -- : 584 ......................................................................... I, [2024-05-04T09:01:21.683181 #3672658] INFO -- : 657 ......................................................................... I, [2024-05-04T09:01:21.781748 #3672658] INFO -- : 730 ......................................................................... I, [2024-05-04T09:01:21.834670 #3672658] INFO -- : 803 ......................................................................... I, [2024-05-04T09:01:22.076275 #3672658] INFO -- : 876 ......................................................................... I, [2024-05-04T09:01:22.205522 #3672658] INFO -- : 949 ......................................................................... I, [2024-05-04T09:01:22.845592 #3672658] INFO -- : 1022 ......................................................................... I, [2024-05-04T09:01:25.327398 #3672658] INFO -- : 1095 ......................................................................... I, [2024-05-04T09:01:26.209342 #3672658] INFO -- : 1168 ......................................................................... I, [2024-05-04T09:01:26.398902 #3672658] INFO -- : 1241 ......................................................................... I, [2024-05-04T09:01:26.627433 #3672658] INFO -- : 1314 ......................................................................... I, [2024-05-04T09:01:26.745022 #3672658] INFO -- : 1387 ......................................................................... I, [2024-05-04T09:01:28.795891 #3672658] INFO -- : 1460 ......................................................................... I, [2024-05-04T09:01:32.253534 #3672658] INFO -- : 1533 ......................................................................... I, [2024-05-04T09:01:32.403867 #3672658] INFO -- : 1606 ......................................................................... I, [2024-05-04T09:01:33.228963 #3672658] INFO -- : 1679 ......................................................................... I, [2024-05-04T09:01:33.568226 #3672658] INFO -- : 1752 ......................................................................... I, [2024-05-04T09:01:33.859709 #3672658] INFO -- : 1825 ......................................................................... I, [2024-05-04T09:01:34.184960 #3672658] INFO -- : 1898 ......................................................................... I, [2024-05-04T09:01:34.593063 #3672658] INFO -- : 1971 ......................................................................... I, [2024-05-04T09:01:35.103009 #3672658] INFO -- : 2044 ......................................................................... I, [2024-05-04T09:01:35.191227 #3672658] INFO -- : 2117 ......................................................................... I, [2024-05-04T09:01:35.259662 #3672658] INFO -- : 2190 ......................................................................... I, [2024-05-04T09:01:35.306299 #3672658] INFO -- : 2263 ......................................................................... I, [2024-05-04T09:01:35.354492 #3672658] INFO -- : 2336 ......................................................................... I, [2024-05-04T09:01:35.451562 #3672658] INFO -- : 2409 ......................................................................... I, [2024-05-04T09:01:35.735327 #3672658] INFO -- : 2482 ......................................................................... I, [2024-05-04T09:01:35.869291 #3672658] INFO -- : 2555 ......................................................................... I, [2024-05-04T09:01:37.188701 #3672658] INFO -- : 2628 ......................................................................... I, [2024-05-04T09:01:37.486022 #3672658] INFO -- : 2701 ......................................................................... I, [2024-05-04T09:01:37.689021 #3672658] INFO -- : 2774 ......................................................................... I, [2024-05-04T09:01:38.138393 #3672658] INFO -- : 2847 ......................................................................... I, [2024-05-04T09:01:38.390925 #3672658] INFO -- : 2920 ......................................................................... I, [2024-05-04T09:01:38.503371 #3672658] INFO -- : 2993 ......................................................................... I, [2024-05-04T09:01:38.574894 #3672658] INFO -- : 3066 ......................................................................... I, [2024-05-04T09:01:38.644040 #3672658] INFO -- : 3139 ......................................................................... I, [2024-05-04T09:01:38.707292 #3672658] INFO -- : 3212 ......................................................................... I, [2024-05-04T09:01:38.785173 #3672658] INFO -- : 3285 ......................................................................... I, [2024-05-04T09:01:42.601107 #3672658] INFO -- : 3358 ........................................................................ I, [2024-05-04T09:01:42.601181 #3672658] INFO -- : I, [2024-05-04T09:01:42.601193 #3672658] INFO -- : Finished in 31.265292 seconds I, [2024-05-04T09:01:42.601202 #3672658] INFO -- : I, [2024-05-04T09:01:42.601210 #3672658] INFO -- : 3429 files, 32606 examples, 188297 expectations, 0 failures, 0 errors, 0 tagged I, [2024-05-04T09:01:42.602695 #3672658] INFO -- : $$$[end] "make yes-test-rubyspec MSPECOPT='--error-output stderr --debug -j' TESTS='-j3'" exit with 0.