# Logfile created on 2024-05-04 08:37:33 +0000 by logger.rb/v1.5.3 I, [2024-05-04T08:37:33.156562 #2812191] INFO -- : #, @formatter=nil, @logdev=#, @binmode=false, @mon_data=#, @mon_data_owner_object_id=860>>> I, [2024-05-04T08:37:33.156861 #2812191] INFO -- : $$$[beg] make update-unicode -j3 I, [2024-05-04T08:37:33.246575 #2812191] INFO -- : Downloading Unicode emoji 15.0 files... I, [2024-05-04T08:37:33.246829 #2812191] INFO -- : Downloading Unicode emoji 15.0 files... I, [2024-05-04T08:37:33.247110 #2812191] INFO -- : Downloading Unicode emoji 15.0 files... I, [2024-05-04T08:37:33.323585 #2812191] INFO -- : made symlink emoji/15.0/emoji-sequences.txt to /home/opc/ruby/src/master/.downloaded-cache/emoji/15.0/emoji-sequences.txt I, [2024-05-04T08:37:33.328284 #2812191] INFO -- : downloading emoji/15.0/emoji-sequences.txt ... downloading emoji/15.0/emoji-test.txt ... /home/opc/ruby/src/master/enc/unicode/data/emoji/15.0/emoji-sequences.txt already exists E, [2024-05-04T08:37:33.781745 #2812191] ERROR -- : /home/opc/ruby/src/master/tool/downloader.rb:302:in `rescue in download': failed to download emoji/15.0/emoji-test.txt (RuntimeError) E, [2024-05-04T08:37:33.781812 #2812191] ERROR -- : OpenURI::HTTPError: 403 Forbidden: https://www.unicode.org/Public/emoji/15.0/emoji-test.txt E, [2024-05-04T08:37:33.781824 #2812191] ERROR -- : from /home/opc/ruby/src/master/tool/downloader.rb:201:in `download' E, [2024-05-04T08:37:33.781834 #2812191] ERROR -- : from /home/opc/ruby/src/master/tool/downloader.rb:136:in `download' E, [2024-05-04T08:37:33.781843 #2812191] ERROR -- : from /home/opc/ruby/src/master/tool/downloader.rb:482:in `block in
' E, [2024-05-04T08:37:33.781851 #2812191] ERROR -- : from /home/opc/ruby/src/master/tool/downloader.rb:465:in `each' E, [2024-05-04T08:37:33.781859 #2812191] ERROR -- : from /home/opc/ruby/src/master/tool/downloader.rb:465:in `
' E, [2024-05-04T08:37:33.781868 #2812191] ERROR -- : /usr/local/lib/ruby/3.2.0/open-uri.rb:369:in `open_http': 403 Forbidden (OpenURI::HTTPError) E, [2024-05-04T08:37:33.781876 #2812191] ERROR -- : from /usr/local/lib/ruby/3.2.0/open-uri.rb:760:in `buffer_open' E, [2024-05-04T08:37:33.781884 #2812191] ERROR -- : from /usr/local/lib/ruby/3.2.0/open-uri.rb:214:in `block in open_loop' E, [2024-05-04T08:37:33.781892 #2812191] ERROR -- : from /usr/local/lib/ruby/3.2.0/open-uri.rb:212:in `catch' E, [2024-05-04T08:37:33.781900 #2812191] ERROR -- : from /usr/local/lib/ruby/3.2.0/open-uri.rb:212:in `open_loop' E, [2024-05-04T08:37:33.781908 #2812191] ERROR -- : from /usr/local/lib/ruby/3.2.0/open-uri.rb:153:in `open_uri' E, [2024-05-04T08:37:33.781932 #2812191] ERROR -- : from /usr/local/lib/ruby/3.2.0/open-uri.rb:740:in `open' E, [2024-05-04T08:37:33.781942 #2812191] ERROR -- : from /usr/local/lib/ruby/3.2.0/open-uri.rb:748:in `read' E, [2024-05-04T08:37:33.781954 #2812191] ERROR -- : from /home/opc/ruby/src/master/tool/downloader.rb:247:in `block in download' E, [2024-05-04T08:37:33.781963 #2812191] ERROR -- : from /home/opc/ruby/src/master/tool/downloader.rb:378:in `with_retry' E, [2024-05-04T08:37:33.781971 #2812191] ERROR -- : from /home/opc/ruby/src/master/tool/downloader.rb:246:in `download' E, [2024-05-04T08:37:33.781980 #2812191] ERROR -- : from /home/opc/ruby/src/master/tool/downloader.rb:136:in `download' E, [2024-05-04T08:37:33.781988 #2812191] ERROR -- : from /home/opc/ruby/src/master/tool/downloader.rb:482:in `block in
' E, [2024-05-04T08:37:33.781996 #2812191] ERROR -- : from /home/opc/ruby/src/master/tool/downloader.rb:465:in `each' E, [2024-05-04T08:37:33.782004 #2812191] ERROR -- : from /home/opc/ruby/src/master/tool/downloader.rb:465:in `
' E, [2024-05-04T08:37:33.784850 #2812191] ERROR -- : make: *** [uncommon.mk:1787: /home/opc/ruby/src/master/enc/unicode/data/emoji/15.0/emoji-test.txt] Error 1 E, [2024-05-04T08:37:33.784884 #2812191] ERROR -- : make: *** Waiting for unfinished jobs.... E, [2024-05-04T08:37:33.796214 #2812191] ERROR -- : /home/opc/ruby/src/master/tool/downloader.rb:302:in `rescue in download': failed to download emoji/15.0/emoji-test.txt (RuntimeError) E, [2024-05-04T08:37:33.796257 #2812191] ERROR -- : OpenURI::HTTPError: 403 Forbidden: https://www.unicode.org/Public/emoji/15.0/emoji-test.txt E, [2024-05-04T08:37:33.796267 #2812191] ERROR -- : from /home/opc/ruby/src/master/tool/downloader.rb:201:in `download' E, [2024-05-04T08:37:33.796276 #2812191] ERROR -- : from /home/opc/ruby/src/master/tool/downloader.rb:136:in `download' E, [2024-05-04T08:37:33.796284 #2812191] ERROR -- : from /home/opc/ruby/src/master/tool/downloader.rb:482:in `block in
' E, [2024-05-04T08:37:33.796292 #2812191] ERROR -- : from /home/opc/ruby/src/master/tool/downloader.rb:465:in `each' E, [2024-05-04T08:37:33.796301 #2812191] ERROR -- : from /home/opc/ruby/src/master/tool/downloader.rb:465:in `
' E, [2024-05-04T08:37:33.796309 #2812191] ERROR -- : /usr/local/lib/ruby/3.2.0/open-uri.rb:369:in `open_http': 403 Forbidden (OpenURI::HTTPError) E, [2024-05-04T08:37:33.796317 #2812191] ERROR -- : from /usr/local/lib/ruby/3.2.0/open-uri.rb:760:in `buffer_open' E, [2024-05-04T08:37:33.796325 #2812191] ERROR -- : from /usr/local/lib/ruby/3.2.0/open-uri.rb:214:in `block in open_loop' E, [2024-05-04T08:37:33.796333 #2812191] ERROR -- : from /usr/local/lib/ruby/3.2.0/open-uri.rb:212:in `catch' E, [2024-05-04T08:37:33.796341 #2812191] ERROR -- : from /usr/local/lib/ruby/3.2.0/open-uri.rb:212:in `open_loop' E, [2024-05-04T08:37:33.796350 #2812191] ERROR -- : from /usr/local/lib/ruby/3.2.0/open-uri.rb:153:in `open_uri' E, [2024-05-04T08:37:33.796358 #2812191] ERROR -- : from /usr/local/lib/ruby/3.2.0/open-uri.rb:740:in `open' E, [2024-05-04T08:37:33.796366 #2812191] ERROR -- : from /usr/local/lib/ruby/3.2.0/open-uri.rb:748:in `read' E, [2024-05-04T08:37:33.796374 #2812191] ERROR -- : from /home/opc/ruby/src/master/tool/downloader.rb:247:in `block in download' E, [2024-05-04T08:37:33.796382 #2812191] ERROR -- : from /home/opc/ruby/src/master/tool/downloader.rb:378:in `with_retry' E, [2024-05-04T08:37:33.796391 #2812191] ERROR -- : from /home/opc/ruby/src/master/tool/downloader.rb:246:in `download' E, [2024-05-04T08:37:33.796399 #2812191] ERROR -- : from /home/opc/ruby/src/master/tool/downloader.rb:136:in `download' E, [2024-05-04T08:37:33.796407 #2812191] ERROR -- : from /home/opc/ruby/src/master/tool/downloader.rb:482:in `block in
' E, [2024-05-04T08:37:33.796415 #2812191] ERROR -- : from /home/opc/ruby/src/master/tool/downloader.rb:465:in `each' E, [2024-05-04T08:37:33.796424 #2812191] ERROR -- : from /home/opc/ruby/src/master/tool/downloader.rb:465:in `
' E, [2024-05-04T08:37:33.799201 #2812191] ERROR -- : make: *** [uncommon.mk:1787: /home/opc/ruby/src/master/enc/unicode/data/emoji/15.0/emoji-zwj-sequences.txt] Error 1 E, [2024-05-04T08:37:34.240996 #2812191] ERROR -- : /home/opc/ruby/src/master/tool/downloader.rb:302:in `rescue in download': failed to download emoji/15.0/emoji-sequences.txt (RuntimeError) E, [2024-05-04T08:37:34.241070 #2812191] ERROR -- : EOFError: end of file reached: https://www.unicode.org/Public/emoji/15.0/emoji-sequences.txt E, [2024-05-04T08:37:34.241081 #2812191] ERROR -- : from /home/opc/ruby/src/master/tool/downloader.rb:201:in `download' E, [2024-05-04T08:37:34.241091 #2812191] ERROR -- : from /home/opc/ruby/src/master/tool/downloader.rb:136:in `download' E, [2024-05-04T08:37:34.241100 #2812191] ERROR -- : from /home/opc/ruby/src/master/tool/downloader.rb:482:in `block in
' E, [2024-05-04T08:37:34.241164 #2812191] ERROR -- : from /home/opc/ruby/src/master/tool/downloader.rb:465:in `each' E, [2024-05-04T08:37:34.241178 #2812191] ERROR -- : from /home/opc/ruby/src/master/tool/downloader.rb:465:in `
' E, [2024-05-04T08:37:34.241187 #2812191] ERROR -- : /usr/local/lib/ruby/3.2.0/net/protocol.rb:237:in `rbuf_fill': end of file reached (EOFError) E, [2024-05-04T08:37:34.241196 #2812191] ERROR -- : from /usr/local/lib/ruby/3.2.0/net/protocol.rb:199:in `readuntil' E, [2024-05-04T08:37:34.241204 #2812191] ERROR -- : from /usr/local/lib/ruby/3.2.0/net/protocol.rb:209:in `readline' E, [2024-05-04T08:37:34.241212 #2812191] ERROR -- : from /usr/local/lib/ruby/3.2.0/net/http/response.rb:158:in `read_status_line' E, [2024-05-04T08:37:34.241220 #2812191] ERROR -- : from /usr/local/lib/ruby/3.2.0/net/http/response.rb:147:in `read_new' E, [2024-05-04T08:37:34.241229 #2812191] ERROR -- : from /usr/local/lib/ruby/3.2.0/net/http.rb:1862:in `block in transport_request' E, [2024-05-04T08:37:34.241237 #2812191] ERROR -- : from /usr/local/lib/ruby/3.2.0/net/http.rb:1853:in `catch' E, [2024-05-04T08:37:34.241245 #2812191] ERROR -- : from /usr/local/lib/ruby/3.2.0/net/http.rb:1853:in `transport_request' E, [2024-05-04T08:37:34.241253 #2812191] ERROR -- : from /usr/local/lib/ruby/3.2.0/net/http.rb:1826:in `request' E, [2024-05-04T08:37:34.241261 #2812191] ERROR -- : from /usr/local/lib/ruby/3.2.0/open-uri.rb:333:in `block in open_http' E, [2024-05-04T08:37:34.241270 #2812191] ERROR -- : from /usr/local/lib/ruby/3.2.0/net/http.rb:1238:in `start' E, [2024-05-04T08:37:34.241278 #2812191] ERROR -- : from /usr/local/lib/ruby/3.2.0/open-uri.rb:327:in `open_http' E, [2024-05-04T08:37:34.241285 #2812191] ERROR -- : from /usr/local/lib/ruby/3.2.0/open-uri.rb:760:in `buffer_open' E, [2024-05-04T08:37:34.241293 #2812191] ERROR -- : from /usr/local/lib/ruby/3.2.0/open-uri.rb:214:in `block in open_loop' E, [2024-05-04T08:37:34.241301 #2812191] ERROR -- : from /usr/local/lib/ruby/3.2.0/open-uri.rb:212:in `catch' E, [2024-05-04T08:37:34.241309 #2812191] ERROR -- : from /usr/local/lib/ruby/3.2.0/open-uri.rb:212:in `open_loop' E, [2024-05-04T08:37:34.241317 #2812191] ERROR -- : from /usr/local/lib/ruby/3.2.0/open-uri.rb:153:in `open_uri' E, [2024-05-04T08:37:34.241325 #2812191] ERROR -- : from /usr/local/lib/ruby/3.2.0/open-uri.rb:740:in `open' E, [2024-05-04T08:37:34.241333 #2812191] ERROR -- : from /usr/local/lib/ruby/3.2.0/open-uri.rb:748:in `read' E, [2024-05-04T08:37:34.241341 #2812191] ERROR -- : from /home/opc/ruby/src/master/tool/downloader.rb:247:in `block in download' E, [2024-05-04T08:37:34.241350 #2812191] ERROR -- : from /home/opc/ruby/src/master/tool/downloader.rb:378:in `with_retry' E, [2024-05-04T08:37:34.241358 #2812191] ERROR -- : from /home/opc/ruby/src/master/tool/downloader.rb:246:in `download' E, [2024-05-04T08:37:34.241367 #2812191] ERROR -- : from /home/opc/ruby/src/master/tool/downloader.rb:136:in `download' E, [2024-05-04T08:37:34.241375 #2812191] ERROR -- : from /home/opc/ruby/src/master/tool/downloader.rb:482:in `block in
' E, [2024-05-04T08:37:34.241383 #2812191] ERROR -- : from /home/opc/ruby/src/master/tool/downloader.rb:465:in `each' E, [2024-05-04T08:37:34.241391 #2812191] ERROR -- : from /home/opc/ruby/src/master/tool/downloader.rb:465:in `
' E, [2024-05-04T08:37:34.244149 #2812191] ERROR -- : make: *** [uncommon.mk:1787: /home/opc/ruby/src/master/enc/unicode/data/emoji/15.0/emoji-sequences.txt] Error 1 E, [2024-05-04T08:37:34.244183 #2812191] ERROR -- : make: *** Deleting file '/home/opc/ruby/src/master/enc/unicode/data/emoji/15.0/emoji-sequences.txt' I, [2024-05-04T08:37:34.244259 #2812191] INFO -- : downloading emoji/15.0/emoji-test.txt ... I, [2024-05-04T08:37:34.244426 #2812191] INFO -- : $$$[end] "make update-unicode -j3" exit with 512. I, [2024-05-04T08:37:34.244473 #2812191] INFO -- : $$$[beg] make update-download -j3 I, [2024-05-04T08:37:34.409319 #2812191] INFO -- : tool/config.guess already exists I, [2024-05-04T08:37:34.409389 #2812191] INFO -- : tool/config.sub already exists I, [2024-05-04T08:37:34.412181 #2812191] INFO -- : Update minitest to ea9caafc0754b1d6236a490d59e624b53209734a I, [2024-05-04T08:37:34.412279 #2812191] INFO -- : Update power_assert to 84e85124c5014a139af39161d484156cfe87a9ed I, [2024-05-04T08:37:34.412571 #2812191] INFO -- : Update rbs to ba7872795d5de04adb8ff500c0e6afdc81a041dd I, [2024-05-04T08:37:34.415507 #2812191] INFO -- : echo ea9caafc0754b1d6236a490d59e624b53209734a | /bin/sh /home/opc/ruby/src/master/tool/ifchange /home/opc/ruby/src/master/.bundle/.timestamp/minitest.revision - I, [2024-05-04T08:37:34.416019 #2812191] INFO -- : echo 84e85124c5014a139af39161d484156cfe87a9ed | /bin/sh /home/opc/ruby/src/master/tool/ifchange /home/opc/ruby/src/master/.bundle/.timestamp/power_assert.revision - I, [2024-05-04T08:37:34.416289 #2812191] INFO -- : echo ba7872795d5de04adb8ff500c0e6afdc81a041dd | /bin/sh /home/opc/ruby/src/master/tool/ifchange /home/opc/ruby/src/master/.bundle/.timestamp/rbs.revision - I, [2024-05-04T08:37:34.421256 #2812191] INFO -- : /home/opc/ruby/src/master/.bundle/.timestamp/minitest.revision unchanged I, [2024-05-04T08:37:34.421891 #2812191] INFO -- : /home/opc/ruby/src/master/.bundle/.timestamp/rbs.revision unchanged I, [2024-05-04T08:37:34.422256 #2812191] INFO -- : /home/opc/ruby/src/master/.bundle/.timestamp/power_assert.revision unchanged I, [2024-05-04T08:37:34.423969 #2812191] INFO -- : Update typeprof to b19a6416da3a05d57fadd6ffdadb382b6d236ca5 I, [2024-05-04T08:37:34.427303 #2812191] INFO -- : echo b19a6416da3a05d57fadd6ffdadb382b6d236ca5 | /bin/sh /home/opc/ruby/src/master/tool/ifchange /home/opc/ruby/src/master/.bundle/.timestamp/typeprof.revision - I, [2024-05-04T08:37:34.434860 #2812191] INFO -- : /home/opc/ruby/src/master/.bundle/.timestamp/typeprof.revision unchanged I, [2024-05-04T08:37:34.516289 #2812191] INFO -- : Building power_assert@84e85124c5014a139af39161d484156cfe87a9ed to /home/opc/ruby/src/master/gems/power_assert-2.0.3.gem I, [2024-05-04T08:37:34.630742 #2812191] INFO -- : Successfully built RubyGem I, [2024-05-04T08:37:34.630802 #2812191] INFO -- : Name: power_assert I, [2024-05-04T08:37:34.630812 #2812191] INFO -- : Version: 2.0.4dev I, [2024-05-04T08:37:34.630821 #2812191] INFO -- : File: power_assert-2.0.4dev.gem I, [2024-05-04T08:37:34.711772 #2812191] INFO -- : $$$[end] "make update-download -j3" exit with 0. I, [2024-05-04T08:37:34.711845 #2812191] INFO -- : $$$[beg] make update-rubyspec -j3 I, [2024-05-04T08:37:34.800576 #2812191] INFO -- : make: Nothing to be done for 'update-rubyspec'. I, [2024-05-04T08:37:34.800713 #2812191] INFO -- : $$$[end] "make update-rubyspec -j3" exit with 0. I, [2024-05-04T08:37:34.800738 #2812191] INFO -- : $$$[beg] make update-src -j3 I, [2024-05-04T08:37:35.700580 #2812191] INFO -- : Already up to date. I, [2024-05-04T08:37:35.715166 #2812191] INFO -- : Latest commit hash = bd42f0898d I, [2024-05-04T08:37:35.715726 #2812191] INFO -- : $$$[end] "make update-src -j3" exit with 0. I, [2024-05-04T08:37:35.715772 #2812191] INFO -- : $$$[beg] make after-update -j3 I, [2024-05-04T08:37:35.817864 #2812191] INFO -- : generating /home/opc/ruby/src/master/ext/ripper/eventids2table.c I, [2024-05-04T08:37:35.824426 #2812191] INFO -- : make[1]: Entering directory '/home/opc/ruby/src/master/ext/ripper' I, [2024-05-04T08:37:35.824477 #2812191] INFO -- : make[1]: Nothing to be done for 'src'. I, [2024-05-04T08:37:35.824516 #2812191] INFO -- : make[1]: Leaving directory '/home/opc/ruby/src/master/ext/ripper' I, [2024-05-04T08:37:35.851050 #2812191] INFO -- : /home/opc/ruby/src/master/revision.h updated I, [2024-05-04T08:37:35.852257 #2812191] INFO -- : generating aarch64-linux-fake.rb I, [2024-05-04T08:37:35.908970 #2812191] INFO -- : aarch64-linux-fake.rb updated I, [2024-05-04T08:37:35.910524 #2812191] INFO -- : generating enc.mk I, [2024-05-04T08:37:36.144554 #2812191] INFO -- : making srcs under enc I, [2024-05-04T08:37:36.186952 #2812191] INFO -- : make[1]: Entering directory '/home/opc/ruby/build/master' I, [2024-05-04T08:37:36.187022 #2812191] INFO -- : make[1]: Nothing to be done for 'srcs'. I, [2024-05-04T08:37:36.187033 #2812191] INFO -- : make[1]: Leaving directory '/home/opc/ruby/build/master' I, [2024-05-04T08:37:36.267648 #2812191] INFO -- : Update minitest to ea9caafc0754b1d6236a490d59e624b53209734a I, [2024-05-04T08:37:36.267767 #2812191] INFO -- : Update power_assert to 84e85124c5014a139af39161d484156cfe87a9ed I, [2024-05-04T08:37:36.268130 #2812191] INFO -- : Update rbs to ba7872795d5de04adb8ff500c0e6afdc81a041dd I, [2024-05-04T08:37:36.271029 #2812191] INFO -- : echo 84e85124c5014a139af39161d484156cfe87a9ed | /bin/sh /home/opc/ruby/src/master/tool/ifchange /home/opc/ruby/src/master/.bundle/.timestamp/power_assert.revision - I, [2024-05-04T08:37:36.271241 #2812191] INFO -- : echo ea9caafc0754b1d6236a490d59e624b53209734a | /bin/sh /home/opc/ruby/src/master/tool/ifchange /home/opc/ruby/src/master/.bundle/.timestamp/minitest.revision - I, [2024-05-04T08:37:36.271444 #2812191] INFO -- : echo ba7872795d5de04adb8ff500c0e6afdc81a041dd | /bin/sh /home/opc/ruby/src/master/tool/ifchange /home/opc/ruby/src/master/.bundle/.timestamp/rbs.revision - I, [2024-05-04T08:37:36.276604 #2812191] INFO -- : /home/opc/ruby/src/master/.bundle/.timestamp/power_assert.revision unchanged I, [2024-05-04T08:37:36.276657 #2812191] INFO -- : /home/opc/ruby/src/master/.bundle/.timestamp/minitest.revision unchanged I, [2024-05-04T08:37:36.276815 #2812191] INFO -- : /home/opc/ruby/src/master/.bundle/.timestamp/rbs.revision unchanged I, [2024-05-04T08:37:36.278880 #2812191] INFO -- : Update typeprof to b19a6416da3a05d57fadd6ffdadb382b6d236ca5 I, [2024-05-04T08:37:36.287913 #2812191] INFO -- : echo b19a6416da3a05d57fadd6ffdadb382b6d236ca5 | /bin/sh /home/opc/ruby/src/master/tool/ifchange /home/opc/ruby/src/master/.bundle/.timestamp/typeprof.revision - I, [2024-05-04T08:37:36.294776 #2812191] INFO -- : /home/opc/ruby/src/master/.bundle/.timestamp/typeprof.revision unchanged I, [2024-05-04T08:37:36.368225 #2812191] INFO -- : Building power_assert@84e85124c5014a139af39161d484156cfe87a9ed to /home/opc/ruby/src/master/gems/power_assert-2.0.3.gem I, [2024-05-04T08:37:36.483339 #2812191] INFO -- : Successfully built RubyGem I, [2024-05-04T08:37:36.483401 #2812191] INFO -- : Name: power_assert I, [2024-05-04T08:37:36.483412 #2812191] INFO -- : Version: 2.0.4dev I, [2024-05-04T08:37:36.483421 #2812191] INFO -- : File: power_assert-2.0.4dev.gem I, [2024-05-04T08:37:36.485796 #2812191] INFO -- : Extracting bundle gem power_assert-2.0.3... I, [2024-05-04T08:37:36.583555 #2812191] INFO -- : Try with hash version of bundled gems instead of gems/power_assert-2.0.3.gem. We don't use this gem with release version of Ruby. I, [2024-05-04T08:37:36.594150 #2812191] INFO -- : Unpacked gems/power_assert-2.0.4dev.gem I, [2024-05-04T08:37:36.596003 #2812191] INFO -- : $$$[end] "make after-update -j3" exit with 0. I, [2024-05-04T08:37:36.596139 #2812191] INFO -- : $$$[beg] make miniruby -j3 I, [2024-05-04T08:37:36.685901 #2812191] INFO -- : BASERUBY = /usr/local/bin/ruby --disable=gems I, [2024-05-04T08:37:36.686005 #2812191] INFO -- : CC = gcc I, [2024-05-04T08:37:36.686016 #2812191] INFO -- : LD = ld I, [2024-05-04T08:37:36.686024 #2812191] INFO -- : LDSHARED = gcc -shared I, [2024-05-04T08:37:36.686036 #2812191] INFO -- : CFLAGS = -O3 -fno-fast-math -ggdb3 -Wall -Wextra -Wdeprecated-declarations -Wdiv-by-zero -Wduplicated-cond -Wimplicit-function-declaration -Wimplicit-int -Wpointer-arith -Wwrite-strings -Wold-style-definition -Wimplicit-fallthrough=0 -Wmissing-noreturn -Wno-cast-function-type -Wno-constant-logical-operand -Wno-long-long -Wno-missing-field-initializers -Wno-overlength-strings -Wno-packed-bitfield-compat -Wno-parentheses-equality -Wno-self-assign -Wno-tautological-compare -Wno-unused-parameter -Wno-unused-value -Wsuggest-attribute=format -Wsuggest-attribute=noreturn -Wunused-variable -Wmisleading-indentation -Wundef I, [2024-05-04T08:37:36.686048 #2812191] INFO -- : XCFLAGS = -U_FORTIFY_SOURCE -D_FORTIFY_SOURCE=2 -fstack-protector-strong -msign-return-address=all -fno-strict-overflow -fvisibility=hidden -fexcess-precision=standard -DRUBY_EXPORT -fPIE -I. -I.ext/include/aarch64-linux -I/home/opc/ruby/src/master/include -I/home/opc/ruby/src/master -I/home/opc/ruby/src/master/prism -I/home/opc/ruby/src/master/enc/unicode/15.0.0 I, [2024-05-04T08:37:36.686057 #2812191] INFO -- : CPPFLAGS = I, [2024-05-04T08:37:36.686065 #2812191] INFO -- : DLDFLAGS = -Wl,--compress-debug-sections=zlib -fstack-protector-strong -pie I, [2024-05-04T08:37:36.686073 #2812191] INFO -- : SOLIBS = -lz -lrt -lrt -ldl -lcrypt -lm -lpthread I, [2024-05-04T08:37:36.686081 #2812191] INFO -- : LANG = en_US.UTF-8 I, [2024-05-04T08:37:36.686089 #2812191] INFO -- : LC_ALL = I, [2024-05-04T08:37:36.686097 #2812191] INFO -- : LC_CTYPE = I, [2024-05-04T08:37:36.686105 #2812191] INFO -- : MFLAGS = -j3 --jobserver-auth=4,5 I, [2024-05-04T08:37:36.686113 #2812191] INFO -- : RUSTC = rustc I, [2024-05-04T08:37:36.686121 #2812191] INFO -- : YJIT_RUSTC_ARGS = --crate-name=yjit --crate-type=staticlib --edition=2021 -g -C lto=thin -C opt-level=3 -C overflow-checks=on '--out-dir=/home/opc/ruby/build/master/yjit/target/release/' /home/opc/ruby/src/master/yjit/src/lib.rs I, [2024-05-04T08:37:36.686881 #2812191] INFO -- : gcc (GCC) 8.5.0 20210514 (Red Hat 8.5.0-10.1.0.1) I, [2024-05-04T08:37:36.686917 #2812191] INFO -- : Copyright (C) 2018 Free Software Foundation, Inc. I, [2024-05-04T08:37:36.686927 #2812191] INFO -- : This is free software; see the source for copying conditions. There is NO I, [2024-05-04T08:37:36.686937 #2812191] INFO -- : warranty; not even for MERCHANTABILITY or FITNESS FOR A PARTICULAR PURPOSE. I, [2024-05-04T08:37:36.686945 #2812191] INFO -- : I, [2024-05-04T08:37:36.711840 #2812191] INFO -- : compiling /home/opc/ruby/src/master/version.c I, [2024-05-04T08:37:36.855128 #2812191] INFO -- : linking miniruby I, [2024-05-04T08:37:37.765929 #2812191] INFO -- : $$$[end] "make miniruby -j3" exit with 0. I, [2024-05-04T08:37:37.766124 #2812191] INFO -- : $$$[beg] make ruby -j3 I, [2024-05-04T08:37:37.854759 #2812191] INFO -- : BASERUBY = /usr/local/bin/ruby --disable=gems I, [2024-05-04T08:37:37.854832 #2812191] INFO -- : CC = gcc I, [2024-05-04T08:37:37.854843 #2812191] INFO -- : LD = ld I, [2024-05-04T08:37:37.854854 #2812191] INFO -- : LDSHARED = gcc -shared I, [2024-05-04T08:37:37.854863 #2812191] INFO -- : CFLAGS = -O3 -fno-fast-math -ggdb3 -Wall -Wextra -Wdeprecated-declarations -Wdiv-by-zero -Wduplicated-cond -Wimplicit-function-declaration -Wimplicit-int -Wpointer-arith -Wwrite-strings -Wold-style-definition -Wimplicit-fallthrough=0 -Wmissing-noreturn -Wno-cast-function-type -Wno-constant-logical-operand -Wno-long-long -Wno-missing-field-initializers -Wno-overlength-strings -Wno-packed-bitfield-compat -Wno-parentheses-equality -Wno-self-assign -Wno-tautological-compare -Wno-unused-parameter -Wno-unused-value -Wsuggest-attribute=format -Wsuggest-attribute=noreturn -Wunused-variable -Wmisleading-indentation -Wundef I, [2024-05-04T08:37:37.854872 #2812191] INFO -- : XCFLAGS = -U_FORTIFY_SOURCE -D_FORTIFY_SOURCE=2 -fstack-protector-strong -msign-return-address=all -fno-strict-overflow -fvisibility=hidden -fexcess-precision=standard -DRUBY_EXPORT -fPIE -I. -I.ext/include/aarch64-linux -I/home/opc/ruby/src/master/include -I/home/opc/ruby/src/master -I/home/opc/ruby/src/master/prism -I/home/opc/ruby/src/master/enc/unicode/15.0.0 I, [2024-05-04T08:37:37.854884 #2812191] INFO -- : CPPFLAGS = I, [2024-05-04T08:37:37.854893 #2812191] INFO -- : DLDFLAGS = -Wl,--compress-debug-sections=zlib -fstack-protector-strong -pie I, [2024-05-04T08:37:37.854902 #2812191] INFO -- : SOLIBS = -lz -lrt -lrt -ldl -lcrypt -lm -lpthread I, [2024-05-04T08:37:37.854910 #2812191] INFO -- : LANG = en_US.UTF-8 I, [2024-05-04T08:37:37.854918 #2812191] INFO -- : LC_ALL = I, [2024-05-04T08:37:37.854926 #2812191] INFO -- : LC_CTYPE = I, [2024-05-04T08:37:37.854934 #2812191] INFO -- : MFLAGS = -j3 --jobserver-auth=4,5 I, [2024-05-04T08:37:37.854942 #2812191] INFO -- : RUSTC = rustc I, [2024-05-04T08:37:37.854950 #2812191] INFO -- : YJIT_RUSTC_ARGS = --crate-name=yjit --crate-type=staticlib --edition=2021 -g -C lto=thin -C opt-level=3 -C overflow-checks=on '--out-dir=/home/opc/ruby/build/master/yjit/target/release/' /home/opc/ruby/src/master/yjit/src/lib.rs I, [2024-05-04T08:37:37.855696 #2812191] INFO -- : gcc (GCC) 8.5.0 20210514 (Red Hat 8.5.0-10.1.0.1) I, [2024-05-04T08:37:37.855730 #2812191] INFO -- : Copyright (C) 2018 Free Software Foundation, Inc. I, [2024-05-04T08:37:37.855741 #2812191] INFO -- : This is free software; see the source for copying conditions. There is NO I, [2024-05-04T08:37:37.855750 #2812191] INFO -- : warranty; not even for MERCHANTABILITY or FITNESS FOR A PARTICULAR PURPOSE. I, [2024-05-04T08:37:37.855759 #2812191] INFO -- : I, [2024-05-04T08:37:38.036098 #2812191] INFO -- : builtin_binary.inc updated I, [2024-05-04T08:37:38.040120 #2812191] INFO -- : c5234a9416e4f20f175185e840b25b0f08674d14078ed7083f37e655458e3ca9 builtin_binary.inc I, [2024-05-04T08:37:38.041349 #2812191] INFO -- : compiling /home/opc/ruby/src/master/builtin.c I, [2024-05-04T08:37:38.374023 #2812191] INFO -- : linking static-library libruby-static.a I, [2024-05-04T08:37:40.732295 #2812191] INFO -- : linking ruby I, [2024-05-04T08:37:41.657130 #2812191] INFO -- : $$$[end] "make ruby -j3" exit with 0. I, [2024-05-04T08:37:41.657334 #2812191] INFO -- : $$$[beg] make all -j3 I, [2024-05-04T08:37:41.745489 #2812191] INFO -- : BASERUBY = /usr/local/bin/ruby --disable=gems I, [2024-05-04T08:37:41.745553 #2812191] INFO -- : CC = gcc I, [2024-05-04T08:37:41.745565 #2812191] INFO -- : LD = ld I, [2024-05-04T08:37:41.745573 #2812191] INFO -- : LDSHARED = gcc -shared I, [2024-05-04T08:37:41.745585 #2812191] INFO -- : CFLAGS = -O3 -fno-fast-math -ggdb3 -Wall -Wextra -Wdeprecated-declarations -Wdiv-by-zero -Wduplicated-cond -Wimplicit-function-declaration -Wimplicit-int -Wpointer-arith -Wwrite-strings -Wold-style-definition -Wimplicit-fallthrough=0 -Wmissing-noreturn -Wno-cast-function-type -Wno-constant-logical-operand -Wno-long-long -Wno-missing-field-initializers -Wno-overlength-strings -Wno-packed-bitfield-compat -Wno-parentheses-equality -Wno-self-assign -Wno-tautological-compare -Wno-unused-parameter -Wno-unused-value -Wsuggest-attribute=format -Wsuggest-attribute=noreturn -Wunused-variable -Wmisleading-indentation -Wundef I, [2024-05-04T08:37:41.745594 #2812191] INFO -- : XCFLAGS = -U_FORTIFY_SOURCE -D_FORTIFY_SOURCE=2 -fstack-protector-strong -msign-return-address=all -fno-strict-overflow -fvisibility=hidden -fexcess-precision=standard -DRUBY_EXPORT -fPIE -I. -I.ext/include/aarch64-linux -I/home/opc/ruby/src/master/include -I/home/opc/ruby/src/master -I/home/opc/ruby/src/master/prism -I/home/opc/ruby/src/master/enc/unicode/15.0.0 I, [2024-05-04T08:37:41.745603 #2812191] INFO -- : CPPFLAGS = I, [2024-05-04T08:37:41.745611 #2812191] INFO -- : DLDFLAGS = -Wl,--compress-debug-sections=zlib -fstack-protector-strong -pie I, [2024-05-04T08:37:41.745619 #2812191] INFO -- : SOLIBS = -lz -lrt -lrt -ldl -lcrypt -lm -lpthread I, [2024-05-04T08:37:41.745628 #2812191] INFO -- : LANG = en_US.UTF-8 I, [2024-05-04T08:37:41.745635 #2812191] INFO -- : LC_ALL = I, [2024-05-04T08:37:41.745644 #2812191] INFO -- : LC_CTYPE = I, [2024-05-04T08:37:41.745655 #2812191] INFO -- : MFLAGS = -j3 --jobserver-auth=4,5 I, [2024-05-04T08:37:41.745663 #2812191] INFO -- : RUSTC = rustc I, [2024-05-04T08:37:41.745671 #2812191] INFO -- : YJIT_RUSTC_ARGS = --crate-name=yjit --crate-type=staticlib --edition=2021 -g -C lto=thin -C opt-level=3 -C overflow-checks=on '--out-dir=/home/opc/ruby/build/master/yjit/target/release/' /home/opc/ruby/src/master/yjit/src/lib.rs I, [2024-05-04T08:37:41.746371 #2812191] INFO -- : gcc (GCC) 8.5.0 20210514 (Red Hat 8.5.0-10.1.0.1) I, [2024-05-04T08:37:41.746406 #2812191] INFO -- : Copyright (C) 2018 Free Software Foundation, Inc. I, [2024-05-04T08:37:41.746416 #2812191] INFO -- : This is free software; see the source for copying conditions. There is NO I, [2024-05-04T08:37:41.746426 #2812191] INFO -- : warranty; not even for MERCHANTABILITY or FITNESS FOR A PARTICULAR PURPOSE. I, [2024-05-04T08:37:41.746435 #2812191] INFO -- : I, [2024-05-04T08:37:41.780886 #2812191] INFO -- : generating enc.mk I, [2024-05-04T08:37:42.018691 #2812191] INFO -- : making srcs under enc I, [2024-05-04T08:37:42.018763 #2812191] INFO -- : making enc I, [2024-05-04T08:37:42.046145 #2812191] INFO -- : make[1]: Entering directory '/home/opc/ruby/build/master' I, [2024-05-04T08:37:42.046211 #2812191] INFO -- : make[1]: Nothing to be done for 'enc'. I, [2024-05-04T08:37:42.046221 #2812191] INFO -- : make[1]: Leaving directory '/home/opc/ruby/build/master' I, [2024-05-04T08:37:42.061186 #2812191] INFO -- : make[1]: Entering directory '/home/opc/ruby/build/master' I, [2024-05-04T08:37:42.061260 #2812191] INFO -- : make[1]: Nothing to be done for 'srcs'. I, [2024-05-04T08:37:42.061271 #2812191] INFO -- : make[1]: Leaving directory '/home/opc/ruby/build/master' I, [2024-05-04T08:37:42.062108 #2812191] INFO -- : generating transdb.h I, [2024-05-04T08:37:42.210615 #2812191] INFO -- : transdb.h unchanged I, [2024-05-04T08:37:42.211947 #2812191] INFO -- : generating makefiles ext/configure-ext.mk I, [2024-05-04T08:37:42.212059 #2812191] INFO -- : making trans I, [2024-05-04T08:37:42.252651 #2812191] INFO -- : ext/configure-ext.mk updated I, [2024-05-04T08:37:42.255840 #2812191] INFO -- : make[1]: Entering directory '/home/opc/ruby/build/master' I, [2024-05-04T08:37:42.260293 #2812191] INFO -- : make[1]: Entering directory '/home/opc/ruby/build/master' I, [2024-05-04T08:37:42.260344 #2812191] INFO -- : make[1]: Nothing to be done for 'trans'. I, [2024-05-04T08:37:42.260380 #2812191] INFO -- : make[1]: Leaving directory '/home/opc/ruby/build/master' I, [2024-05-04T08:37:42.261129 #2812191] INFO -- : making encs I, [2024-05-04T08:37:42.313603 #2812191] INFO -- : make[1]: Entering directory '/home/opc/ruby/build/master' I, [2024-05-04T08:37:42.313691 #2812191] INFO -- : make[1]: Nothing to be done for 'encs'. I, [2024-05-04T08:37:42.313727 #2812191] INFO -- : make[1]: Leaving directory '/home/opc/ruby/build/master' I, [2024-05-04T08:37:43.000553 #2812191] INFO -- : make[1]: Leaving directory '/home/opc/ruby/build/master' I, [2024-05-04T08:37:43.001311 #2812191] INFO -- : generating makefile exts.mk I, [2024-05-04T08:37:43.059619 #2812191] INFO -- : exts.mk unchanged I, [2024-05-04T08:37:43.064412 #2812191] INFO -- : make[1]: Entering directory '/home/opc/ruby/build/master' I, [2024-05-04T08:37:43.170069 #2812191] INFO -- : make[2]: Entering directory '/home/opc/ruby/build/master/ext/coverage' I, [2024-05-04T08:37:43.170679 #2812191] INFO -- : make[2]: Entering directory '/home/opc/ruby/build/master/ext/digest' I, [2024-05-04T08:37:43.172274 #2812191] INFO -- : make[2]: Entering directory '/home/opc/ruby/build/master/ext/date' I, [2024-05-04T08:37:43.175682 #2812191] INFO -- : make[2]: Leaving directory '/home/opc/ruby/build/master/ext/coverage' I, [2024-05-04T08:37:43.178981 #2812191] INFO -- : make[2]: Leaving directory '/home/opc/ruby/build/master/ext/date' I, [2024-05-04T08:37:43.179382 #2812191] INFO -- : make[2]: Leaving directory '/home/opc/ruby/build/master/ext/digest' I, [2024-05-04T08:37:43.186369 #2812191] INFO -- : make[2]: Entering directory '/home/opc/ruby/build/master/ext/fiddle' I, [2024-05-04T08:37:43.188771 #2812191] INFO -- : make[2]: Entering directory '/home/opc/ruby/build/master/ext/io/console' I, [2024-05-04T08:37:43.194475 #2812191] INFO -- : make[2]: Leaving directory '/home/opc/ruby/build/master/ext/io/console' I, [2024-05-04T08:37:43.196104 #2812191] INFO -- : make[2]: Entering directory '/home/opc/ruby/build/master/ext/json' I, [2024-05-04T08:37:43.199566 #2812191] INFO -- : make[2]: Leaving directory '/home/opc/ruby/build/master/ext/fiddle' I, [2024-05-04T08:37:43.199615 #2812191] INFO -- : make[2]: Entering directory '/home/opc/ruby/build/master/ext/monitor' I, [2024-05-04T08:37:43.202545 #2812191] INFO -- : make[2]: Leaving directory '/home/opc/ruby/build/master/ext/monitor' I, [2024-05-04T08:37:43.205279 #2812191] INFO -- : make[2]: Leaving directory '/home/opc/ruby/build/master/ext/json' I, [2024-05-04T08:37:43.205724 #2812191] INFO -- : make[2]: Entering directory '/home/opc/ruby/build/master/ext/objspace' I, [2024-05-04T08:37:43.210394 #2812191] INFO -- : make[2]: Entering directory '/home/opc/ruby/build/master/ext/pathname' I, [2024-05-04T08:37:43.212584 #2812191] INFO -- : make[2]: Leaving directory '/home/opc/ruby/build/master/ext/objspace' I, [2024-05-04T08:37:43.214479 #2812191] INFO -- : make[2]: Leaving directory '/home/opc/ruby/build/master/ext/pathname' I, [2024-05-04T08:37:43.218596 #2812191] INFO -- : make[2]: Entering directory '/home/opc/ruby/build/master/ext/pty' I, [2024-05-04T08:37:43.218812 #2812191] INFO -- : make[2]: Entering directory '/home/opc/ruby/build/master/ext/psych' I, [2024-05-04T08:37:43.223025 #2812191] INFO -- : make[2]: Leaving directory '/home/opc/ruby/build/master/ext/pty' I, [2024-05-04T08:37:43.224670 #2812191] INFO -- : make[2]: Entering directory '/home/opc/ruby/build/master/ext/openssl' I, [2024-05-04T08:37:43.236927 #2812191] INFO -- : make[2]: Leaving directory '/home/opc/ruby/build/master/ext/psych' I, [2024-05-04T08:37:43.237989 #2812191] INFO -- : make[2]: Entering directory '/home/opc/ruby/build/master/ext/ripper' I, [2024-05-04T08:37:43.238867 #2812191] INFO -- : make[2]: Entering directory '/home/opc/ruby/build/master/ext/rubyvm' I, [2024-05-04T08:37:43.243853 #2812191] INFO -- : make[2]: Leaving directory '/home/opc/ruby/build/master/ext/rubyvm' I, [2024-05-04T08:37:43.245486 #2812191] INFO -- : make[2]: Leaving directory '/home/opc/ruby/build/master/ext/ripper' I, [2024-05-04T08:37:43.249203 #2812191] INFO -- : make[2]: Leaving directory '/home/opc/ruby/build/master/ext/openssl' I, [2024-05-04T08:37:43.256236 #2812191] INFO -- : make[2]: Entering directory '/home/opc/ruby/build/master/.bundle/gems/bigdecimal-3.1.7/ext/bigdecimal' I, [2024-05-04T08:37:43.256559 #2812191] INFO -- : make[2]: Entering directory '/home/opc/ruby/build/master/.bundle/gems/debug-1.9.2/ext/debug' I, [2024-05-04T08:37:43.256586 #2812191] INFO -- : make[2]: Entering directory '/home/opc/ruby/build/master/ext/socket' I, [2024-05-04T08:37:43.267580 #2812191] INFO -- : make[2]: Leaving directory '/home/opc/ruby/build/master/ext/socket' I, [2024-05-04T08:37:43.270128 #2812191] INFO -- : make[2]: Entering directory '/home/opc/ruby/build/master/.bundle/gems/nkf-0.2.0/ext/nkf' I, [2024-05-04T08:37:43.288005 #2812191] INFO -- : make[2]: Leaving directory '/home/opc/ruby/build/master/.bundle/gems/bigdecimal-3.1.7/ext/bigdecimal' I, [2024-05-04T08:37:43.288804 #2812191] INFO -- : make[2]: Leaving directory '/home/opc/ruby/build/master/.bundle/gems/debug-1.9.2/ext/debug' I, [2024-05-04T08:37:43.290696 #2812191] INFO -- : make[2]: Entering directory '/home/opc/ruby/build/master/.bundle/gems/racc-1.7.3/ext/racc/cparse' I, [2024-05-04T08:37:43.293407 #2812191] INFO -- : make[2]: Entering directory '/home/opc/ruby/build/master/.bundle/gems/rbs-3.4.4/ext/rbs_extension' I, [2024-05-04T08:37:43.306573 #2812191] INFO -- : make[2]: Leaving directory '/home/opc/ruby/build/master/.bundle/gems/nkf-0.2.0/ext/nkf' I, [2024-05-04T08:37:43.310834 #2812191] INFO -- : make[2]: Entering directory '/home/opc/ruby/build/master/.bundle/gems/syslog-0.1.2/ext/syslog' I, [2024-05-04T08:37:43.322755 #2812191] INFO -- : make[2]: Leaving directory '/home/opc/ruby/build/master/.bundle/gems/racc-1.7.3/ext/racc/cparse' I, [2024-05-04T08:37:43.325879 #2812191] INFO -- : make[2]: Leaving directory '/home/opc/ruby/build/master/.bundle/gems/rbs-3.4.4/ext/rbs_extension' I, [2024-05-04T08:37:43.339514 #2812191] INFO -- : make[2]: Entering directory '/home/opc/ruby/build/master/ext/digest/sha2' I, [2024-05-04T08:37:43.343324 #2812191] INFO -- : make[2]: Leaving directory '/home/opc/ruby/build/master/.bundle/gems/syslog-0.1.2/ext/syslog' I, [2024-05-04T08:37:43.344449 #2812191] INFO -- : make[2]: Leaving directory '/home/opc/ruby/build/master/ext/digest/sha2' I, [2024-05-04T08:37:43.383110 #2812191] INFO -- : make[2]: Entering directory '/home/opc/ruby/build/master' I, [2024-05-04T08:37:43.466329 #2812191] INFO -- : make[2]: 'ruby' is up to date. I, [2024-05-04T08:37:43.466403 #2812191] INFO -- : make[2]: Leaving directory '/home/opc/ruby/build/master' I, [2024-05-04T08:37:43.466529 #2812191] INFO -- : make[1]: Leaving directory '/home/opc/ruby/build/master' I, [2024-05-04T08:37:43.471050 #2812191] INFO -- : make[1]: Entering directory '/home/opc/ruby/build/master' I, [2024-05-04T08:37:43.471092 #2812191] INFO -- : make[1]: Nothing to be done for 'note'. I, [2024-05-04T08:37:43.471102 #2812191] INFO -- : make[1]: Leaving directory '/home/opc/ruby/build/master' I, [2024-05-04T08:37:43.471411 #2812191] INFO -- : $$$[end] "make all -j3" exit with 0. I, [2024-05-04T08:37:43.471561 #2812191] INFO -- : $$$[beg] make install -j3 I, [2024-05-04T08:37:43.565189 #2812191] INFO -- : Update minitest to ea9caafc0754b1d6236a490d59e624b53209734a I, [2024-05-04T08:37:43.565361 #2812191] INFO -- : Update power_assert to 84e85124c5014a139af39161d484156cfe87a9ed I, [2024-05-04T08:37:43.565696 #2812191] INFO -- : Update rbs to ba7872795d5de04adb8ff500c0e6afdc81a041dd I, [2024-05-04T08:37:43.568241 #2812191] INFO -- : echo ea9caafc0754b1d6236a490d59e624b53209734a | /bin/sh /home/opc/ruby/src/master/tool/ifchange /home/opc/ruby/src/master/.bundle/.timestamp/minitest.revision - I, [2024-05-04T08:37:43.568838 #2812191] INFO -- : echo 84e85124c5014a139af39161d484156cfe87a9ed | /bin/sh /home/opc/ruby/src/master/tool/ifchange /home/opc/ruby/src/master/.bundle/.timestamp/power_assert.revision - I, [2024-05-04T08:37:43.569276 #2812191] INFO -- : echo ba7872795d5de04adb8ff500c0e6afdc81a041dd | /bin/sh /home/opc/ruby/src/master/tool/ifchange /home/opc/ruby/src/master/.bundle/.timestamp/rbs.revision - I, [2024-05-04T08:37:43.575302 #2812191] INFO -- : /home/opc/ruby/src/master/.bundle/.timestamp/minitest.revision unchanged I, [2024-05-04T08:37:43.575606 #2812191] INFO -- : /home/opc/ruby/src/master/.bundle/.timestamp/rbs.revision unchanged I, [2024-05-04T08:37:43.575900 #2812191] INFO -- : /home/opc/ruby/src/master/.bundle/.timestamp/power_assert.revision unchanged I, [2024-05-04T08:37:43.579005 #2812191] INFO -- : Update typeprof to b19a6416da3a05d57fadd6ffdadb382b6d236ca5 I, [2024-05-04T08:37:43.580581 #2812191] INFO -- : BASERUBY = /usr/local/bin/ruby --disable=gems I, [2024-05-04T08:37:43.580623 #2812191] INFO -- : CC = gcc I, [2024-05-04T08:37:43.580717 #2812191] INFO -- : LD = ld I, [2024-05-04T08:37:43.580732 #2812191] INFO -- : LDSHARED = gcc -shared I, [2024-05-04T08:37:43.580744 #2812191] INFO -- : CFLAGS = -O3 -fno-fast-math -ggdb3 -Wall -Wextra -Wdeprecated-declarations -Wdiv-by-zero -Wduplicated-cond -Wimplicit-function-declaration -Wimplicit-int -Wpointer-arith -Wwrite-strings -Wold-style-definition -Wimplicit-fallthrough=0 -Wmissing-noreturn -Wno-cast-function-type -Wno-constant-logical-operand -Wno-long-long -Wno-missing-field-initializers -Wno-overlength-strings -Wno-packed-bitfield-compat -Wno-parentheses-equality -Wno-self-assign -Wno-tautological-compare -Wno-unused-parameter -Wno-unused-value -Wsuggest-attribute=format -Wsuggest-attribute=noreturn -Wunused-variable -Wmisleading-indentation -Wundef I, [2024-05-04T08:37:43.580757 #2812191] INFO -- : XCFLAGS = -U_FORTIFY_SOURCE -D_FORTIFY_SOURCE=2 -fstack-protector-strong -msign-return-address=all -fno-strict-overflow -fvisibility=hidden -fexcess-precision=standard -DRUBY_EXPORT -fPIE -I. -I.ext/include/aarch64-linux -I/home/opc/ruby/src/master/include -I/home/opc/ruby/src/master -I/home/opc/ruby/src/master/prism -I/home/opc/ruby/src/master/enc/unicode/15.0.0 I, [2024-05-04T08:37:43.580766 #2812191] INFO -- : CPPFLAGS = I, [2024-05-04T08:37:43.580775 #2812191] INFO -- : DLDFLAGS = -Wl,--compress-debug-sections=zlib -fstack-protector-strong -pie I, [2024-05-04T08:37:43.580783 #2812191] INFO -- : SOLIBS = -lz -lrt -lrt -ldl -lcrypt -lm -lpthread I, [2024-05-04T08:37:43.580792 #2812191] INFO -- : LANG = en_US.UTF-8 I, [2024-05-04T08:37:43.580800 #2812191] INFO -- : LC_ALL = I, [2024-05-04T08:37:43.580809 #2812191] INFO -- : LC_CTYPE = I, [2024-05-04T08:37:43.580817 #2812191] INFO -- : MFLAGS = -j3 --jobserver-auth=4,5 I, [2024-05-04T08:37:43.580825 #2812191] INFO -- : RUSTC = rustc I, [2024-05-04T08:37:43.580833 #2812191] INFO -- : YJIT_RUSTC_ARGS = --crate-name=yjit --crate-type=staticlib --edition=2021 -g -C lto=thin -C opt-level=3 -C overflow-checks=on '--out-dir=/home/opc/ruby/build/master/yjit/target/release/' /home/opc/ruby/src/master/yjit/src/lib.rs I, [2024-05-04T08:37:43.611877 #2812191] INFO -- : echo b19a6416da3a05d57fadd6ffdadb382b6d236ca5 | /bin/sh /home/opc/ruby/src/master/tool/ifchange /home/opc/ruby/src/master/.bundle/.timestamp/typeprof.revision - I, [2024-05-04T08:37:43.612831 #2812191] INFO -- : gcc (GCC) 8.5.0 20210514 (Red Hat 8.5.0-10.1.0.1) I, [2024-05-04T08:37:43.612870 #2812191] INFO -- : Copyright (C) 2018 Free Software Foundation, Inc. I, [2024-05-04T08:37:43.612880 #2812191] INFO -- : This is free software; see the source for copying conditions. There is NO I, [2024-05-04T08:37:43.612890 #2812191] INFO -- : warranty; not even for MERCHANTABILITY or FITNESS FOR A PARTICULAR PURPOSE. I, [2024-05-04T08:37:43.612899 #2812191] INFO -- : I, [2024-05-04T08:37:43.613443 #2812191] INFO -- : generating enc.mk I, [2024-05-04T08:37:43.617396 #2812191] INFO -- : /home/opc/ruby/src/master/.bundle/.timestamp/typeprof.revision unchanged I, [2024-05-04T08:37:43.717029 #2812191] INFO -- : Building power_assert@84e85124c5014a139af39161d484156cfe87a9ed to /home/opc/ruby/src/master/gems/power_assert-2.0.3.gem I, [2024-05-04T08:37:43.835055 #2812191] INFO -- : Successfully built RubyGem I, [2024-05-04T08:37:43.835117 #2812191] INFO -- : Name: power_assert I, [2024-05-04T08:37:43.835129 #2812191] INFO -- : Version: 2.0.4dev I, [2024-05-04T08:37:43.835137 #2812191] INFO -- : File: power_assert-2.0.4dev.gem I, [2024-05-04T08:37:43.837507 #2812191] INFO -- : Extracting bundle gem power_assert-2.0.3... I, [2024-05-04T08:37:43.853746 #2812191] INFO -- : making srcs under enc I, [2024-05-04T08:37:43.853974 #2812191] INFO -- : making enc I, [2024-05-04T08:37:43.882274 #2812191] INFO -- : make[1]: Entering directory '/home/opc/ruby/build/master' I, [2024-05-04T08:37:43.882332 #2812191] INFO -- : make[1]: Nothing to be done for 'enc'. I, [2024-05-04T08:37:43.882343 #2812191] INFO -- : make[1]: Leaving directory '/home/opc/ruby/build/master' I, [2024-05-04T08:37:43.896555 #2812191] INFO -- : make[1]: Entering directory '/home/opc/ruby/build/master' I, [2024-05-04T08:37:43.897332 #2812191] INFO -- : make[1]: Nothing to be done for 'srcs'. I, [2024-05-04T08:37:43.897362 #2812191] INFO -- : make[1]: Leaving directory '/home/opc/ruby/build/master' I, [2024-05-04T08:37:43.898202 #2812191] INFO -- : generating transdb.h I, [2024-05-04T08:37:43.937038 #2812191] INFO -- : Try with hash version of bundled gems instead of gems/power_assert-2.0.3.gem. We don't use this gem with release version of Ruby. I, [2024-05-04T08:37:43.947635 #2812191] INFO -- : Unpacked gems/power_assert-2.0.4dev.gem I, [2024-05-04T08:37:44.042070 #2812191] INFO -- : transdb.h unchanged I, [2024-05-04T08:37:44.043391 #2812191] INFO -- : generating makefiles ext/configure-ext.mk I, [2024-05-04T08:37:44.043748 #2812191] INFO -- : making trans I, [2024-05-04T08:37:44.083116 #2812191] INFO -- : ext/configure-ext.mk unchanged I, [2024-05-04T08:37:44.086145 #2812191] INFO -- : make[1]: Entering directory '/home/opc/ruby/build/master' I, [2024-05-04T08:37:44.092214 #2812191] INFO -- : make[1]: Entering directory '/home/opc/ruby/build/master' I, [2024-05-04T08:37:44.092267 #2812191] INFO -- : make[1]: Nothing to be done for 'trans'. I, [2024-05-04T08:37:44.092278 #2812191] INFO -- : make[1]: Leaving directory '/home/opc/ruby/build/master' I, [2024-05-04T08:37:44.771097 #2812191] INFO -- : making encs I, [2024-05-04T08:37:44.810623 #2812191] INFO -- : make[1]: Leaving directory '/home/opc/ruby/build/master' I, [2024-05-04T08:37:44.811277 #2812191] INFO -- : generating makefile exts.mk I, [2024-05-04T08:37:44.828601 #2812191] INFO -- : make[1]: Entering directory '/home/opc/ruby/build/master' I, [2024-05-04T08:37:44.828659 #2812191] INFO -- : make[1]: Nothing to be done for 'encs'. I, [2024-05-04T08:37:44.828671 #2812191] INFO -- : make[1]: Leaving directory '/home/opc/ruby/build/master' I, [2024-05-04T08:37:44.869706 #2812191] INFO -- : exts.mk unchanged I, [2024-05-04T08:37:44.874534 #2812191] INFO -- : make[1]: Entering directory '/home/opc/ruby/build/master' I, [2024-05-04T08:37:44.982147 #2812191] INFO -- : make[2]: Entering directory '/home/opc/ruby/build/master/ext/coverage' I, [2024-05-04T08:37:44.983564 #2812191] INFO -- : make[2]: Entering directory '/home/opc/ruby/build/master/ext/digest' I, [2024-05-04T08:37:44.984810 #2812191] INFO -- : make[2]: Entering directory '/home/opc/ruby/build/master/ext/date' I, [2024-05-04T08:37:44.990875 #2812191] INFO -- : make[2]: Leaving directory '/home/opc/ruby/build/master/ext/date' I, [2024-05-04T08:37:44.991081 #2812191] INFO -- : make[2]: Leaving directory '/home/opc/ruby/build/master/ext/coverage' I, [2024-05-04T08:37:44.994847 #2812191] INFO -- : make[2]: Leaving directory '/home/opc/ruby/build/master/ext/digest' I, [2024-05-04T08:37:45.000392 #2812191] INFO -- : make[2]: Entering directory '/home/opc/ruby/build/master/ext/io/console' I, [2024-05-04T08:37:45.002163 #2812191] INFO -- : make[2]: Entering directory '/home/opc/ruby/build/master/ext/fiddle' I, [2024-05-04T08:37:45.007118 #2812191] INFO -- : make[2]: Leaving directory '/home/opc/ruby/build/master/ext/io/console' I, [2024-05-04T08:37:45.009233 #2812191] INFO -- : make[2]: Entering directory '/home/opc/ruby/build/master/ext/json' I, [2024-05-04T08:37:45.011223 #2812191] INFO -- : make[2]: Leaving directory '/home/opc/ruby/build/master/ext/fiddle' I, [2024-05-04T08:37:45.011372 #2812191] INFO -- : make[2]: Entering directory '/home/opc/ruby/build/master/ext/monitor' I, [2024-05-04T08:37:45.015055 #2812191] INFO -- : make[2]: Leaving directory '/home/opc/ruby/build/master/ext/monitor' I, [2024-05-04T08:37:45.018019 #2812191] INFO -- : make[2]: Entering directory '/home/opc/ruby/build/master/ext/objspace' I, [2024-05-04T08:37:45.022886 #2812191] INFO -- : make[2]: Leaving directory '/home/opc/ruby/build/master/ext/json' I, [2024-05-04T08:37:45.026995 #2812191] INFO -- : make[2]: Entering directory '/home/opc/ruby/build/master/ext/pathname' I, [2024-05-04T08:37:45.027848 #2812191] INFO -- : make[2]: Leaving directory '/home/opc/ruby/build/master/ext/objspace' I, [2024-05-04T08:37:45.031598 #2812191] INFO -- : make[2]: Leaving directory '/home/opc/ruby/build/master/ext/pathname' I, [2024-05-04T08:37:45.034005 #2812191] INFO -- : make[2]: Entering directory '/home/opc/ruby/build/master/ext/openssl' I, [2024-05-04T08:37:45.035439 #2812191] INFO -- : make[2]: Entering directory '/home/opc/ruby/build/master/ext/psych' I, [2024-05-04T08:37:45.047221 #2812191] INFO -- : make[2]: Entering directory '/home/opc/ruby/build/master/ext/pty' I, [2024-05-04T08:37:45.049437 #2812191] INFO -- : make[2]: Leaving directory '/home/opc/ruby/build/master/ext/psych' I, [2024-05-04T08:37:45.052803 #2812191] INFO -- : make[2]: Leaving directory '/home/opc/ruby/build/master/ext/pty' I, [2024-05-04T08:37:45.054595 #2812191] INFO -- : make[2]: Leaving directory '/home/opc/ruby/build/master/ext/openssl' I, [2024-05-04T08:37:45.056479 #2812191] INFO -- : make[2]: Entering directory '/home/opc/ruby/build/master/ext/rubyvm' I, [2024-05-04T08:37:45.060858 #2812191] INFO -- : make[2]: Entering directory '/home/opc/ruby/build/master/ext/ripper' I, [2024-05-04T08:37:45.062861 #2812191] INFO -- : make[2]: Leaving directory '/home/opc/ruby/build/master/ext/rubyvm' I, [2024-05-04T08:37:45.067263 #2812191] INFO -- : make[2]: Entering directory '/home/opc/ruby/build/master/ext/socket' I, [2024-05-04T08:37:45.069257 #2812191] INFO -- : make[2]: Leaving directory '/home/opc/ruby/build/master/ext/ripper' I, [2024-05-04T08:37:45.075979 #2812191] INFO -- : make[2]: Entering directory '/home/opc/ruby/build/master/.bundle/gems/bigdecimal-3.1.7/ext/bigdecimal' I, [2024-05-04T08:37:45.078802 #2812191] INFO -- : make[2]: Leaving directory '/home/opc/ruby/build/master/ext/socket' I, [2024-05-04T08:37:45.078845 #2812191] INFO -- : make[2]: Entering directory '/home/opc/ruby/build/master/.bundle/gems/debug-1.9.2/ext/debug' I, [2024-05-04T08:37:45.081064 #2812191] INFO -- : make[2]: Entering directory '/home/opc/ruby/build/master/.bundle/gems/nkf-0.2.0/ext/nkf' I, [2024-05-04T08:37:45.108639 #2812191] INFO -- : make[2]: Leaving directory '/home/opc/ruby/build/master/.bundle/gems/bigdecimal-3.1.7/ext/bigdecimal' I, [2024-05-04T08:37:45.110383 #2812191] INFO -- : make[2]: Leaving directory '/home/opc/ruby/build/master/.bundle/gems/debug-1.9.2/ext/debug' I, [2024-05-04T08:37:45.111278 #2812191] INFO -- : make[2]: Entering directory '/home/opc/ruby/build/master/.bundle/gems/racc-1.7.3/ext/racc/cparse' I, [2024-05-04T08:37:45.112417 #2812191] INFO -- : make[2]: Leaving directory '/home/opc/ruby/build/master/.bundle/gems/nkf-0.2.0/ext/nkf' I, [2024-05-04T08:37:45.113808 #2812191] INFO -- : make[2]: Entering directory '/home/opc/ruby/build/master/.bundle/gems/rbs-3.4.4/ext/rbs_extension' I, [2024-05-04T08:37:45.116025 #2812191] INFO -- : make[2]: Entering directory '/home/opc/ruby/build/master/.bundle/gems/syslog-0.1.2/ext/syslog' I, [2024-05-04T08:37:45.146741 #2812191] INFO -- : make[2]: Leaving directory '/home/opc/ruby/build/master/.bundle/gems/syslog-0.1.2/ext/syslog' I, [2024-05-04T08:37:45.146932 #2812191] INFO -- : make[2]: Leaving directory '/home/opc/ruby/build/master/.bundle/gems/rbs-3.4.4/ext/rbs_extension' I, [2024-05-04T08:37:45.151161 #2812191] INFO -- : make[2]: Leaving directory '/home/opc/ruby/build/master/.bundle/gems/racc-1.7.3/ext/racc/cparse' I, [2024-05-04T08:37:45.156478 #2812191] INFO -- : make[2]: Entering directory '/home/opc/ruby/build/master/ext/digest/sha2' I, [2024-05-04T08:37:45.160837 #2812191] INFO -- : make[2]: Leaving directory '/home/opc/ruby/build/master/ext/digest/sha2' I, [2024-05-04T08:37:45.202177 #2812191] INFO -- : make[2]: Entering directory '/home/opc/ruby/build/master' I, [2024-05-04T08:37:45.285281 #2812191] INFO -- : make[2]: 'ruby' is up to date. I, [2024-05-04T08:37:45.285358 #2812191] INFO -- : make[2]: Leaving directory '/home/opc/ruby/build/master' I, [2024-05-04T08:37:45.285756 #2812191] INFO -- : make[1]: Leaving directory '/home/opc/ruby/build/master' I, [2024-05-04T08:37:45.290010 #2812191] INFO -- : make[1]: Entering directory '/home/opc/ruby/build/master' I, [2024-05-04T08:37:45.290038 #2812191] INFO -- : make[1]: Nothing to be done for 'note'. I, [2024-05-04T08:37:45.290050 #2812191] INFO -- : make[1]: Leaving directory '/home/opc/ruby/build/master' I, [2024-05-04T08:37:45.290187 #2812191] INFO -- : ./miniruby -I/home/opc/ruby/src/master/lib -I. -I.ext/common /home/opc/ruby/src/master/tool/runruby.rb --extout=.ext -- --disable-gems -r./aarch64-linux-fake /home/opc/ruby/src/master/tool/rbinstall.rb --make="make" --dest-dir="" --extout=".ext" --ext-build-dir="./ext" --mflags="-j3 --jobserver-auth=4,5" --make-flags=" -j3 --jobserver-auth=4,5" --data-mode=0644 --prog-mode=0755 --installed-list .installed.list --mantype="doc" --gnumake --install=all --exclude=doc I, [2024-05-04T08:37:45.441841 #2812191] INFO -- : Installing to I, [2024-05-04T08:37:45.441914 #2812191] INFO -- : installing binary commands: /home/opc/ruby/install/master/bin I, [2024-05-04T08:37:45.453664 #2812191] INFO -- : installing base libraries: /home/opc/ruby/install/master/lib I, [2024-05-04T08:37:45.454184 #2812191] INFO -- : installing arch files: /home/opc/ruby/install/master/lib/ruby/3.4.0+0/aarch64-linux I, [2024-05-04T08:37:45.454293 #2812191] INFO -- : installing pkgconfig data: /home/opc/ruby/install/master/lib/pkgconfig I, [2024-05-04T08:37:45.454369 #2812191] INFO -- : installing extension objects: /home/opc/ruby/install/master/lib/ruby/3.4.0+0/aarch64-linux I, [2024-05-04T08:37:45.467108 #2812191] INFO -- : installing extension objects: /home/opc/ruby/install/master/lib/ruby/site_ruby/3.4.0+0/aarch64-linux I, [2024-05-04T08:37:45.467157 #2812191] INFO -- : installing extension objects: /home/opc/ruby/install/master/lib/ruby/vendor_ruby/3.4.0+0/aarch64-linux I, [2024-05-04T08:37:45.467309 #2812191] INFO -- : installing extension headers: /home/opc/ruby/install/master/include/ruby-3.4.0+0/aarch64-linux I, [2024-05-04T08:37:45.467579 #2812191] INFO -- : installing extension scripts: /home/opc/ruby/install/master/lib/ruby/3.4.0+0 I, [2024-05-04T08:37:45.476773 #2812191] INFO -- : installing extension scripts: /home/opc/ruby/install/master/lib/ruby/site_ruby/3.4.0+0 I, [2024-05-04T08:37:45.476795 #2812191] INFO -- : installing extension scripts: /home/opc/ruby/install/master/lib/ruby/vendor_ruby/3.4.0+0 I, [2024-05-04T08:37:45.476806 #2812191] INFO -- : installing extension headers: /home/opc/ruby/install/master/include/ruby-3.4.0+0/ruby I, [2024-05-04T08:37:45.476944 #2812191] INFO -- : installing command scripts: /home/opc/ruby/install/master/bin I, [2024-05-04T08:37:45.477084 #2812191] INFO -- : installing library scripts: /home/opc/ruby/install/master/lib/ruby/3.4.0+0 I, [2024-05-04T08:37:45.567585 #2812191] INFO -- : installing common headers: /home/opc/ruby/install/master/include/ruby-3.4.0+0 I, [2024-05-04T08:37:45.581880 #2812191] INFO -- : installing manpages: /home/opc/ruby/install/master/share/man/man1 I, [2024-05-04T08:37:45.582180 #2812191] INFO -- : installing default gems from lib: /home/opc/ruby/install/master/lib/ruby/gems/3.4.0+0 I, [2024-05-04T08:37:45.624155 #2812191] INFO -- : benchmark 0.3.0 I, [2024-05-04T08:37:45.637623 #2812191] INFO -- : bundler 2.6.0.dev I, [2024-05-04T08:37:45.642473 #2812191] INFO -- : cgi 0.4.1 I, [2024-05-04T08:37:45.643615 #2812191] INFO -- : delegate 0.3.1 I, [2024-05-04T08:37:45.644748 #2812191] INFO -- : did_you_mean 1.6.3 I, [2024-05-04T08:37:45.645978 #2812191] INFO -- : english 0.8.0 I, [2024-05-04T08:37:45.647061 #2812191] INFO -- : erb 4.0.4 I, [2024-05-04T08:37:45.649889 #2812191] INFO -- : error_highlight 0.6.0 I, [2024-05-04T08:37:45.650975 #2812191] INFO -- : fileutils 1.7.2 I, [2024-05-04T08:37:45.652053 #2812191] INFO -- : find 0.2.0 I, [2024-05-04T08:37:45.653251 #2812191] INFO -- : forwardable 1.3.3 I, [2024-05-04T08:37:45.654386 #2812191] INFO -- : ipaddr 1.2.6 I, [2024-05-04T08:37:45.655528 #2812191] INFO -- : irb 1.13.0 I, [2024-05-04T08:37:45.658239 #2812191] INFO -- : logger 1.6.0 I, [2024-05-04T08:37:45.659405 #2812191] INFO -- : net-http 0.4.1 I, [2024-05-04T08:37:45.662280 #2812191] INFO -- : net-protocol 0.2.2 I, [2024-05-04T08:37:45.663459 #2812191] INFO -- : open-uri 0.4.1 I, [2024-05-04T08:37:45.664680 #2812191] INFO -- : open3 0.2.1 I, [2024-05-04T08:37:45.665859 #2812191] INFO -- : optparse 0.5.0 I, [2024-05-04T08:37:45.667019 #2812191] INFO -- : ostruct 0.6.0 I, [2024-05-04T08:37:45.668103 #2812191] INFO -- : pp 0.5.0 I, [2024-05-04T08:37:45.669339 #2812191] INFO -- : prettyprint 0.2.0 I, [2024-05-04T08:37:45.670464 #2812191] INFO -- : prism 0.27.0 I, [2024-05-04T08:37:45.671661 #2812191] INFO -- : pstore 0.1.3 I, [2024-05-04T08:37:45.673036 #2812191] INFO -- : rdoc 6.6.3.1 I, [2024-05-04T08:37:45.677013 #2812191] INFO -- : readline 0.0.4 I, [2024-05-04T08:37:45.678187 #2812191] INFO -- : reline 0.5.5 I, [2024-05-04T08:37:45.679376 #2812191] INFO -- : resolv 0.4.0 I, [2024-05-04T08:37:45.680523 #2812191] INFO -- : ruby2_keywords 0.0.5 I, [2024-05-04T08:37:45.681743 #2812191] INFO -- : securerandom 0.3.1 I, [2024-05-04T08:37:45.682916 #2812191] INFO -- : set 1.1.0 I, [2024-05-04T08:37:45.684119 #2812191] INFO -- : shellwords 0.2.0 I, [2024-05-04T08:37:45.685377 #2812191] INFO -- : singleton 0.2.0 I, [2024-05-04T08:37:45.686539 #2812191] INFO -- : syntax_suggest 2.0.0 I, [2024-05-04T08:37:45.691108 #2812191] INFO -- : tempfile 0.2.1 I, [2024-05-04T08:37:45.692308 #2812191] INFO -- : time 0.3.0 I, [2024-05-04T08:37:45.693555 #2812191] INFO -- : timeout 0.4.1 I, [2024-05-04T08:37:45.694703 #2812191] INFO -- : tmpdir 0.2.0 I, [2024-05-04T08:37:45.695877 #2812191] INFO -- : tsort 0.2.0 I, [2024-05-04T08:37:45.697146 #2812191] INFO -- : un 0.3.0 I, [2024-05-04T08:37:45.698293 #2812191] INFO -- : uri 0.13.0 I, [2024-05-04T08:37:45.699480 #2812191] INFO -- : weakref 0.1.3 I, [2024-05-04T08:37:45.700639 #2812191] INFO -- : yaml 0.3.0 I, [2024-05-04T08:37:45.701650 #2812191] INFO -- : installing default gems from ext: /home/opc/ruby/install/master/lib/ruby/gems/3.4.0+0 I, [2024-05-04T08:37:45.711436 #2812191] INFO -- : date 3.3.4 I, [2024-05-04T08:37:45.714257 #2812191] INFO -- : digest 3.1.1 I, [2024-05-04T08:37:45.715384 #2812191] INFO -- : etc 1.4.3 I, [2024-05-04T08:37:45.716581 #2812191] INFO -- : fcntl 1.1.0 I, [2024-05-04T08:37:45.717788 #2812191] INFO -- : fiddle 1.1.3 I, [2024-05-04T08:37:45.718969 #2812191] INFO -- : io-console 0.7.2 I, [2024-05-04T08:37:45.720084 #2812191] INFO -- : io-nonblock 0.3.0 I, [2024-05-04T08:37:45.721286 #2812191] INFO -- : io-wait 0.3.1 I, [2024-05-04T08:37:45.722405 #2812191] INFO -- : json 2.7.2 I, [2024-05-04T08:37:45.723844 #2812191] INFO -- : openssl 3.2.0 I, [2024-05-04T08:37:45.725084 #2812191] INFO -- : pathname 0.3.0 I, [2024-05-04T08:37:45.726770 #2812191] INFO -- : psych 5.1.2 I, [2024-05-04T08:37:45.728038 #2812191] INFO -- : stringio 3.1.1 I, [2024-05-04T08:37:45.729431 #2812191] INFO -- : strscan 3.1.1 I, [2024-05-04T08:37:45.730627 #2812191] INFO -- : zlib 3.1.0 I, [2024-05-04T08:37:45.731568 #2812191] INFO -- : installing bundled gems: /home/opc/ruby/install/master/lib/ruby/gems/3.4.0+0 I, [2024-05-04T08:37:45.732222 #2812191] INFO -- : minitest 5.22.3 I, [2024-05-04T08:37:45.747226 #2812191] INFO -- : rake 13.2.1 I, [2024-05-04T08:37:45.760721 #2812191] INFO -- : test-unit 3.6.2 I, [2024-05-04T08:37:45.777588 #2812191] INFO -- : rexml 3.2.6 I, [2024-05-04T08:37:45.791940 #2812191] INFO -- : rss 0.3.0 I, [2024-05-04T08:37:45.802408 #2812191] INFO -- : net-ftp 0.3.4 I, [2024-05-04T08:37:45.806112 #2812191] INFO -- : net-imap 0.4.10 I, [2024-05-04T08:37:45.824790 #2812191] INFO -- : net-pop 0.1.2 I, [2024-05-04T08:37:45.829324 #2812191] INFO -- : net-smtp 0.5.0 I, [2024-05-04T08:37:45.832537 #2812191] INFO -- : matrix 0.4.2 I, [2024-05-04T08:37:45.838468 #2812191] INFO -- : prime 0.1.2 I, [2024-05-04T08:37:45.849045 #2812191] INFO -- : rbs 3.4.4 I, [2024-05-04T08:37:45.951261 #2812191] INFO -- : typeprof 0.21.11 I, [2024-05-04T08:37:45.959580 #2812191] INFO -- : debug 1.9.2 I, [2024-05-04T08:37:45.969875 #2812191] INFO -- : racc 1.7.3 I, [2024-05-04T08:37:45.979937 #2812191] INFO -- : mutex_m 0.2.0 I, [2024-05-04T08:37:45.982901 #2812191] INFO -- : getoptlong 0.2.1 I, [2024-05-04T08:37:45.988678 #2812191] INFO -- : base64 0.2.0 I, [2024-05-04T08:37:45.991033 #2812191] INFO -- : bigdecimal 3.1.7 I, [2024-05-04T08:37:45.997612 #2812191] INFO -- : observer 0.1.2 I, [2024-05-04T08:37:46.000544 #2812191] INFO -- : abbrev 0.1.2 I, [2024-05-04T08:37:46.003641 #2812191] INFO -- : resolv-replace 0.1.1 I, [2024-05-04T08:37:46.007001 #2812191] INFO -- : rinda 0.2.0 I, [2024-05-04T08:37:46.010611 #2812191] INFO -- : drb 2.2.1 I, [2024-05-04T08:37:46.015263 #2812191] INFO -- : nkf 0.2.0 I, [2024-05-04T08:37:46.023413 #2812191] INFO -- : syslog 0.1.2 I, [2024-05-04T08:37:46.028039 #2812191] INFO -- : csv 3.3.0 I, [2024-05-04T08:37:46.043732 #2812191] INFO -- : installing bundled gem cache: /home/opc/ruby/install/master/lib/ruby/gems/3.4.0+0/cache I, [2024-05-04T08:37:46.045714 #2812191] INFO -- : skipped bundled gems: I, [2024-05-04T08:37:46.045744 #2812191] INFO -- : power_assert-2.0.4dev.gem not found in bundled_gems I, [2024-05-04T08:37:46.048670 #2812191] INFO -- : $$$[end] "make install -j3" exit with 0. I, [2024-05-04T08:37:46.048822 #2812191] INFO -- : $$$[beg] make yes-btest TESTOPTS='-q -j3' I, [2024-05-04T08:38:08.576324 #2812191] INFO -- : PASS all 1935 tests E, [2024-05-04T08:38:08.577940 #2812191] ERROR -- : I, [2024-05-04T08:38:08.578088 #2812191] INFO -- : $$$[end] "make yes-btest TESTOPTS='-q -j3'" exit with 0. I, [2024-05-04T08:38:08.578244 #2812191] INFO -- : $$$[beg] make yes-test-basic TESTS='-j3' I, [2024-05-04T08:38:08.670940 #2812191] INFO -- : BASERUBY = /usr/local/bin/ruby --disable=gems I, [2024-05-04T08:38:08.672400 #2812191] INFO -- : CC = gcc I, [2024-05-04T08:38:08.672414 #2812191] INFO -- : LD = ld I, [2024-05-04T08:38:08.672426 #2812191] INFO -- : LDSHARED = gcc -shared I, [2024-05-04T08:38:08.672435 #2812191] INFO -- : CFLAGS = -O3 -fno-fast-math -ggdb3 -Wall -Wextra -Wdeprecated-declarations -Wdiv-by-zero -Wduplicated-cond -Wimplicit-function-declaration -Wimplicit-int -Wpointer-arith -Wwrite-strings -Wold-style-definition -Wimplicit-fallthrough=0 -Wmissing-noreturn -Wno-cast-function-type -Wno-constant-logical-operand -Wno-long-long -Wno-missing-field-initializers -Wno-overlength-strings -Wno-packed-bitfield-compat -Wno-parentheses-equality -Wno-self-assign -Wno-tautological-compare -Wno-unused-parameter -Wno-unused-value -Wsuggest-attribute=format -Wsuggest-attribute=noreturn -Wunused-variable -Wmisleading-indentation -Wundef I, [2024-05-04T08:38:08.672444 #2812191] INFO -- : XCFLAGS = -U_FORTIFY_SOURCE -D_FORTIFY_SOURCE=2 -fstack-protector-strong -msign-return-address=all -fno-strict-overflow -fvisibility=hidden -fexcess-precision=standard -DRUBY_EXPORT -fPIE -I. -I.ext/include/aarch64-linux -I/home/opc/ruby/src/master/include -I/home/opc/ruby/src/master -I/home/opc/ruby/src/master/prism -I/home/opc/ruby/src/master/enc/unicode/15.0.0 I, [2024-05-04T08:38:08.672452 #2812191] INFO -- : CPPFLAGS = I, [2024-05-04T08:38:08.672460 #2812191] INFO -- : DLDFLAGS = -Wl,--compress-debug-sections=zlib -fstack-protector-strong -pie I, [2024-05-04T08:38:08.672468 #2812191] INFO -- : SOLIBS = -lz -lrt -lrt -ldl -lcrypt -lm -lpthread I, [2024-05-04T08:38:08.672476 #2812191] INFO -- : LANG = en_US.UTF-8 I, [2024-05-04T08:38:08.672483 #2812191] INFO -- : LC_ALL = I, [2024-05-04T08:38:08.672517 #2812191] INFO -- : LC_CTYPE = I, [2024-05-04T08:38:08.672528 #2812191] INFO -- : MFLAGS = I, [2024-05-04T08:38:08.672535 #2812191] INFO -- : RUSTC = rustc I, [2024-05-04T08:38:08.672544 #2812191] INFO -- : YJIT_RUSTC_ARGS = --crate-name=yjit --crate-type=staticlib --edition=2021 -g -C lto=thin -C opt-level=3 -C overflow-checks=on '--out-dir=/home/opc/ruby/build/master/yjit/target/release/' /home/opc/ruby/src/master/yjit/src/lib.rs I, [2024-05-04T08:38:08.672552 #2812191] INFO -- : gcc (GCC) 8.5.0 20210514 (Red Hat 8.5.0-10.1.0.1) I, [2024-05-04T08:38:08.672560 #2812191] INFO -- : Copyright (C) 2018 Free Software Foundation, Inc. I, [2024-05-04T08:38:08.672567 #2812191] INFO -- : This is free software; see the source for copying conditions. There is NO I, [2024-05-04T08:38:08.672575 #2812191] INFO -- : warranty; not even for MERCHANTABILITY or FITNESS FOR A PARTICULAR PURPOSE. I, [2024-05-04T08:38:08.672583 #2812191] INFO -- : I, [2024-05-04T08:38:08.828538 #2812191] INFO -- : Checking leaked global symbols...none I, [2024-05-04T08:38:08.880419 #2812191] INFO -- : /home/opc/ruby/src/master/basictest/test.rb:assignment ....................................................................................................................................................................................................................................................................................................................................................................................OK 372 I, [2024-05-04T08:38:08.880508 #2812191] INFO -- : /home/opc/ruby/src/master/basictest/test.rb:condition ..OK 2 I, [2024-05-04T08:38:08.880526 #2812191] INFO -- : /home/opc/ruby/src/master/basictest/test.rb:if/unless ...OK 3 I, [2024-05-04T08:38:08.880577 #2812191] INFO -- : /home/opc/ruby/src/master/basictest/test.rb:case .....OK 5 I, [2024-05-04T08:38:08.881161 #2812191] INFO -- : /home/opc/ruby/src/master/basictest/test.rb:while/until ........OK 8 I, [2024-05-04T08:38:08.881282 #2812191] INFO -- : /home/opc/ruby/src/master/basictest/test.rb:exception ..........OK 10 I, [2024-05-04T08:38:08.881901 #2812191] INFO -- : /home/opc/ruby/src/master/basictest/test.rb:array .......................................OK 39 I, [2024-05-04T08:38:08.882163 #2812191] INFO -- : /home/opc/ruby/src/master/basictest/test.rb:hash ...........................OK 27 I, [2024-05-04T08:38:08.883800 #2812191] INFO -- : /home/opc/ruby/src/master/basictest/test.rb:iterator ...........................................................................................................OK 107 I, [2024-05-04T08:38:08.884556 #2812191] INFO -- : /home/opc/ruby/src/master/basictest/test.rb:float ................................................................................OK 80 I, [2024-05-04T08:38:08.888027 #2812191] INFO -- : /home/opc/ruby/src/master/basictest/test.rb:bignum ...............................OK 31 I, [2024-05-04T08:38:08.889601 #2812191] INFO -- : /home/opc/ruby/src/master/basictest/test.rb:string & char ..............................................................OK 62 I, [2024-05-04T08:38:08.889680 #2812191] INFO -- : /home/opc/ruby/src/master/basictest/test.rb:assignment ..........OK 10 I, [2024-05-04T08:38:08.889750 #2812191] INFO -- : /home/opc/ruby/src/master/basictest/test.rb:call ......OK 6 I, [2024-05-04T08:38:08.889874 #2812191] INFO -- : /home/opc/ruby/src/master/basictest/test.rb:proc .........OK 9 I, [2024-05-04T08:38:08.990086 #2812191] INFO -- : /home/opc/ruby/src/master/basictest/test.rb:signal ..OK 2 I, [2024-05-04T08:38:08.991738 #2812191] INFO -- : /home/opc/ruby/src/master/basictest/test.rb:eval ...........................OK 27 I, [2024-05-04T08:38:09.125306 #2812191] INFO -- : /home/opc/ruby/src/master/basictest/test.rb:system ........OK 8 I, [2024-05-04T08:38:09.125375 #2812191] INFO -- : /home/opc/ruby/src/master/basictest/test.rb:const .....OK 5 I, [2024-05-04T08:38:09.125463 #2812191] INFO -- : /home/opc/ruby/src/master/basictest/test.rb:clone .....OK 5 I, [2024-05-04T08:38:09.125653 #2812191] INFO -- : /home/opc/ruby/src/master/basictest/test.rb:marshal ....OK 4 I, [2024-05-04T08:38:09.125728 #2812191] INFO -- : /home/opc/ruby/src/master/basictest/test.rb:pack ....OK 4 I, [2024-05-04T08:38:09.125761 #2812191] INFO -- : /home/opc/ruby/src/master/basictest/test.rb:math ..OK 2 I, [2024-05-04T08:38:09.125851 #2812191] INFO -- : /home/opc/ruby/src/master/basictest/test.rb:struct ......OK 6 I, [2024-05-04T08:38:09.126034 #2812191] INFO -- : /home/opc/ruby/src/master/basictest/test.rb:variable ............OK 12 I, [2024-05-04T08:38:09.126074 #2812191] INFO -- : /home/opc/ruby/src/master/basictest/test.rb:trace ...OK 3 I, [2024-05-04T08:38:09.126200 #2812191] INFO -- : /home/opc/ruby/src/master/basictest/test.rb:defined? ............OK 12 I, [2024-05-04T08:38:09.126288 #2812191] INFO -- : /home/opc/ruby/src/master/basictest/test.rb:alias ......OK 6 I, [2024-05-04T08:38:09.126811 #2812191] INFO -- : /home/opc/ruby/src/master/basictest/test.rb:path .......................OK 23 I, [2024-05-04T08:38:09.195376 #2812191] INFO -- : /home/opc/ruby/src/master/basictest/test.rb:gc ....OK 4 I, [2024-05-04T08:38:09.197358 #2812191] INFO -- : I, [2024-05-04T08:38:09.197394 #2812191] INFO -- : test succeeded I, [2024-05-04T08:38:09.198162 #2812191] INFO -- : $$$[end] "make yes-test-basic TESTS='-j3'" exit with 0. I, [2024-05-04T08:38:09.198348 #2812191] INFO -- : $$$[beg] make yes-test-all TESTOPTS='--stderr-on-failure' TESTS='-j3' I, [2024-05-04T08:38:09.323465 #2812191] INFO -- : BASERUBY = /usr/local/bin/ruby --disable=gems I, [2024-05-04T08:38:09.323541 #2812191] INFO -- : CC = gcc I, [2024-05-04T08:38:09.323552 #2812191] INFO -- : LD = ld I, [2024-05-04T08:38:09.323561 #2812191] INFO -- : LDSHARED = gcc -shared I, [2024-05-04T08:38:09.323573 #2812191] INFO -- : CFLAGS = -O3 -fno-fast-math -ggdb3 -Wall -Wextra -Wdeprecated-declarations -Wdiv-by-zero -Wduplicated-cond -Wimplicit-function-declaration -Wimplicit-int -Wpointer-arith -Wwrite-strings -Wold-style-definition -Wimplicit-fallthrough=0 -Wmissing-noreturn -Wno-cast-function-type -Wno-constant-logical-operand -Wno-long-long -Wno-missing-field-initializers -Wno-overlength-strings -Wno-packed-bitfield-compat -Wno-parentheses-equality -Wno-self-assign -Wno-tautological-compare -Wno-unused-parameter -Wno-unused-value -Wsuggest-attribute=format -Wsuggest-attribute=noreturn -Wunused-variable -Wmisleading-indentation -Wundef I, [2024-05-04T08:38:09.323584 #2812191] INFO -- : XCFLAGS = -U_FORTIFY_SOURCE -D_FORTIFY_SOURCE=2 -fstack-protector-strong -msign-return-address=all -fno-strict-overflow -fvisibility=hidden -fexcess-precision=standard -DRUBY_EXPORT -fPIE -I. -I.ext/include/aarch64-linux -I/home/opc/ruby/src/master/include -I/home/opc/ruby/src/master -I/home/opc/ruby/src/master/prism -I/home/opc/ruby/src/master/enc/unicode/15.0.0 I, [2024-05-04T08:38:09.323593 #2812191] INFO -- : CPPFLAGS = I, [2024-05-04T08:38:09.323601 #2812191] INFO -- : DLDFLAGS = -Wl,--compress-debug-sections=zlib -fstack-protector-strong -pie I, [2024-05-04T08:38:09.323611 #2812191] INFO -- : SOLIBS = -lz -lrt -lrt -ldl -lcrypt -lm -lpthread I, [2024-05-04T08:38:09.323619 #2812191] INFO -- : LANG = en_US.UTF-8 I, [2024-05-04T08:38:09.323627 #2812191] INFO -- : LC_ALL = I, [2024-05-04T08:38:09.323636 #2812191] INFO -- : LC_CTYPE = I, [2024-05-04T08:38:09.323644 #2812191] INFO -- : MFLAGS = I, [2024-05-04T08:38:09.323652 #2812191] INFO -- : RUSTC = rustc I, [2024-05-04T08:38:09.323660 #2812191] INFO -- : YJIT_RUSTC_ARGS = --crate-name=yjit --crate-type=staticlib --edition=2021 -g -C lto=thin -C opt-level=3 -C overflow-checks=on '--out-dir=/home/opc/ruby/build/master/yjit/target/release/' /home/opc/ruby/src/master/yjit/src/lib.rs I, [2024-05-04T08:38:09.324377 #2812191] INFO -- : gcc (GCC) 8.5.0 20210514 (Red Hat 8.5.0-10.1.0.1) I, [2024-05-04T08:38:09.324395 #2812191] INFO -- : Copyright (C) 2018 Free Software Foundation, Inc. I, [2024-05-04T08:38:09.324404 #2812191] INFO -- : This is free software; see the source for copying conditions. There is NO I, [2024-05-04T08:38:09.324413 #2812191] INFO -- : warranty; not even for MERCHANTABILITY or FITNESS FOR A PARTICULAR PURPOSE. I, [2024-05-04T08:38:09.324421 #2812191] INFO -- : I, [2024-05-04T08:38:09.326489 #2812191] INFO -- : generating enc.mk I, [2024-05-04T08:38:09.575314 #2812191] INFO -- : making enc I, [2024-05-04T08:38:09.602601 #2812191] INFO -- : make[1]: Entering directory '/home/opc/ruby/build/master' I, [2024-05-04T08:38:09.602691 #2812191] INFO -- : make[1]: Nothing to be done for 'enc'. I, [2024-05-04T08:38:09.602712 #2812191] INFO -- : make[1]: Leaving directory '/home/opc/ruby/build/master' I, [2024-05-04T08:38:09.603481 #2812191] INFO -- : making srcs under enc I, [2024-05-04T08:38:09.646137 #2812191] INFO -- : make[1]: Entering directory '/home/opc/ruby/build/master' I, [2024-05-04T08:38:09.646205 #2812191] INFO -- : make[1]: Nothing to be done for 'srcs'. I, [2024-05-04T08:38:09.646216 #2812191] INFO -- : make[1]: Leaving directory '/home/opc/ruby/build/master' I, [2024-05-04T08:38:09.647375 #2812191] INFO -- : generating transdb.h I, [2024-05-04T08:38:09.793090 #2812191] INFO -- : transdb.h unchanged I, [2024-05-04T08:38:09.794672 #2812191] INFO -- : making trans I, [2024-05-04T08:38:09.843690 #2812191] INFO -- : make[1]: Entering directory '/home/opc/ruby/build/master' I, [2024-05-04T08:38:09.843765 #2812191] INFO -- : make[1]: Nothing to be done for 'trans'. I, [2024-05-04T08:38:09.843776 #2812191] INFO -- : make[1]: Leaving directory '/home/opc/ruby/build/master' I, [2024-05-04T08:38:09.844582 #2812191] INFO -- : making encs I, [2024-05-04T08:38:09.897920 #2812191] INFO -- : make[1]: Entering directory '/home/opc/ruby/build/master' I, [2024-05-04T08:38:09.897987 #2812191] INFO -- : make[1]: Nothing to be done for 'encs'. I, [2024-05-04T08:38:09.897998 #2812191] INFO -- : make[1]: Leaving directory '/home/opc/ruby/build/master' I, [2024-05-04T08:38:09.900067 #2812191] INFO -- : generating makefiles ext/configure-ext.mk I, [2024-05-04T08:38:09.940738 #2812191] INFO -- : ext/configure-ext.mk updated I, [2024-05-04T08:38:09.944420 #2812191] INFO -- : make[1]: Entering directory '/home/opc/ruby/build/master' I, [2024-05-04T08:38:11.978959 #2812191] INFO -- : make[1]: Leaving directory '/home/opc/ruby/build/master' I, [2024-05-04T08:38:11.979661 #2812191] INFO -- : generating makefile exts.mk I, [2024-05-04T08:38:12.039011 #2812191] INFO -- : exts.mk unchanged I, [2024-05-04T08:38:12.043936 #2812191] INFO -- : make[1]: Entering directory '/home/opc/ruby/build/master' I, [2024-05-04T08:38:12.345344 #2812191] INFO -- : make[2]: Entering directory '/home/opc/ruby/build/master/ext/coverage' I, [2024-05-04T08:38:12.349950 #2812191] INFO -- : make[2]: Leaving directory '/home/opc/ruby/build/master/ext/coverage' I, [2024-05-04T08:38:12.355458 #2812191] INFO -- : make[2]: Entering directory '/home/opc/ruby/build/master/ext/date' I, [2024-05-04T08:38:12.360633 #2812191] INFO -- : make[2]: Leaving directory '/home/opc/ruby/build/master/ext/date' I, [2024-05-04T08:38:12.363962 #2812191] INFO -- : make[2]: Entering directory '/home/opc/ruby/build/master/ext/digest' I, [2024-05-04T08:38:12.373243 #2812191] INFO -- : make[2]: Leaving directory '/home/opc/ruby/build/master/ext/digest' I, [2024-05-04T08:38:12.395729 #2812191] INFO -- : make[2]: Entering directory '/home/opc/ruby/build/master/ext/digest/sha2' I, [2024-05-04T08:38:12.400627 #2812191] INFO -- : make[2]: Leaving directory '/home/opc/ruby/build/master/ext/digest/sha2' I, [2024-05-04T08:38:12.418800 #2812191] INFO -- : make[2]: Entering directory '/home/opc/ruby/build/master/ext/fiddle' I, [2024-05-04T08:38:12.429004 #2812191] INFO -- : make[2]: Leaving directory '/home/opc/ruby/build/master/ext/fiddle' I, [2024-05-04T08:38:12.433339 #2812191] INFO -- : make[2]: Entering directory '/home/opc/ruby/build/master/ext/io/console' I, [2024-05-04T08:38:12.437668 #2812191] INFO -- : make[2]: Leaving directory '/home/opc/ruby/build/master/ext/io/console' I, [2024-05-04T08:38:12.448285 #2812191] INFO -- : make[2]: Entering directory '/home/opc/ruby/build/master/ext/json' I, [2024-05-04T08:38:12.457789 #2812191] INFO -- : make[2]: Leaving directory '/home/opc/ruby/build/master/ext/json' I, [2024-05-04T08:38:12.470602 #2812191] INFO -- : make[2]: Entering directory '/home/opc/ruby/build/master/ext/monitor' I, [2024-05-04T08:38:12.474695 #2812191] INFO -- : make[2]: Leaving directory '/home/opc/ruby/build/master/ext/monitor' I, [2024-05-04T08:38:12.480741 #2812191] INFO -- : make[2]: Entering directory '/home/opc/ruby/build/master/ext/objspace' I, [2024-05-04T08:38:12.487079 #2812191] INFO -- : make[2]: Leaving directory '/home/opc/ruby/build/master/ext/objspace' I, [2024-05-04T08:38:12.506381 #2812191] INFO -- : make[2]: Entering directory '/home/opc/ruby/build/master/ext/openssl' I, [2024-05-04T08:38:12.528167 #2812191] INFO -- : make[2]: Leaving directory '/home/opc/ruby/build/master/ext/openssl' I, [2024-05-04T08:38:12.532399 #2812191] INFO -- : make[2]: Entering directory '/home/opc/ruby/build/master/ext/pathname' I, [2024-05-04T08:38:12.536665 #2812191] INFO -- : make[2]: Leaving directory '/home/opc/ruby/build/master/ext/pathname' I, [2024-05-04T08:38:12.542978 #2812191] INFO -- : make[2]: Entering directory '/home/opc/ruby/build/master/ext/psych' I, [2024-05-04T08:38:12.564472 #2812191] INFO -- : make[2]: Leaving directory '/home/opc/ruby/build/master/ext/psych' I, [2024-05-04T08:38:12.568976 #2812191] INFO -- : make[2]: Entering directory '/home/opc/ruby/build/master/ext/pty' I, [2024-05-04T08:38:12.573252 #2812191] INFO -- : make[2]: Leaving directory '/home/opc/ruby/build/master/ext/pty' I, [2024-05-04T08:38:12.586913 #2812191] INFO -- : make[2]: Entering directory '/home/opc/ruby/build/master/ext/ripper' I, [2024-05-04T08:38:12.594658 #2812191] INFO -- : make[2]: Leaving directory '/home/opc/ruby/build/master/ext/ripper' I, [2024-05-04T08:38:12.596642 #2812191] INFO -- : make[2]: Entering directory '/home/opc/ruby/build/master/ext/rubyvm' I, [2024-05-04T08:38:12.600118 #2812191] INFO -- : make[2]: Leaving directory '/home/opc/ruby/build/master/ext/rubyvm' I, [2024-05-04T08:38:12.612211 #2812191] INFO -- : make[2]: Entering directory '/home/opc/ruby/build/master/ext/socket' I, [2024-05-04T08:38:12.622946 #2812191] INFO -- : make[2]: Leaving directory '/home/opc/ruby/build/master/ext/socket' I, [2024-05-04T08:38:12.638344 #2812191] INFO -- : make[2]: Entering directory '/home/opc/ruby/build/master/.bundle/gems/bigdecimal-3.1.7/ext/bigdecimal' I, [2024-05-04T08:38:12.669473 #2812191] INFO -- : make[2]: Leaving directory '/home/opc/ruby/build/master/.bundle/gems/bigdecimal-3.1.7/ext/bigdecimal' I, [2024-05-04T08:38:12.672068 #2812191] INFO -- : make[2]: Entering directory '/home/opc/ruby/build/master/.bundle/gems/debug-1.9.2/ext/debug' I, [2024-05-04T08:38:12.702803 #2812191] INFO -- : make[2]: Leaving directory '/home/opc/ruby/build/master/.bundle/gems/debug-1.9.2/ext/debug' I, [2024-05-04T08:38:12.705464 #2812191] INFO -- : make[2]: Entering directory '/home/opc/ruby/build/master/.bundle/gems/nkf-0.2.0/ext/nkf' I, [2024-05-04T08:38:12.736141 #2812191] INFO -- : make[2]: Leaving directory '/home/opc/ruby/build/master/.bundle/gems/nkf-0.2.0/ext/nkf' I, [2024-05-04T08:38:12.738729 #2812191] INFO -- : make[2]: Entering directory '/home/opc/ruby/build/master/.bundle/gems/racc-1.7.3/ext/racc/cparse' I, [2024-05-04T08:38:12.769365 #2812191] INFO -- : make[2]: Leaving directory '/home/opc/ruby/build/master/.bundle/gems/racc-1.7.3/ext/racc/cparse' I, [2024-05-04T08:38:12.772315 #2812191] INFO -- : make[2]: Entering directory '/home/opc/ruby/build/master/.bundle/gems/rbs-3.4.4/ext/rbs_extension' I, [2024-05-04T08:38:12.803340 #2812191] INFO -- : make[2]: Leaving directory '/home/opc/ruby/build/master/.bundle/gems/rbs-3.4.4/ext/rbs_extension' I, [2024-05-04T08:38:12.805922 #2812191] INFO -- : make[2]: Entering directory '/home/opc/ruby/build/master/.bundle/gems/syslog-0.1.2/ext/syslog' I, [2024-05-04T08:38:12.836683 #2812191] INFO -- : make[2]: Leaving directory '/home/opc/ruby/build/master/.bundle/gems/syslog-0.1.2/ext/syslog' I, [2024-05-04T08:38:12.875045 #2812191] INFO -- : make[2]: Entering directory '/home/opc/ruby/build/master' I, [2024-05-04T08:38:12.958747 #2812191] INFO -- : make[2]: 'ruby' is up to date. I, [2024-05-04T08:38:12.958827 #2812191] INFO -- : make[2]: Leaving directory '/home/opc/ruby/build/master' I, [2024-05-04T08:38:12.958969 #2812191] INFO -- : make[1]: Leaving directory '/home/opc/ruby/build/master' I, [2024-05-04T08:38:12.963403 #2812191] INFO -- : make[1]: Entering directory '/home/opc/ruby/build/master' I, [2024-05-04T08:38:12.963449 #2812191] INFO -- : make[1]: Nothing to be done for 'note'. I, [2024-05-04T08:38:12.963460 #2812191] INFO -- : make[1]: Leaving directory '/home/opc/ruby/build/master' I, [2024-05-04T08:38:13.076432 #2812191] INFO -- : Run options: I, [2024-05-04T08:38:13.076528 #2812191] INFO -- : --seed=34953 I, [2024-05-04T08:38:13.076545 #2812191] INFO -- : "--ruby=./miniruby -I/home/opc/ruby/src/master/lib -I. -I.ext/common /home/opc/ruby/src/master/tool/runruby.rb --extout=.ext -- --disable-gems" I, [2024-05-04T08:38:13.076555 #2812191] INFO -- : --excludes-dir=/home/opc/ruby/src/master/test/.excludes I, [2024-05-04T08:38:13.076564 #2812191] INFO -- : --name=!/memory_leak/ I, [2024-05-04T08:38:13.076573 #2812191] INFO -- : --stderr-on-failure I, [2024-05-04T08:38:13.076581 #2812191] INFO -- : -j3 I, [2024-05-04T08:38:13.076590 #2812191] INFO -- : I, [2024-05-04T08:38:13.076598 #2812191] INFO -- : # Running tests: I, [2024-05-04T08:38:13.076606 #2812191] INFO -- : I, [2024-05-04T08:38:13.208240 #2812191] INFO -- : [ 1/885] 2853045=test_gem_config_file I, [2024-05-04T08:38:13.212676 #2812191] INFO -- : [ 2/885] 2853047=json_string_matching_test I, [2024-05-04T08:38:13.220392 #2812191] INFO -- : [ 3/885] 2853046=test_comparable I, [2024-05-04T08:38:13.223094 #2812191] INFO -- : [ 4/885] 2853046=test_yjit_exit_locations I, [2024-05-04T08:38:13.230276 #2812191] INFO -- : [ 5/885] 2853046=test_rdoc_rdoc I, [2024-05-04T08:38:13.234304 #2812191] INFO -- : [ 6/885] 2853047=test_type_completor I, [2024-05-04T08:38:13.355313 #2812191] INFO -- : [ 7/885] 2853047=test_rdoc_normal_module I, [2024-05-04T08:38:13.440825 #2812191] INFO -- : [ 8/885] 2853047=test_io_timeout I, [2024-05-04T08:38:13.448545 #2812191] INFO -- : [ 9/885] 2853047=test_rdoc_markdown_test I, [2024-05-04T08:38:13.486530 #2812191] INFO -- : [ 10/885] 2853046=test_io_buffer I, [2024-05-04T08:38:13.519774 #2812191] INFO -- : [ 11/885] 2853046=test_ldap I, [2024-05-04T08:38:13.540368 #2812191] INFO -- : [ 12/885] 2853046=test_kdf I, [2024-05-04T08:38:13.579191 #2812191] INFO -- : [ 13/885] 2853045=test_nowrite I, [2024-05-04T08:38:13.613547 #2812191] INFO -- : [ 14/885] 2853045=test_defined I, [2024-05-04T08:38:13.664360 #2812191] INFO -- : [ 15/885] 2853045=test_passing_block I, [2024-05-04T08:38:13.671162 #2812191] INFO -- : [ 16/885] 2853046=test_thread_queue I, [2024-05-04T08:38:13.680647 #2812191] INFO -- : [ 17/885] 2853045=test_wait I, [2024-05-04T08:38:13.732794 #2812191] INFO -- : [ 18/885] 2853045=test_human_typo I, [2024-05-04T08:38:13.759012 #2812191] INFO -- : [ 19/885] 2853045=test_import I, [2024-05-04T08:38:14.104857 #2812191] INFO -- : [ 20/885] 2853045=test_psych I, [2024-05-04T08:38:14.141626 #2812191] INFO -- : [ 21/885] 2853045=test_nil I, [2024-05-04T08:38:14.146616 #2812191] INFO -- : [ 22/885] 2853045=test_gem_commands_yank_command I, [2024-05-04T08:38:14.434939 #2812191] INFO -- : [ 23/885] 2853047=test_yaml_tree I, [2024-05-04T08:38:14.491695 #2812191] INFO -- : [ 24/885] 2853047=test_gem_resolver_dependency_request I, [2024-05-04T08:38:14.663014 #2812191] INFO -- : [ 25/885] 2853047=test_euc_tw I, [2024-05-04T08:38:14.663471 #2812191] INFO -- : [ 26/885] 2853045=test_command I, [2024-05-04T08:38:14.761501 #2812191] INFO -- : [ 27/885] 2853047=test_cstr I, [2024-05-04T08:38:15.104017 #2812191] INFO -- : [ 28/885] 2853045=test_gem_resolver_specification I, [2024-05-04T08:38:15.119077 #2812191] INFO -- : [ 29/885] 2853047=test_big2str I, [2024-05-04T08:38:15.135808 #2812191] INFO -- : [ 30/885] 2853047=test_logger I, [2024-05-04T08:38:15.148853 #2812191] INFO -- : [ 31/885] 2853047=test_pkey_dsa I, [2024-05-04T08:38:15.187761 #2812191] INFO -- : [ 32/885] 2853045=test_files_lib I, [2024-05-04T08:38:17.647418 #2812191] INFO -- : [ 33/885] 2853047=test_help I, [2024-05-04T08:38:17.670131 #2812191] INFO -- : [ 34/885] 2853047=test_string_memory I, [2024-05-04T08:38:17.705263 #2812191] INFO -- : [ 35/885] 2853047=test_enumerator_kw I, [2024-05-04T08:38:17.782749 #2812191] INFO -- : [ 36/885] 2853047=reflection_test I, [2024-05-04T08:38:17.783779 #2812191] INFO -- : [ 37/885] 2853047=test_line_editor I, [2024-05-04T08:38:17.837309 #2812191] INFO -- : [ 38/885] 2853047=test_marshalable I, [2024-05-04T08:38:17.844865 #2812191] INFO -- : [ 39/885] 2853047=json_common_interface_test I, [2024-05-04T08:38:17.865246 #2812191] INFO -- : [ 40/885] 2853047=test_string I, [2024-05-04T08:38:17.885871 #2812191] INFO -- : [ 41/885] 2853047=test_function_entry I, [2024-05-04T08:38:17.900122 #2812191] INFO -- : [ 42/885] 2853047=test_rdoc_any_method I, [2024-05-04T08:38:18.001967 #2812191] INFO -- : [ 43/885] 2853045=test_error_highlight I, [2024-05-04T08:38:18.245043 #2812191] INFO -- : [ 44/885] 2853047=test_complexrational I, [2024-05-04T08:38:18.248868 #2812191] INFO -- : [ 45/885] 2853047=test_raise I, [2024-05-04T08:38:18.249217 #2812191] INFO -- : [ 46/885] 2853047=version_test I, [2024-05-04T08:38:18.254215 #2812191] INFO -- : [ 47/885] 2853047=test_tree_builder I, [2024-05-04T08:38:18.257666 #2812191] INFO -- : [ 48/885] 2853047=test_protect I, [2024-05-04T08:38:18.262649 #2812191] INFO -- : [ 49/885] 2853047=test_gem_commands_update_command I, [2024-05-04T08:38:18.479652 #2812191] INFO -- : [ 50/885] 2853045=test_date I, [2024-05-04T08:38:18.485393 #2812191] INFO -- : [ 51/885] 2853045=test_big5 I, [2024-05-04T08:38:18.494096 #2812191] INFO -- : [ 52/885] 2853045=test_fnmatch I, [2024-05-04T08:38:18.542652 #2812191] INFO -- : [ 53/885] 2853045=test_pathname I, [2024-05-04T08:38:18.771526 #2812191] INFO -- : [ 54/885] 2853045=test_http_request I, [2024-05-04T08:38:18.823301 #2812191] INFO -- : [ 55/885] 2853045=test_tempfile I, [2024-05-04T08:38:19.000848 #2812191] INFO -- : [ 56/885] 2853045=test_coverage I, [2024-05-04T08:38:19.663213 #2812191] INFO -- : [ 57/885] 2853045=test_rdoc_markup_pre_process I, [2024-05-04T08:38:19.739152 #2812191] INFO -- : [ 58/885] 2853047=test_store I, [2024-05-04T08:38:19.768797 #2812191] INFO -- : [ 59/885] 2853045=test_rdoc_generator_pot_po_entry I, [2024-05-04T08:38:19.785015 #2812191] INFO -- : [ 60/885] 2853045=test_erb_m17n I, [2024-05-04T08:38:19.791571 #2812191] INFO -- : [ 61/885] 2853045=test_timeout I, [2024-05-04T08:38:19.804836 #2812191] INFO -- : [ 62/885] 2853045=test_date_conv I, [2024-05-04T08:38:19.829656 #2812191] INFO -- : [ 63/885] 2853045=test_webauthn_poller I, [2024-05-04T08:38:20.024716 #2812191] INFO -- : [ 64/885] 2853045=test_rdoc_markup_verbatim I, [2024-05-04T08:38:20.028821 #2812191] INFO -- : [ 65/885] 2853047=test_egrep_cpp I, [2024-05-04T08:38:20.038977 #2812191] INFO -- : [ 66/885] 2853045=test_gem_resolver_index_specification I, [2024-05-04T08:38:20.100594 #2812191] INFO -- : [ 67/885] 2853045=test_serialize_subclasses I, [2024-05-04T08:38:20.110551 #2812191] INFO -- : [ 68/885] 2853045=test_frozen I, [2024-05-04T08:38:20.122229 #2812191] INFO -- : [ 69/885] 2853045=test_macro I, [2024-05-04T08:38:20.124415 #2812191] INFO -- : [ 70/885] 2853046=test_string I, [2024-05-04T08:38:20.141643 #2812191] INFO -- : [ 71/885] 2853045=test_pipe I, [2024-05-04T08:38:20.152532 #2812191] INFO -- : [ 72/885] 2853047=test_gem_commands_server_command I, [2024-05-04T08:38:20.172046 #2812191] INFO -- : [ 73/885] 2853047=test_function I, [2024-05-04T08:38:20.250928 #2812191] INFO -- : [ 74/885] 2853045=test_gem_resolver_activation_request I, [2024-05-04T08:38:20.267364 #2812191] INFO -- : [ 75/885] 2853045=parse_comments_test I, [2024-05-04T08:38:20.374496 #2812191] INFO -- : [ 76/885] 2853045=test_tcp I, [2024-05-04T08:38:20.394572 #2812191] INFO -- : [ 77/885] 2853047=test_win32ole_method_event I, [2024-05-04T08:38:20.405007 #2812191] INFO -- : [ 78/885] 2853047=test_integer I, [2024-05-04T08:38:20.459047 #2812191] INFO -- : [ 79/885] 2853047=test_rdoc_markup_to_table_of_contents I, [2024-05-04T08:38:20.468747 #2812191] INFO -- : [ 80/885] 2853045=test_gem_name_tuple I, [2024-05-04T08:38:20.483200 #2812191] INFO -- : [ 81/885] 2853045=test_gem_requirement I, [2024-05-04T08:38:20.497931 #2812191] INFO -- : [ 82/885] 2853047=test_init I, [2024-05-04T08:38:20.658986 #2812191] INFO -- : [ 83/885] 2853045=test_gem_request_connection_pools I, [2024-05-04T08:38:20.856203 #2812191] INFO -- : [ 84/885] 2853047=test_rat I, [2024-05-04T08:38:20.869009 #2812191] INFO -- : [ 85/885] 2853047=test_bug-3571 I, [2024-05-04T08:38:20.873286 #2812191] INFO -- : [ 86/885] 2853047=test_yamlstore I, [2024-05-04T08:38:20.894745 #2812191] INFO -- : [ 87/885] 2853047=test_numeric I, [2024-05-04T08:38:20.949416 #2812191] INFO -- : [ 88/885] 2853047=test_flags I, [2024-05-04T08:38:21.523601 #2812191] INFO -- : [ 89/885] 2853047=test_time I, [2024-05-04T08:38:21.659861 #2812191] INFO -- : [ 90/885] 2853047=test_file I, [2024-05-04T08:38:21.661700 #2812191] INFO -- : [ 91/885] 2853047=test_nextafter I, [2024-05-04T08:38:21.709827 #2812191] INFO -- : [ 92/885] 2853045=test_gem_commands_owner_command I, [2024-05-04T08:38:21.776583 #2812191] INFO -- : [ 93/885] 2853047=test_capacity I, [2024-05-04T08:38:21.780815 #2812191] INFO -- : [ 94/885] 2853047=test_hmac I, [2024-05-04T08:38:21.825078 #2812191] INFO -- : [ 95/885] 2853047=test_encoding I, [2024-05-04T08:38:21.967296 #2812191] INFO -- : [ 96/885] 2853047=test_rdoc_generator_markup I, [2024-05-04T08:38:21.992662 #2812191] INFO -- : [ 97/885] 2853047=test_find I, [2024-05-04T08:38:22.072546 #2812191] INFO -- : [ 98/885] 2853047=test_constant I, [2024-05-04T08:38:22.584780 #2812191] INFO -- : [ 99/885] 2853045=test_pstore I, [2024-05-04T08:38:22.621189 #2812191] INFO -- : [100/885] 2853045=test_ubf_async_safe I, [2024-05-04T08:38:22.631323 #2812191] INFO -- : [101/885] 2853045=test_gem_version_option I, [2024-05-04T08:38:22.728142 #2812191] INFO -- : [102/885] 2853045=test_rdoc_include I, [2024-05-04T08:38:22.783053 #2812191] INFO -- : [103/885] 2853045=test_win32ole_record I, [2024-05-04T08:38:22.788881 #2812191] INFO -- : [104/885] 2853045=test_date_compat I, [2024-05-04T08:38:22.806631 #2812191] INFO -- : [105/885] 2853045=test_proc I, [2024-05-04T08:38:23.654244 #2812191] INFO -- : [106/885] 2853045=test_console_attr I, [2024-05-04T08:38:23.664669 #2812191] INFO -- : [107/885] 2853045=test_gem_ext_cargo_builder I, [2024-05-04T08:38:23.734803 #2812191] INFO -- : [108/885] 2853045=test_gem_commands_unpack_command I, [2024-05-04T08:38:24.084440 #2812191] INFO -- : [109/885] 2853045=test_rdoc_options I, [2024-05-04T08:38:24.110761 #2812191] INFO -- : [110/885] 2853047=test_zlib I, [2024-05-04T08:38:24.364663 #2812191] INFO -- : [111/885] 2853045=test_path_to_class I, [2024-05-04T08:38:24.369200 #2812191] INFO -- : [112/885] 2853045=test_enumerator I, [2024-05-04T08:38:24.389736 #2812191] INFO -- : [113/885] 2853045=test_reqarg I, [2024-05-04T08:38:24.784575 #2812191] INFO -- : [114/885] 2853045=test_gem_ext_ext_conf_builder I, [2024-05-04T08:38:25.909334 #2812191] INFO -- : [115/885] 2853045=test_spell_checker I, [2024-05-04T08:38:25.919736 #2812191] INFO -- : [116/885] 2853045=test_gem_version I, [2024-05-04T08:38:26.037301 #2812191] INFO -- : [117/885] 2853045=test_frozen_error I, [2024-05-04T08:38:26.051455 #2812191] INFO -- : [118/885] 2853045=test_gem_package_tar_reader_entry I, [2024-05-04T08:38:26.258136 #2812191] INFO -- : [119/885] 2853046=test_resource I, [2024-05-04T08:38:26.279377 #2812191] INFO -- : [120/885] 2853046=test_gem_uri I, [2024-05-04T08:38:26.291846 #2812191] INFO -- : [121/885] 2853045=test_yield_block I, [2024-05-04T08:38:26.295967 #2812191] INFO -- : [122/885] 2853045=test_bug-5832 I, [2024-05-04T08:38:26.328684 #2812191] INFO -- : [123/885] 2853045=test_c_struct_builder I, [2024-05-04T08:38:26.451072 #2812191] INFO -- : [124/885] 2853046=test_stringify_symbols I, [2024-05-04T08:38:26.457129 #2812191] INFO -- : [125/885] 2853046=test_require I, [2024-05-04T08:38:26.460248 #2812191] INFO -- : [126/885] 2853046=test_objspace I, [2024-05-04T08:38:26.469319 #2812191] INFO -- : [127/885] 2853045=test_rdoc_text I, [2024-05-04T08:38:26.521011 #2812191] INFO -- : [128/885] 2853045=library_symbols_test I, [2024-05-04T08:38:26.528027 #2812191] INFO -- : [129/885] 2853045=test_rdoc_markup_parser I, [2024-05-04T08:38:26.595245 #2812191] INFO -- : [130/885] 2853045=test_iseq_load I, [2024-05-04T08:38:27.701782 #2812191] INFO -- : [131/885] 2853045=test_rdoc_markup_indented_paragraph I, [2024-05-04T08:38:27.796458 #2812191] INFO -- : [132/885] 2853045=test_have_library I, [2024-05-04T08:38:28.713764 #2812191] INFO -- : [133/885] 2853045=test_stream I, [2024-05-04T08:38:28.730083 #2812191] INFO -- : [134/885] 2853045=test_ns_spki I, [2024-05-04T08:38:28.733799 #2812191] INFO -- : [135/885] 2853045=test_win32ole_variant_outarg I, [2024-05-04T08:38:28.743436 #2812191] INFO -- : [136/885] 2853045=test_rdoc_encoding I, [2024-05-04T08:38:28.828895 #2812191] INFO -- : [137/885] 2853045=test_postponed_job I, [2024-05-04T08:38:28.992286 #2812191] INFO -- : [138/885] 2853047=test_key_actor_vi I, [2024-05-04T08:38:29.096002 #2812191] INFO -- : [139/885] 2853045=test_rdoc_markdown I, [2024-05-04T08:38:29.123213 #2812191] INFO -- : [140/885] 2853047=test_gem_request_set_lockfile I, [2024-05-04T08:38:29.363206 #2812191] INFO -- : [141/885] 2853045=test_httpresponses I, [2024-05-04T08:38:29.372915 #2812191] INFO -- : [142/885] 2853045=test_deprecate I, [2024-05-04T08:38:29.425292 #2812191] INFO -- : [143/885] 2853045=test_rdoc_constant I, [2024-05-04T08:38:29.519437 #2812191] INFO -- : [144/885] 2853045=test_generic I, [2024-05-04T08:38:29.547063 #2812191] INFO -- : [145/885] 2853045=test_common I, [2024-05-04T08:38:29.634260 #2812191] INFO -- : [146/885] 2853047=test_rdoc_markup_to_html_snippet I, [2024-05-04T08:38:29.716839 #2812191] INFO -- : [147/885] 2853047=redundant_return_test I, [2024-05-04T08:38:29.717919 #2812191] INFO -- : [148/885] 2853047=test_random_formatter I, [2024-05-04T08:38:29.724591 #2812191] INFO -- : [149/885] 2853045=test_string_processing I, [2024-05-04T08:38:29.730845 #2812191] INFO -- : [150/885] 2853045=test_rand I, [2024-05-04T08:38:29.760176 #2812191] INFO -- : [151/885] 2853047=test_rdoc_markup_attributes I, [2024-05-04T08:38:29.774070 #2812191] INFO -- : [152/885] 2853047=test_rdoc_code_object I, [2024-05-04T08:38:30.036226 #2812191] INFO -- : [153/885] 2853045=test_process I, [2024-05-04T08:38:30.074034 #2812191] INFO -- : Leaked file descriptor: TestProcess#test_uid_from_name: 9 # I, [2024-05-04T08:38:30.074235 #2812191] INFO -- : Leaked file descriptor: TestProcess#test_uid_from_name: 10 # I, [2024-05-04T08:38:30.089122 #2812191] INFO -- : [154/885] 2853047=test_bmethod I, [2024-05-04T08:38:30.095174 #2812191] INFO -- : [155/885] 2853047=test_euc_kr I, [2024-05-04T08:38:30.097175 #2812191] INFO -- : [156/885] 2853047=test_provider I, [2024-05-04T08:38:30.106156 #2812191] INFO -- : [157/885] 2853047=test_gem_source_specific_fileCOMMAND PID USER FD TYPE DEVICE SIZE/OFF NODE NAME I, [2024-05-04T08:38:30.106220 #2812191] INFO -- : ruby 2853045 opc 9r REG 252,0 9253600 13705411 /var/lib/sss/mc/passwd I, [2024-05-04T08:38:30.106230 #2812191] INFO -- : ruby 2853045 opc 10u unix 0x0000000000000000 0t0 2834061964 type=STREAM I, [2024-05-04T08:38:30.113093 #2812191] INFO -- : I, [2024-05-04T08:38:30.201079 #2812191] INFO -- : [158/885] 2853047=json_fixtures_test I, [2024-05-04T08:38:30.212928 #2812191] INFO -- : [159/885] 2853047=test_gem_doctor I, [2024-05-04T08:38:30.264288 #2812191] INFO -- : [160/885] 2853047=test_len I, [2024-05-04T08:38:30.271734 #2812191] INFO -- : [161/885] 2853047=test_io_wait I, [2024-05-04T08:38:30.613692 #2812191] INFO -- : [162/885] 2853047=test_pack I, [2024-05-04T08:38:30.842250 #2812191] INFO -- : [163/885] 2853047=test_rdoc_parser_c I, [2024-05-04T08:38:31.108473 #2812191] INFO -- : [164/885] 2853047=test_kwargs I, [2024-05-04T08:38:31.195620 #2812191] INFO -- : [165/885] 2853047=parse_test I, [2024-05-04T08:38:33.959290 #2812191] INFO -- : [166/885] 2853047=test_gem_commands_fetch_command I, [2024-05-04T08:38:34.156091 #2812191] INFO -- : [167/885] 2853047=test_typeddata I, [2024-05-04T08:38:34.373235 #2812191] INFO -- : [168/885] 2853047=test_tsort I, [2024-05-04T08:38:34.383019 #2812191] INFO -- : [169/885] 2853047=test_securerandom I, [2024-05-04T08:38:34.396817 #2812191] INFO -- : [170/885] 2853047=test_gem_dependency_list I, [2024-05-04T08:38:34.502548 #2812191] INFO -- : [171/885] 2853047=test_gem_commands_outdated_command I, [2024-05-04T08:38:34.546607 #2812191] INFO -- : [172/885] 2853047=parameters_signature_test I, [2024-05-04T08:38:34.564439 #2812191] INFO -- : [173/885] 2853047=test_rdoc_parser_changelog I, [2024-05-04T08:38:34.662613 #2812191] INFO -- : [174/885] 2853047=test_literal I, [2024-05-04T08:38:35.252719 #2812191] INFO -- : [175/885] 2853047=test_gem_unsatisfiable_dependency_error I, [2024-05-04T08:38:35.269553 #2812191] INFO -- : [176/885] 2853047=test_thread I, [2024-05-04T08:38:35.501873 #2812191] INFO -- : [177/885] 2853047=test_gem_util I, [2024-05-04T08:38:35.689853 #2812191] INFO -- : [178/885] 2853047=test_gem_security_signer I, [2024-05-04T08:38:35.793815 #2812191] INFO -- : [179/885] 2853047=test_complex2 I, [2024-05-04T08:38:35.808705 #2812191] INFO -- : [180/885] 2853047=test_config I, [2024-05-04T08:38:35.859070 #2812191] INFO -- : [181/885] 2853047=test_input_method I, [2024-05-04T08:38:35.935239 #2812191] INFO -- : [182/885] 2853047=test_io I, [2024-05-04T08:38:36.132587 #2812191] INFO -- : [183/885] 2853047=test_rdoc_i18n_text I, [2024-05-04T08:38:36.205093 #2812191] INFO -- : [184/885] 2853047=test_ractor I, [2024-05-04T08:38:36.209943 #2812191] INFO -- : [185/885] 2853047=test_null I, [2024-05-04T08:38:36.220251 #2812191] INFO -- : [186/885] 2853047=test_memory_view I, [2024-05-04T08:38:36.242407 #2812191] INFO -- : [187/885] 2853047=test_data I, [2024-05-04T08:38:36.259371 #2812191] INFO -- : [188/885] 2853047=test_pkey_dh I, [2024-05-04T08:38:37.620188 #2812191] INFO -- : [189/885] 2853047=test_multi_irb_commands I, [2024-05-04T08:38:37.621275 #2812191] INFO -- : [190/885] 2853047=test_m17n_comb I, [2024-05-04T08:38:38.616727 #2812191] INFO -- : .Leaked file descriptor: TestProcess#test_gid_from_name: 11 # I, [2024-05-04T08:38:38.640796 #2812191] INFO -- : COMMAND PID USER FD TYPE DEVICE SIZE/OFF NODE NAME I, [2024-05-04T08:38:38.640870 #2812191] INFO -- : ruby 2853045 opc 11r REG 252,0 6940392 13705429 /var/lib/sss/mc/group I, [2024-05-04T08:38:39.410037 #2812191] INFO -- : [191/885] 2853046=test_win32ole_typelib I, [2024-05-04T08:38:39.414686 #2812191] INFO -- : [192/885] 2853046=test_external_new I, [2024-05-04T08:38:39.423928 #2812191] INFO -- : [193/885] 2853046=test_pkey I, [2024-05-04T08:38:39.435197 #2812191] INFO -- : [194/885] 2853046=test_bigzero I, [2024-05-04T08:38:39.459163 #2812191] INFO -- : [195/885] 2853046=test_gem_commands_query_command I, [2024-05-04T08:38:40.061509 #2812191] INFO -- : [196/885] 2853047=test_gem_platform I, [2024-05-04T08:38:40.142427 #2812191] INFO -- : [197/885] 2853046=ruby_parser_test I, [2024-05-04T08:38:40.181353 #2812191] INFO -- : [198/885] 2853047=test_gem_commands_stale_command I, [2024-05-04T08:38:40.187822 #2812191] INFO -- : [199/885] 2853047=test_ws I, [2024-05-04T08:38:40.210708 #2812191] INFO -- : [200/885] 2853047=json_parser_test I, [2024-05-04T08:38:40.234189 #2812191] INFO -- : [201/885] 2853047=test_date_strftime I, [2024-05-04T08:38:40.242916 #2812191] INFO -- : [202/885] 2853046=test_rdoc_markup_to_tt_only I, [2024-05-04T08:38:40.293887 #2812191] INFO -- : [203/885] 2853046=test_gem_commands_cert_command I, [2024-05-04T08:38:40.718374 #2812191] INFO -- : [204/885] 2853047=test_numeric I, [2024-05-04T08:38:40.728645 #2812191] INFO -- : [205/885] 2853047=test_fstring I, [2024-05-04T08:38:40.872457 #2812191] INFO -- : [206/885] 2853047=test_singleton I, [2024-05-04T08:38:40.875947 #2812191] INFO -- : [207/885] 2853047=test_word I, [2024-05-04T08:38:40.956675 #2812191] INFO -- : [208/885] 2853047=test_gem_ext_rake_builder I, [2024-05-04T08:38:41.557913 #2812191] INFO -- : [209/885] 2853047=test_rdoc_require I, [2024-05-04T08:38:41.564102 #2812191] INFO -- : [210/885] 2853047=test_rdoc_markup_raw I, [2024-05-04T08:38:41.571134 #2812191] INFO -- : [211/885] 2853047=test_key_name_check I, [2024-05-04T08:38:41.581246 #2812191] INFO -- : [212/885] 2853047=test_rdoc_markup_to_bs I, [2024-05-04T08:38:41.663075 #2812191] INFO -- : [213/885] 2853047=test_timeout I, [2024-05-04T08:38:41.840315 #2812191] INFO -- : [214/885] 2853046=test_rdoc_alias I, [2024-05-04T08:38:41.919875 #2812191] INFO -- : [215/885] 2853046=test_weakref I, [2024-05-04T08:38:42.053940 #2812191] INFO -- : [216/885] 2853046=test_instrumentation_api I, [2024-05-04T08:38:42.450489 #2812191] INFO -- : [217/885] 2853047=test_deprecated I, [2024-05-04T08:38:42.457049 #2812191] INFO -- : [218/885] 2853047=test_io_buffer I, [2024-05-04T08:38:42.572942 #2812191] INFO -- : [219/885] 2853047=test_rdoc_context_section I, [2024-05-04T08:38:42.589056 #2812191] INFO -- : [220/885] 2853047=test_optparse I, [2024-05-04T08:38:42.657525 #2812191] INFO -- : [221/885] 2853047=test_exception I, [2024-05-04T08:38:44.974513 #2812191] INFO -- : [222/885] 2853046=test_bash_completion I, [2024-05-04T08:38:44.990360 #2812191] INFO -- : [223/885] 2853046=test_rdoc_markup_to_html_crossref I, [2024-05-04T08:38:45.255873 #2812191] INFO -- : [224/885] 2853046=test_div I, [2024-05-04T08:38:45.290727 #2812191] INFO -- : [225/885] 2853046=test_files_test_2 I, [2024-05-04T08:38:45.483921 #2812191] INFO -- : [226/885] 2853047=test_class_name_check I, [2024-05-04T08:38:45.561963 #2812191] INFO -- : [227/885] 2853047=test_syntax I, [2024-05-04T08:38:48.092589 #2812191] INFO -- : [228/885] 2853046=test_scalar I, [2024-05-04T08:38:48.096036 #2812191] INFO -- : [229/885] 2853046=test_zsh_completion I, [2024-05-04T08:38:48.107726 #2812191] INFO -- : [230/885] 2853046=test_basicsocket I, [2024-05-04T08:38:48.128722 #2812191] INFO -- : [231/885] 2853046=test_pkcs7 I, [2024-05-04T08:38:48.280112 #2812191] INFO -- : [232/885] 2853046=test_gem_commands_environment_command I, [2024-05-04T08:38:48.366867 #2812191] INFO -- : [233/885] 2853046=test_pack I, [2024-05-04T08:38:48.556909 #2812191] INFO -- : [234/885] 2853046=test_rubyoptions I, [2024-05-04T08:38:48.596843 #2812191] INFO -- : [235/885] 2853045=test_rdoc_stats I, [2024-05-04T08:38:48.660723 #2812191] INFO -- : [236/885] 2853045=test_files_sample I, [2024-05-04T08:38:48.661083 #2812191] INFO -- : [237/885] 2853045=test_data_error I, [2024-05-04T08:38:48.739020 #2812191] INFO -- : [238/885] 2853045=test_force_exit I, [2024-05-04T08:38:48.751023 #2812191] INFO -- : [239/885] 2853045=test_optimization I, [2024-05-04T08:38:52.680693 #2812191] INFO -- : [240/885] 2853047=test_rdoc_store I, [2024-05-04T08:38:53.307884 #2812191] INFO -- : [241/885] 2853047=test_shift_jis I, [2024-05-04T08:38:53.317806 #2812191] INFO -- : [242/885] 2853047=regexp_test I, [2024-05-04T08:38:53.335276 #2812191] INFO -- : [243/885] 2853047=test_show_source I, [2024-05-04T08:38:53.345261 #2812191] INFO -- : [244/885] 2853047=test_remote_fetch_error I, [2024-05-04T08:38:53.369438 #2812191] INFO -- : [245/885] 2853047=test_yield I, [2024-05-04T08:38:54.837717 #2812191] INFO -- : Leaked file descriptor: TestRubyOptions#test_script_from_stdin: 11 # I, [2024-05-04T08:38:54.867650 #2812191] INFO -- : COMMAND PID USER FD TYPE DEVICE SIZE/OFF NODE NAME I, [2024-05-04T08:38:54.867727 #2812191] INFO -- : ruby 2853046 opc 11u unix 0x0000000000000000 0t0 2834071764 type=STREAM I, [2024-05-04T08:38:54.950997 #2812191] INFO -- : [246/885] 2853046=test_queue I, [2024-05-04T08:38:54.961521 #2812191] INFO -- : [247/885] 2853046=test_boolean I, [2024-05-04T08:38:54.973245 #2812191] INFO -- : [248/885] 2853046=test_gem_resolver_lock_specification I, [2024-05-04T08:38:55.015539 #2812191] INFO -- : [249/885] 2853046=test_dryrun I, [2024-05-04T08:38:55.043796 #2812191] INFO -- : [250/885] 2853046=test_rdoc_i18n_locale I, [2024-05-04T08:38:55.100986 #2812191] INFO -- : [251/885] 2853046=test_gc_compact I, [2024-05-04T08:38:55.476868 #2812191] INFO -- : [252/885] 2853045=test_prettyprint I, [2024-05-04T08:38:55.498845 #2812191] INFO -- : [253/885] 2853045=test_gem_uri_formatter I, [2024-05-04T08:38:55.534550 #2812191] INFO -- : [254/885] 2853045=test_cgi_util I, [2024-05-04T08:38:55.750342 #2812191] INFO -- : [255/885] 2853045=test_ole_methods I, [2024-05-04T08:38:55.760197 #2812191] INFO -- : [256/885] 2853045=test_clone I, [2024-05-04T08:38:55.919570 #2812191] INFO -- : [257/885] 2853045=test_enc_raise I, [2024-05-04T08:38:55.930236 #2812191] INFO -- : [258/885] 2853045=test_gem_spec_fetcher I, [2024-05-04T08:38:56.043620 #2812191] INFO -- : [259/885] 2853047=test_yamldbm I, [2024-05-04T08:38:56.046198 #2812191] INFO -- : [260/885] 2853047=test_switch_hitter I, [2024-05-04T08:38:56.069241 #2812191] INFO -- : [261/885] 2853047=test_default_gems I, [2024-05-04T08:38:56.112185 #2812191] INFO -- : [262/885] 2853047=test_unicode_escape I, [2024-05-04T08:38:56.132891 #2812191] INFO -- : [263/885] 2853045=test_gbk I, [2024-05-04T08:38:56.139178 #2812191] INFO -- : [264/885] 2853045=test_backtrace I, [2024-05-04T08:38:56.154628 #2812191] INFO -- : [265/885] 2853045=test_gem_commands_dependency_command I, [2024-05-04T08:38:56.198383 #2812191] INFO -- : [266/885] 2853047=test_set I, [2024-05-04T08:38:56.240983 #2812191] INFO -- : [267/885] 2853047=test_enumerable I, [2024-05-04T08:38:56.250054 #2812191] INFO -- : [268/885] 2853047=test_rdoc_method_attr I, [2024-05-04T08:38:56.256620 #2812191] INFO -- : [269/885] 2853045=test_tree_spell_checker I, [2024-05-04T08:38:56.330466 #2812191] INFO -- : [270/885] 2853045=static_literals_test I, [2024-05-04T08:38:56.331786 #2812191] INFO -- : [271/885] 2853045=test_hash_create I, [2024-05-04T08:38:56.339699 #2812191] INFO -- : [272/885] 2853045=test_grapheme_breaks I, [2024-05-04T08:38:56.349527 #2812191] INFO -- : [273/885] 2853047=test_gem_ext_cargo_builder_unit I, [2024-05-04T08:38:56.369923 #2812191] INFO -- : [274/885] 2853047=test_rational I, [2024-05-04T08:38:56.381252 #2812191] INFO -- : [275/885] 2853045=test_case_mapping I, [2024-05-04T08:38:56.391492 #2812191] INFO -- : [276/885] 2853045=test_rdoc_rubygems_hook I, [2024-05-04T08:38:56.403648 #2812191] INFO -- : [277/885] 2853047=test_gem_resolver_api_specification I, [2024-05-04T08:38:56.471425 #2812191] INFO -- : [278/885] 2853047=test_ractor I, [2024-05-04T08:38:56.478974 #2812191] INFO -- : [279/885] 2853047=test_webauthn_listener I, [2024-05-04T08:38:56.495853 #2812191] INFO -- : [280/885] 2853045=test_key_event_record I, [2024-05-04T08:38:56.499609 #2812191] INFO -- : [281/885] 2853045=test_open3 I, [2024-05-04T08:38:56.542903 #2812191] INFO -- : Leaked file descriptor: WebauthnListenerTest#test_wait_for_otp_code_get_follows_options: 12 : # I, [2024-05-04T08:38:56.574875 #2812191] INFO -- : COMMAND PID USER FD TYPE DEVICE SIZE/OFF NODE NAME I, [2024-05-04T08:38:56.574950 #2812191] INFO -- : ruby 2853047 opc 12u IPv4 2834071999 0t0 TCP localhost:37117->localhost:46642 (CLOSE_WAIT) I, [2024-05-04T08:38:56.651956 #2812191] INFO -- : [282/885] 2853047=test_mdns I, [2024-05-04T08:38:56.653488 #2812191] INFO -- : [283/885] 2853047=test_date_parse I, [2024-05-04T08:38:56.789506 #2812191] INFO -- : [284/885] 2853047=test_thread I, [2024-05-04T08:38:56.795707 #2812191] INFO -- : [285/885] 2853047=test_arity I, [2024-05-04T08:38:56.811109 #2812191] INFO -- : [286/885] 2853047=test_buffering I, [2024-05-04T08:38:56.820636 #2812191] INFO -- : [287/885] 2853047=test_svcb_https I, [2024-05-04T08:38:56.832417 #2812191] INFO -- : [288/885] 2853047=test_pkey_ec I, [2024-05-04T08:38:56.844302 #2812191] INFO -- : [289/885] 2853047=!Nothing_to_test I, [2024-05-04T08:38:56.861983 #2812191] INFO -- : [290/885] 2853047=test_forwardable I, [2024-05-04T08:38:56.862128 #2812191] INFO -- : Closed file descriptor: TestForwardable#test_def_instance_delegators: 12 I, [2024-05-04T08:38:56.885354 #2812191] INFO -- : [291/885] 2853047=test_process I, [2024-05-04T08:38:56.911722 #2812191] INFO -- : [292/885] 2853047=test_fd_setsize I, [2024-05-04T08:38:56.917425 #2812191] INFO -- : [293/885] 2853047=test_dir_m17n I, [2024-05-04T08:38:57.750392 #2812191] INFO -- : [294/885] 2853046=test_memory_view I, [2024-05-04T08:38:57.967467 #2812191] INFO -- : [295/885] 2853046=test_array_create I, [2024-05-04T08:38:57.971285 #2812191] INFO -- : [296/885] 2853046=test_threadgroup I, [2024-05-04T08:38:58.388217 #2812191] INFO -- : [297/885] 2853047=test_complex I, [2024-05-04T08:38:58.468408 #2812191] INFO -- : [298/885] 2853047=test_did_you_mean I, [2024-05-04T08:38:58.616601 #2812191] INFO -- : [299/885] 2853047=test_shapes I, [2024-05-04T08:38:58.621271 #2812191] INFO -- : [300/885] 2853047=test_cesu8 I, [2024-05-04T08:38:58.635963 #2812191] INFO -- : [301/885] 2853047=test_rdoc_extend I, [2024-05-04T08:38:58.646755 #2812191] INFO -- : [302/885] 2853047=test_err_in_callback I, [2024-05-04T08:38:58.656750 #2812191] INFO -- : [303/885] 2853047=test_method_name_check I, [2024-05-04T08:38:58.684825 #2812191] INFO -- : [304/885] 2853047=test_storage I, [2024-05-04T08:38:58.727314 #2812191] INFO -- : [305/885] 2853047=test_merge_keys I, [2024-05-04T08:38:58.739779 #2812191] INFO -- : [306/885] 2853047=test_iterator I, [2024-05-04T08:38:58.814786 #2812191] INFO -- : [307/885] 2853047=test_string I, [2024-05-04T08:38:58.839591 #2812191] INFO -- : [308/885] 2853047=test_gem_commands_install_command I, [2024-05-04T08:38:58.990398 #2812191] INFO -- : [309/885] 2853046=test_rendering I, [2024-05-04T08:38:59.077882 #2812191] INFO -- : [310/885] 2853045=test_kernel I, [2024-05-04T08:38:59.099117 #2812191] INFO -- : [311/885] 2853046=test_dot_dot I, [2024-05-04T08:38:59.123224 #2812191] INFO -- : [312/885] 2853046=test_gem_rdoc I, [2024-05-04T08:38:59.283380 #2812191] INFO -- : [313/885] 2853046=pattern_test I, [2024-05-04T08:38:59.305696 #2812191] INFO -- : [314/885] 2853046=test_gem_resolver_git_specification I, [2024-05-04T08:38:59.637194 #2812191] INFO -- : [315/885] 2853046=test_utf32 I, [2024-05-04T08:38:59.647491 #2812191] INFO -- : [316/885] 2853046=test_basicinstructions I, [2024-05-04T08:38:59.708715 #2812191] INFO -- : [317/885] 2853045=test_erb I, [2024-05-04T08:38:59.724031 #2812191] INFO -- : [318/885] 2853046=test_date_ractor I, [2024-05-04T08:38:59.784724 #2812191] INFO -- : [319/885] 2853045=test_key_actor_emacs I, [2024-05-04T08:38:59.950596 #2812191] INFO -- : [320/885] 2853045=test_gem_security I, [2024-05-04T08:38:59.956660 #2812191] INFO -- : [321/885] 2853046=test_hash I, [2024-05-04T08:38:59.974348 #2812191] INFO -- : [322/885] 2853046=test_variable I, [2024-05-04T08:39:00.083038 #2812191] INFO -- : [323/885] 2853046=test_gem_commands_pristine_command I, [2024-05-04T08:39:00.759893 #2812191] INFO -- : [324/885] 2853047=test_optarg I, [2024-05-04T08:39:00.822858 #2812191] INFO -- : [325/885] 2853047=test_rdoc_tom_doc I, [2024-05-04T08:39:00.855370 #2812191] INFO -- : [326/885] 2853047=test_pp I, [2024-05-04T08:39:00.893184 #2812191] INFO -- : .Leaked file descriptor: PPTestModule::PPFileStatTest#test_nothing_raised: 10 # I, [2024-05-04T08:39:00.917676 #2812191] INFO -- : COMMAND PID USER FD TYPE DEVICE SIZE/OFF NODE NAME I, [2024-05-04T08:39:00.917743 #2812191] INFO -- : ruby 2853047 opc 10r REG 252,0 9253600 13705411 /var/lib/sss/mc/passwd I, [2024-05-04T08:39:00.982238 #2812191] INFO -- : [327/885] 2853047=test_gem_impossible_dependencies_error I, [2024-05-04T08:39:00.989018 #2812191] INFO -- : [328/885] 2853047=test_noarg I, [2024-05-04T08:39:01.140057 #2812191] INFO -- : [329/885] 2853047=test_raise_exception I, [2024-05-04T08:39:01.527749 #2812191] INFO -- : [330/885] 2853046=test_arith_seq_beg_len_step I, [2024-05-04T08:39:01.537063 #2812191] INFO -- : [331/885] 2853046=test_exception I, [2024-05-04T08:39:01.540952 #2812191] INFO -- : [332/885] 2853046=memsize_test I, [2024-05-04T08:39:01.548710 #2812191] INFO -- : [333/885] 2853046=test_gem_resolver_requirement_list I, [2024-05-04T08:39:01.561817 #2812191] INFO -- : [334/885] 2853046=test_gem_resolver_lock_set I, [2024-05-04T08:39:01.582670 #2812191] INFO -- : [335/885] 2853046=test_random I, [2024-05-04T08:39:01.621646 #2812191] INFO -- : [336/885] 2853046=test_rdoc_generator_darkfish I, [2024-05-04T08:39:01.663574 #2812191] INFO -- : [337/885] 2853047=test_undef I, [2024-05-04T08:39:01.676652 #2812191] INFO -- : [338/885] 2853047=test_gem_command I, [2024-05-04T08:39:01.779496 #2812191] INFO -- : [339/885] 2853047=test_asn1 I, [2024-05-04T08:39:01.807942 #2812191] INFO -- : [340/885] 2853047=test_emoji_breaks I, [2024-05-04T08:39:01.810099 #2812191] INFO -- : [341/885] 2853047=test_normalize I, [2024-05-04T08:39:01.820662 #2812191] INFO -- : [342/885] 2853047=test_verbose I, [2024-05-04T08:39:01.854730 #2812191] INFO -- : [343/885] 2853047=test_gem_commands_open_command I, [2024-05-04T08:39:01.930534 #2812191] INFO -- : [344/885] 2853047=test_gem_update_suggestion I, [2024-05-04T08:39:01.942880 #2812191] INFO -- : [345/885] 2853047=test_assignment I, [2024-05-04T08:39:01.944871 #2812191] INFO -- : [346/885] 2853046=test_gem_specification I, [2024-05-04T08:39:03.330246 #2812191] INFO -- : [347/885] 2853047=test_pkey_rsa I, [2024-05-04T08:39:03.609653 #2812191] INFO -- : [348/885] 2853047=test_flush I, [2024-05-04T08:39:03.616559 #2812191] INFO -- : [349/885] 2853047=test_system I, [2024-05-04T08:39:04.401328 #2812191] INFO -- : [350/885] 2853046=test_numhash I, [2024-05-04T08:39:04.402772 #2812191] INFO -- : [351/885] 2853046=test_method_cache I, [2024-05-04T08:39:04.423896 #2812191] INFO -- : [352/885] 2853046=test_rdoc_class_module I, [2024-05-04T08:39:04.491196 #2812191] INFO -- : [353/885] 2853047=test_rdoc_cross_reference I, [2024-05-04T08:39:04.904474 #2812191] INFO -- : [354/885] 2853047=test_parse I, [2024-05-04T08:39:04.909686 #2812191] INFO -- : [355/885] 2853046=test_win32ole_variable I, [2024-05-04T08:39:04.912875 #2812191] INFO -- : [356/885] 2853046=test_condition I, [2024-05-04T08:39:04.923723 #2812191] INFO -- : [357/885] 2853046=test_gem_resolver_vendor_set I, [2024-05-04T08:39:04.949663 #2812191] INFO -- : [358/885] 2853046=test_jaro_winkler I, [2024-05-04T08:39:04.956058 #2812191] INFO -- : [359/885] 2853046=test_cp949 I, [2024-05-04T08:39:04.964358 #2812191] INFO -- : [360/885] 2853046=test_fileutils I, [2024-05-04T08:39:05.343134 #2812191] INFO -- : .Leaked file descriptor: TestFileUtils#test_chown_error: 8 # I, [2024-05-04T08:39:05.369219 #2812191] INFO -- : COMMAND PID USER FD TYPE DEVICE SIZE/OFF NODE NAME I, [2024-05-04T08:39:05.369298 #2812191] INFO -- : ruby 2853046 opc 8r REG 252,0 9253600 13705411 /var/lib/sss/mc/passwd I, [2024-05-04T08:39:05.392061 #2812191] INFO -- : [361/885] 2853047=test_mixed_unicode_escapes I, [2024-05-04T08:39:05.403512 #2812191] INFO -- : [362/885] 2853047=test_sleep I, [2024-05-04T08:39:05.576264 #2812191] INFO -- : [363/885] 2853046=test_gem_dependency_resolution_error I, [2024-05-04T08:39:05.756201 #2812191] INFO -- : [364/885] 2853046=test_stack I, [2024-05-04T08:39:06.357646 #2812191] INFO -- : [365/885] 2853046=test_windows_1252 I, [2024-05-04T08:39:06.366166 #2812191] INFO -- : [366/885] 2853046=test_emoji I, [2024-05-04T08:39:06.455902 #2812191] INFO -- : [367/885] 2853046=test_sorted_set I, [2024-05-04T08:39:06.595475 #2812191] INFO -- : [368/885] 2853046=test_gem_request_set_lockfile_parser I, [2024-05-04T08:39:06.725718 #2812191] INFO -- : [369/885] 2853046=test_date_attr I, [2024-05-04T08:39:06.781050 #2812191] INFO -- : [370/885] 2853046=test_sizeof I, [2024-05-04T08:39:07.465859 #2812191] INFO -- : [371/885] 2853047=test_face I, [2024-05-04T08:39:07.490934 #2812191] INFO -- : [372/885] 2853047=warnings_test I, [2024-05-04T08:39:07.576058 #2812191] INFO -- : [373/885] 2853047=test_stringchar I, [2024-05-04T08:39:07.590801 #2812191] INFO -- : [374/885] 2853047=test_econv I, [2024-05-04T08:39:07.672237 #2812191] INFO -- : [375/885] 2853045=test_gem_install_update_options I, [2024-05-04T08:39:07.841233 #2812191] INFO -- : [376/885] 2853045=test_framework I, [2024-05-04T08:39:07.845775 #2812191] INFO -- : [377/885] 2853045=test_ansi_with_terminfo I, [2024-05-04T08:39:07.864906 #2812191] INFO -- : [378/885] 2853045=test_inadvertent_creation I, [2024-05-04T08:39:07.973253 #2812191] INFO -- : [379/885] 2853045=test_coderange I, [2024-05-04T08:39:08.052356 #2812191] INFO -- : [380/885] 2853045=test_weakmap I, [2024-05-04T08:39:08.512886 #2812191] INFO -- : [381/885] 2853047=test_cgi_tag_helper I, [2024-05-04T08:39:08.566340 #2812191] INFO -- : [382/885] 2853047=test_pack I, [2024-05-04T08:39:08.615797 #2812191] INFO -- : [383/885] 2853047=test_pinned I, [2024-05-04T08:39:08.670059 #2812191] INFO -- : [384/885] 2853047=test_rdoc_generator_json_index I, [2024-05-04T08:39:08.695947 #2812191] INFO -- : [385/885] 2853047=test_nil2vtempty I, [2024-05-04T08:39:08.704666 #2812191] INFO -- : [386/885] 2853047=test_date_time I, [2024-05-04T08:39:08.766496 #2812191] INFO -- : [387/885] 2853047=test_open-uri I, [2024-05-04T08:39:09.112671 #2812191] INFO -- : [388/885] 2853046=test_case I, [2024-05-04T08:39:09.126719 #2812191] INFO -- : [389/885] 2853047=test_enumerator I, [2024-05-04T08:39:09.127140 #2812191] INFO -- : [390/885] 2853046=test_enc_associate I, [2024-05-04T08:39:09.621237 #2812191] INFO -- : [391/885] 2853046=test_rdoc_context I, [2024-05-04T08:39:10.379892 #2812191] INFO -- : [392/885] 2853046=test_gem_command_manager I, [2024-05-04T08:39:10.569833 #2812191] INFO -- : [393/885] 2853046=test_array I, [2024-05-04T08:39:10.581742 #2812191] INFO -- : [394/885] 2853046=test_math I, [2024-05-04T08:39:10.590839 #2812191] INFO -- : [395/885] 2853046=test_qsort I, [2024-05-04T08:39:10.596221 #2812191] INFO -- : [396/885] 2853046=comments_test I, [2024-05-04T08:39:10.598182 #2812191] INFO -- : [397/885] 2853046=test_gc I, [2024-05-04T08:39:10.606808 #2812191] INFO -- : [398/885] 2853046=test_libs I, [2024-05-04T08:39:10.618545 #2812191] INFO -- : [399/885] 2853046=test_iso_8859 I, [2024-05-04T08:39:10.669546 #2812191] INFO -- : [400/885] 2853046=ripper_test I, [2024-05-04T08:39:11.165826 #2812191] INFO -- : [401/885] 2853046=test_safe_load I, [2024-05-04T08:39:11.178790 #2812191] INFO -- : [402/885] 2853046=test_sprintf I, [2024-05-04T08:39:11.389020 #2812191] INFO -- : [403/885] 2853046=test_name_error I, [2024-05-04T08:39:11.476065 #2812191] INFO -- : [404/885] 2853046=test_gem_source_list I, [2024-05-04T08:39:11.568325 #2812191] INFO -- : [405/885] 2853046=json_addition_test I, [2024-05-04T08:39:11.587531 #2812191] INFO -- : [406/885] 2853046=test_gem_commands_sources_command I, [2024-05-04T08:39:11.863357 #2812191] INFO -- : [407/885] 2853046=test_yaml_special_cases I, [2024-05-04T08:39:11.871001 #2812191] INFO -- : [408/885] 2853046=test_recorder I, [2024-05-04T08:39:11.884281 #2812191] INFO -- : [409/885] 2853046=test_class I, [2024-05-04T08:39:14.369320 #2812191] INFO -- : [410/885] 2853045=test_exit I, [2024-05-04T08:39:14.444635 #2812191] INFO -- : [411/885] 2853045=test_const I, [2024-05-04T08:39:14.449853 #2812191] INFO -- : [412/885] 2853045=index_write_test I, [2024-05-04T08:39:14.458957 #2812191] INFO -- : [413/885] 2853045=test_rdoc_parser_rd I, [2024-05-04T08:39:14.466872 #2812191] INFO -- : [414/885] 2853045=test_pty I, [2024-05-04T08:39:14.982935 #2812191] INFO -- : [415/885] 2853045=test_gem_dependency_installer I, [2024-05-04T08:39:15.517444 #2812191] INFO -- : [416/885] 2853046=test_http I, [2024-05-04T08:39:15.540764 #2812191] INFO -- : [417/885] 2853046=test_hash I, [2024-05-04T08:39:17.753398 #2812191] INFO -- : [418/885] 2853045=parser_test I, [2024-05-04T08:39:17.767532 #2812191] INFO -- : [419/885] 2853045=encoding_test I, [2024-05-04T08:39:17.848079 #2812191] INFO -- : [420/885] 2853045=test_gem_commands_specification_command I, [2024-05-04T08:39:18.042022 #2812191] INFO -- : [421/885] 2853045=test_scan_args I, [2024-05-04T08:39:18.064360 #2812191] INFO -- : [422/885] 2853045=test_gem_request I, [2024-05-04T08:39:18.371514 #2812191] INFO -- : [423/885] 2853045=test_gem_commands_which_command I, [2024-05-04T08:39:18.410538 #2812191] INFO -- : [424/885] 2853045=test_gem_package_old I, [2024-05-04T08:39:18.487940 #2812191] INFO -- : [425/885] 2853045=test_gem_commands_push_command I, [2024-05-04T08:39:19.252647 #2812191] INFO -- : [426/885] 2853045=locals_test I, [2024-05-04T08:39:19.658624 #2812191] INFO -- : [427/885] 2853045=test_method_cache I, [2024-05-04T08:39:19.717604 #2812191] INFO -- : [428/885] 2853045=test_too_many_dummy_encodings I, [2024-05-04T08:39:19.733937 #2812191] INFO -- : [429/885] 2853045=test_sprintf_comb I, [2024-05-04T08:39:19.891472 #2812191] INFO -- : [430/885] 2853045=test_rendering I, [2024-05-04T08:39:19.896992 #2812191] INFO -- : [431/885] 2853045=test_win32ole I, [2024-05-04T08:39:19.903852 #2812191] INFO -- : [432/885] 2853045=test_internal_ivar I, [2024-05-04T08:39:19.936859 #2812191] INFO -- : [433/885] 2853045=test_gem_source_local I, [2024-05-04T08:39:19.952465 #2812191] INFO -- : [434/885] 2853046=desugar_compiler_test I, [2024-05-04T08:39:19.962250 #2812191] INFO -- : [435/885] 2853046=test_gem_gemcutter_utilities I, [2024-05-04T08:39:20.173751 #2812191] INFO -- : [436/885] 2853045=test_rdoc_task I, [2024-05-04T08:39:20.180777 #2812191] INFO -- : [437/885] 2853045=test_backtrace I, [2024-05-04T08:39:20.457700 #2812191] INFO -- : [438/885] 2853046=test_gem_text I, [2024-05-04T08:39:20.567851 #2812191] INFO -- : [439/885] 2853046=test_settracefunc I, [2024-05-04T08:39:21.450348 #2812191] INFO -- : [440/885] 2853045=test_tracepoint I, [2024-05-04T08:39:21.454459 #2812191] INFO -- : [441/885] 2853046=test_case I, [2024-05-04T08:39:21.469757 #2812191] INFO -- : [442/885] 2853046=test_ractor I, [2024-05-04T08:39:21.520455 #2812191] INFO -- : [443/885] 2853046=test_severity I, [2024-05-04T08:39:21.526783 #2812191] INFO -- : [444/885] 2853046=test_str2big I, [2024-05-04T08:39:21.542377 #2812191] INFO -- : [445/885] 2853046=test_gem_package_tar_writer I, [2024-05-04T08:39:21.719331 #2812191] INFO -- : [446/885] 2853046=test_set I, [2024-05-04T08:39:21.725763 #2812191] INFO -- : [447/885] 2853046=attribute_write_test I, [2024-05-04T08:39:21.743714 #2812191] INFO -- : [448/885] 2853046=test_http I, [2024-05-04T08:39:21.824640 #2812191] INFO -- : [449/885] 2853045=test_utf16 I, [2024-05-04T08:39:21.838670 #2812191] INFO -- : [450/885] 2853045=test_rdoc_markup_to_rdoc I, [2024-05-04T08:39:21.953802 #2812191] INFO -- : [451/885] 2853045=test_argf I, [2024-05-04T08:39:25.542973 #2812191] INFO -- : [452/885] 2853045=test_x509name I, [2024-05-04T08:39:25.563451 #2812191] INFO -- : [453/885] 2853045=test_yaml I, [2024-05-04T08:39:25.667539 #2812191] INFO -- : [454/885] 2853045=test_cclass I, [2024-05-04T08:39:25.771985 #2812191] INFO -- : [455/885] 2853045=test_gem_uninstaller I, [2024-05-04T08:39:26.933907 #2812191] INFO -- : [456/885] 2853045=test_yjit I, [2024-05-04T08:39:26.948074 #2812191] INFO -- : [457/885] 2853045=test_gem_dependency I, [2024-05-04T08:39:27.137825 #2812191] INFO -- : [458/885] 2853045=test_method I, [2024-05-04T08:39:30.515771 #2812191] INFO -- : [459/885] 2853046=test_m17n I, [2024-05-04T08:39:30.631479 #2812191] INFO -- : [460/885] 2853046=test_parser_events I, [2024-05-04T08:39:30.710236 #2812191] INFO -- : [461/885] 2853046=test_filter I, [2024-05-04T08:39:30.854250 #2812191] INFO -- : [462/885] 2853046=test_pkcs12 I, [2024-05-04T08:39:31.509557 #2812191] INFO -- : [463/885] 2853046=test_koi8 I, [2024-05-04T08:39:31.518086 #2812191] INFO -- : [464/885] 2853046=test_json_tree I, [2024-05-04T08:39:31.545101 #2812191] INFO -- : [465/885] 2853046=test_gem_remote_fetcher I, [2024-05-04T08:39:33.444473 #2812191] INFO -- : [466/885] 2853046=test_dir I, [2024-05-04T08:39:33.767830 #2812191] INFO -- : [467/885] 2853046=test_files_test_1 I, [2024-05-04T08:39:33.830631 #2812191] INFO -- : [468/885] 2853046=test_resolve_symbol I, [2024-05-04T08:39:33.859958 #2812191] INFO -- : [469/885] 2853046=test_rubygems I, [2024-05-04T08:39:34.013469 #2812191] INFO -- : [470/885] 2853046=test_closure I, [2024-05-04T08:39:34.504855 #2812191] INFO -- : [471/885] 2853045=test_digest I, [2024-05-04T08:39:34.517099 #2812191] INFO -- : [472/885] 2853045=test_path I, [2024-05-04T08:39:34.524300 #2812191] INFO -- : [473/885] 2853045=test_rdoc_rd_inline I, [2024-05-04T08:39:34.551647 #2812191] INFO -- : [474/885] 2853045=test_io I, [2024-05-04T08:39:35.063098 #2812191] INFO -- : [475/885] 2853047=test_uncorrectable_name_check I, [2024-05-04T08:39:35.072818 #2812191] INFO -- : [476/885] 2853047=test_printf I, [2024-05-04T08:39:35.085022 #2812191] INFO -- : [477/885] 2853047=test_x509attr I, [2024-05-04T08:39:35.092214 #2812191] INFO -- : [478/885] 2853047=test_workspace I, [2024-05-04T08:39:35.222317 #2812191] INFO -- : [479/885] 2853047=test_cgi_modruby I, [2024-05-04T08:39:35.228458 #2812191] INFO -- : [480/885] 2853047=test_win32ole_variant I, [2024-05-04T08:39:35.237556 #2812191] INFO -- : [481/885] 2853047=magic_comment_test I, [2024-05-04T08:39:35.240321 #2812191] INFO -- : [482/885] 2853047=test_win32ole_param_event I, [2024-05-04T08:39:35.250333 #2812191] INFO -- : [483/885] 2853047=test_rdoc_parser I, [2024-05-04T08:39:35.276662 #2812191] INFO -- : [484/885] 2853047=test_https_proxy I, [2024-05-04T08:39:35.298111 #2812191] INFO -- : [485/885] 2853047=test_etc I, [2024-05-04T08:39:35.298567 #2812191] INFO -- : Leaked file descriptor: TestEtc#test_getpwnam: 11 # I, [2024-05-04T08:39:35.461343 #2812191] INFO -- : COMMAND PID USER FD TYPE DEVICE SIZE/OFF NODE NAME I, [2024-05-04T08:39:35.461417 #2812191] INFO -- : ruby 2853047 opc 11u unix 0x0000000000000000 0t0 2834078644 type=STREAM I, [2024-05-04T08:39:35.611706 #2812191] INFO -- : [486/885] 2853047=test_nomethod_error I, [2024-05-04T08:39:35.633962 #2812191] INFO -- : [487/885] 2853047=test_gem_commands_rebuild_command I, [2024-05-04T08:39:35.704637 #2812191] INFO -- : [488/885] 2853047=test_stat I, [2024-05-04T08:39:35.718388 #2812191] INFO -- : [489/885] 2853047=test_ipaddr I, [2024-05-04T08:39:35.751970 #2812191] INFO -- : [490/885] 2853047=test_ocsp I, [2024-05-04T08:39:35.840112 #2812191] INFO -- : [491/885] 2853047=test_scanner_events I, [2024-05-04T08:39:35.881667 #2812191] INFO -- : [492/885] 2853047=test_date_strptime I, [2024-05-04T08:39:36.005014 #2812191] INFO -- : [493/885] 2853047=test_omap I, [2024-05-04T08:39:36.023072 #2812191] INFO -- : [494/885] 2853047=test_mul I, [2024-05-04T08:39:36.028755 #2812191] INFO -- : [495/885] 2853047=test_shellwords I, [2024-05-04T08:39:36.048963 #2812191] INFO -- : [496/885] 2853047=test_rdoc_generator_pot_po I, [2024-05-04T08:39:36.079107 #2812191] INFO -- : [497/885] 2853047=test_gem_ext_configure_builder I, [2024-05-04T08:39:36.110449 #2812191] INFO -- : [498/885] 2853047=json_ext_parser_test I, [2024-05-04T08:39:36.126298 #2812191] INFO -- : [499/885] 2853047=test_nonblock I, [2024-05-04T08:39:36.141466 #2812191] INFO -- : [500/885] 2853047=test_rdoc_parser_simple I, [2024-05-04T08:39:36.174621 #2812191] INFO -- : [501/885] 2853047=test_io_m17n I, [2024-05-04T08:39:36.348768 #2812191] INFO -- : [502/885] 2853046=test_rdoc_top_level I, [2024-05-04T08:39:36.622735 #2812191] INFO -- : [503/885] 2853046=test_gem_stub_specification I, [2024-05-04T08:39:36.820762 #2812191] INFO -- : [504/885] 2853046=test_float I, [2024-05-04T08:39:37.411416 #2812191] INFO -- : [505/885] 2853047=test_cmethod I, [2024-05-04T08:39:37.511444 #2812191] INFO -- : [506/885] 2853047=test_color I, [2024-05-04T08:39:37.541755 #2812191] INFO -- : [507/885] 2853047=test_gb18030 I, [2024-05-04T08:39:37.550585 #2812191] INFO -- : [508/885] 2853047=test_propertyputref I, [2024-05-04T08:39:37.560435 #2812191] INFO -- : [509/885] 2853047=test_reline_key I, [2024-05-04T08:39:37.576837 #2812191] INFO -- : [510/885] 2853047=test_gem_commands_lock_command I, [2024-05-04T08:39:37.602303 #2812191] INFO -- : [511/885] 2853047=test_unicode_normalize I, [2024-05-04T08:39:38.678216 #2812191] INFO -- : [512/885] 2853046=test_rdoc_generator_ri I, [2024-05-04T08:39:38.699408 #2812191] INFO -- : [513/885] 2853046=test_gem_stream_ui I, [2024-05-04T08:39:38.870142 #2812191] INFO -- : [514/885] 2853046=test_regex_casefold I, [2024-05-04T08:39:39.325501 #2812191] INFO -- : [515/885] 2853046=test_win32ole_method I, [2024-05-04T08:39:39.335691 #2812191] INFO -- : [516/885] 2853046=test_lexer I, [2024-05-04T08:39:39.377492 #2812191] INFO -- : [517/885] 2853046=test_gem_source_git I, [2024-05-04T08:39:40.490302 #2812191] INFO -- : [518/885] 2853046=test_ripper I, [2024-05-04T08:39:40.720686 #2812191] INFO -- : [519/885] 2853046=test_thread_cv I, [2024-05-04T08:39:41.357564 #2812191] INFO -- : [520/885] 2853046=test_stringio I, [2024-05-04T08:39:41.458275 #2812191] INFO -- : [521/885] 2853046=test_assembler I, [2024-05-04T08:39:41.459716 #2812191] INFO -- : [522/885] 2853046=test_files_ext I, [2024-05-04T08:39:41.465059 #2812191] INFO -- : [523/885] 2853046=test_random I, [2024-05-04T08:39:41.490535 #2812191] INFO -- : [524/885] 2853046=dispatcher_test I, [2024-05-04T08:39:41.511780 #2812191] INFO -- : [525/885] 2853046=test_eval_history I, [2024-05-04T08:39:41.525994 #2812191] INFO -- : [526/885] 2853046=test_unicode I, [2024-05-04T08:39:41.546209 #2812191] INFO -- : [527/885] 2853046=test_autoload I, [2024-05-04T08:39:41.810370 #2812191] INFO -- : [528/885] 2853047=test_gem_package I, [2024-05-04T08:39:42.636253 #2812191] INFO -- : [529/885] 2853047=test_array I, [2024-05-04T08:39:45.056311 #2812191] INFO -- : [530/885] 2853045=test_at_exit I, [2024-05-04T08:39:45.062724 #2812191] INFO -- : [531/885] 2853045=test_benchmark I, [2024-05-04T08:39:46.236733 #2812191] INFO -- : [532/885] 2853046=test_mkmf I, [2024-05-04T08:39:46.268415 #2812191] INFO -- : [533/885] 2853046=test_gem_source I, [2024-05-04T08:39:46.643594 #2812191] INFO -- : [534/885] 2853045=test_have_macro I, [2024-05-04T08:39:46.651926 #2812191] INFO -- : [535/885] 2853046=test_class I, [2024-05-04T08:39:46.668032 #2812191] INFO -- : [536/885] 2853046=test_gem_request_set_lockfile_tokenizer I, [2024-05-04T08:39:46.762311 #2812191] INFO -- : [537/885] 2853046=test_cgi_multipart I, [2024-05-04T08:39:46.872100 #2812191] INFO -- : [538/885] 2853046=test_lazy_enumerator I, [2024-05-04T08:39:46.937182 #2812191] INFO -- : [539/885] 2853045=test_autoconf I, [2024-05-04T08:39:46.941983 #2812191] INFO -- : [540/885] 2853045=integer_parse_test I, [2024-05-04T08:39:46.952695 #2812191] INFO -- : [541/885] 2853045=test_arithmetic_sequence I, [2024-05-04T08:39:47.023470 #2812191] INFO -- : [542/885] 2853045=test_ractor_compatibility I, [2024-05-04T08:39:47.322479 #2812191] INFO -- : [543/885] 2853045=test_find_executable I, [2024-05-04T08:39:47.329234 #2812191] INFO -- : [544/885] 2853046=test_ftp I, [2024-05-04T08:39:47.332850 #2812191] INFO -- : [545/885] 2853045=test_sockopt I, [2024-05-04T08:39:47.335482 #2812191] INFO -- : [546/885] 2853046=test_gem_source_fetch_problem I, [2024-05-04T08:39:47.345527 #2812191] INFO -- : [547/885] 2853045=test_rdoc_comment I, [2024-05-04T08:39:47.356808 #2812191] INFO -- : [548/885] 2853046=test_install I, [2024-05-04T08:39:47.389414 #2812191] INFO -- : [549/885] 2853045=test_encoding I, [2024-05-04T08:39:47.400879 #2812191] INFO -- : [550/885] 2853045=command_line_test I, [2024-05-04T08:39:47.417817 #2812191] INFO -- : [551/885] 2853045=test_env I, [2024-05-04T08:39:47.568101 #2812191] INFO -- : [552/885] 2853046=test_gem_package_tar_reader I, [2024-05-04T08:39:47.641364 #2812191] INFO -- : [553/885] 2853046=test_gem_commands_signout_command I, [2024-05-04T08:39:47.657879 #2812191] INFO -- : [554/885] 2853046=test_win32ole_variant_m I, [2024-05-04T08:39:47.688923 #2812191] INFO -- : [555/885] 2853046=test_pair I, [2024-05-04T08:39:49.985448 #2812191] INFO -- : [556/885] 2853045=test_history I, [2024-05-04T08:39:50.042706 #2812191] INFO -- : [557/885] 2853045=test_gem_commands_setup_command I, [2024-05-04T08:39:50.800477 #2812191] INFO -- : [558/885] 2853045=test_gem_safe_yaml I, [2024-05-04T08:39:50.816836 #2812191] INFO -- : [559/885] 2853045=test_document I, [2024-05-04T08:39:50.827344 #2812191] INFO -- : [560/885] 2853045=test_eval I, [2024-05-04T08:39:50.829646 #2812191] INFO -- : [561/885] 2853045=test_singleton_function I, [2024-05-04T08:39:50.839856 #2812191] INFO -- : [562/885] 2853045=test_iseq I, [2024-05-04T08:39:51.372595 #2812191] INFO -- : [563/885] 2853045=test_primitive I, [2024-05-04T08:39:51.375016 #2812191] INFO -- : [564/885] 2853045=test_rdoc_ri_paths I, [2024-05-04T08:39:51.425673 #2812191] INFO -- : [565/885] 2853045=test_parser I, [2024-05-04T08:39:51.434385 #2812191] INFO -- : [566/885] 2853045=test_gem_package_tar_header I, [2024-05-04T08:39:51.539616 #2812191] INFO -- : [567/885] 2853045=test_ssl_session I, [2024-05-04T08:39:52.371998 #2812191] INFO -- : [568/885] 2853045=test_logperiod I, [2024-05-04T08:39:52.475125 #2812191] INFO -- : [569/885] 2853045=test_case_comprehensive I, [2024-05-04T08:39:52.959942 #2812191] INFO -- : [570/885] 2853046=test_rational2 I, [2024-05-04T08:39:52.968351 #2812191] INFO -- : [571/885] 2853046=test_placearg I, [2024-05-04T08:39:53.094732 #2812191] INFO -- : [572/885] 2853046=test_completion I, [2024-05-04T08:39:54.003340 #2812191] INFO -- : [573/885] 2853046=test_file_exhaustive I, [2024-05-04T08:39:59.024913 #2812191] INFO -- : [574/885] 2853047=test_gem_security_policy I, [2024-05-04T08:39:59.409910 #2812191] INFO -- : [575/885] 2853047=test_rdoc_markup_document I, [2024-05-04T08:39:59.430173 #2812191] INFO -- : [576/885] 2853047=test_delete I, [2024-05-04T08:39:59.431679 #2812191] INFO -- : [577/885] 2853047=test_handle I, [2024-05-04T08:40:00.705113 #2812191] INFO -- : [578/885] 2853047=parse_stream_test I, [2024-05-04T08:40:00.715260 #2812191] INFO -- : [579/885] 2853047=test_io_wait_uncommon I, [2024-05-04T08:40:00.728751 #2812191] INFO -- : [580/885] 2853047=test_fixnum I, [2024-05-04T08:40:00.746153 #2812191] INFO -- : [581/885] 2853047=test_gem_silent_ui I, [2024-05-04T08:40:00.796419 #2812191] INFO -- : [582/885] 2853047=test_signal I, [2024-05-04T08:40:02.802518 #2812191] INFO -- : [583/885] 2853047=test_continuation I, [2024-05-04T08:40:02.810831 #2812191] INFO -- : [584/885] 2853047=test_gem_ci_detector I, [2024-05-04T08:40:02.825798 #2812191] INFO -- : [585/885] 2853047=test_files_test I, [2024-05-04T08:40:02.895524 #2812191] INFO -- : [586/885] 2853047=test_weakkeymap I, [2024-05-04T08:40:03.482203 #2812191] INFO -- : [587/885] 2853047=test_evaluation I, [2024-05-04T08:40:03.517532 #2812191] INFO -- : [588/885] 2853047=test_protocol I, [2024-05-04T08:40:03.617520 #2812191] INFO -- : [589/885] 2853046=test_rdoc_markup_to_ansi I, [2024-05-04T08:40:03.655264 #2812191] INFO -- : [590/885] 2853046=test_object_create_start I, [2024-05-04T08:40:03.671611 #2812191] INFO -- : [591/885] 2853046=test_gem_commands_info_command I, [2024-05-04T08:40:03.693204 #2812191] INFO -- : [592/885] 2853046=test_https I, [2024-05-04T08:40:03.812691 #2812191] INFO -- : [593/885] 2853047=test_gem_request_set_gem_dependency_api I, [2024-05-04T08:40:03.872770 #2812191] INFO -- : [594/885] 2853046=test_name_error_extension I, [2024-05-04T08:40:03.928469 #2812191] INFO -- : [595/885] 2853046=test_x509cert I, [2024-05-04T08:40:04.017448 #2812191] INFO -- : [596/885] 2853046=test_rdoc_markup_paragraph I, [2024-05-04T08:40:04.021851 #2812191] INFO -- : [597/885] 2853046=test_irb I, [2024-05-04T08:40:04.133811 #2812191] INFO -- : [598/885] 2853047=test_variable_name_check I, [2024-05-04T08:40:04.254882 #2812191] INFO -- : [599/885] 2853047=test_bn I, [2024-05-04T08:40:04.284555 #2812191] INFO -- : [600/885] 2853047=test_require_path_check I, [2024-05-04T08:40:04.324957 #2812191] INFO -- : [601/885] 2853046=test_logdevice I, [2024-05-04T08:40:04.505754 #2812191] INFO -- : [602/885] 2853047=test_ast I, [2024-05-04T08:40:05.217571 #2812191] INFO -- : [603/885] 2853046=test_exception_at_throwing I, [2024-05-04T08:40:05.275589 #2812191] INFO -- : [604/885] 2853046=test_gem_resolver_installed_specification I, [2024-05-04T08:40:05.311091 #2812191] INFO -- : [605/885] 2853046=test_ractor I, [2024-05-04T08:40:05.416769 #2812191] INFO -- : [606/885] 2853046=test_stringscanner I, [2024-05-04T08:40:05.502745 #2812191] INFO -- : [607/885] 2853046=json_generic_object_test I, [2024-05-04T08:40:05.544966 #2812191] INFO -- : [608/885] 2853046=test_fiddle I, [2024-05-04T08:40:05.711566 #2812191] INFO -- : [609/885] 2853046=test_gem_resolver_vendor_specification I, [2024-05-04T08:40:05.750560 #2812191] INFO -- : [610/885] 2853046=test_date_arith I, [2024-05-04T08:40:05.783528 #2812191] INFO -- : [611/885] 2853046=test_gem_safe_marshal I, [2024-05-04T08:40:06.986435 #2812191] INFO -- : [612/885] 2853046=test_httpheader I, [2024-05-04T08:40:07.005633 #2812191] INFO -- : [613/885] 2853046=test_sexp I, [2024-05-04T08:40:07.029587 #2812191] INFO -- : [614/885] 2853046=test_ractor I, [2024-05-04T08:40:07.089707 #2812191] INFO -- : [615/885] 2853046=test_rdoc_ri_driver I, [2024-05-04T08:40:07.629018 #2812191] INFO -- : [616/885] 2853046=test_gem_resolver_git_set I, [2024-05-04T08:40:08.198164 #2812191] INFO -- : [617/885] 2853046=test_gem_commands_check_command I, [2024-05-04T08:40:08.260932 #2812191] INFO -- : [618/885] 2853046=test_signedness I, [2024-05-04T08:40:10.036623 #2812191] INFO -- : [619/885] 2853046=test_digest I, [2024-05-04T08:40:10.812757 #2812191] INFO -- : [620/885] 2853046=test_dup I, [2024-05-04T08:40:10.976929 #2812191] INFO -- : [621/885] 2853046=test_rdoc_single_class I, [2024-05-04T08:40:10.984588 #2812191] INFO -- : [622/885] 2853046=test_acceptable I, [2024-05-04T08:40:11.059127 #2812191] INFO -- : [623/885] 2853046=test_gem_ext_cargo_builder_link_flag_converter I, [2024-05-04T08:40:11.175589 #2812191] INFO -- : [624/885] 2853046=test_gem_local_remote_options I, [2024-05-04T08:40:11.311640 #2812191] INFO -- : [625/885] 2853046=test_mutex I, [2024-05-04T08:40:12.440859 #2812191] INFO -- : [626/885] 2853046=test_rdoc_token_stream I, [2024-05-04T08:40:12.447487 #2812191] INFO -- : [627/885] 2853046=test_type I, [2024-05-04T08:40:12.464558 #2812191] INFO -- : [628/885] 2853046=heredoc_dedent_test I, [2024-05-04T08:40:12.472257 #2812191] INFO -- : [629/885] 2853046=test_tmpdir I, [2024-05-04T08:40:12.544600 #2812191] INFO -- : [630/885] 2853046=test_struct I, [2024-05-04T08:40:12.825205 #2812191] INFO -- : [631/885] 2853045=test_erb_command I, [2024-05-04T08:40:12.859761 #2812191] INFO -- : [632/885] 2853045=test_module I, [2024-05-04T08:40:13.117702 #2812191] INFO -- : [633/885] 2853046=test_gem_security_trust_dir I, [2024-05-04T08:40:13.196102 #2812191] INFO -- : [634/885] 2853046=test_gem_source_installed I, [2024-05-04T08:40:13.217739 #2812191] INFO -- : [635/885] 2853046=test_gem_validator I, [2024-05-04T08:40:13.250506 #2812191] INFO -- : [636/885] 2853046=test_usrmarshal I, [2024-05-04T08:40:13.456686 #2812191] INFO -- : [637/885] 2853046=test_load I, [2024-05-04T08:40:13.464927 #2812191] INFO -- : [638/885] 2853046=test_integer_comb I, [2024-05-04T08:40:16.074993 #2812191] INFO -- : [639/885] 2853046=test_bundled_ca I, [2024-05-04T08:40:16.735816 #2812191] INFO -- : [640/885] 2853045=test_abi I, [2024-05-04T08:40:17.057607 #2812191] INFO -- : [641/885] 2853045=test_ssl I, [2024-05-04T08:40:17.255129 #2812191] INFO -- : [642/885] 2853046=test_lock_native_thread I, [2024-05-04T08:40:17.543302 #2812191] INFO -- : [643/885] 2853046=test_gem_package_task I, [2024-05-04T08:40:17.551607 #2812191] INFO -- : [644/885] 2853046=test_resize I, [2024-05-04T08:40:17.555839 #2812191] INFO -- : [645/885] 2853046=test_key_error I, [2024-05-04T08:40:17.565633 #2812191] INFO -- : [646/885] 2853046=test_win32ole_param I, [2024-05-04T08:40:17.567934 #2812191] INFO -- : [647/885] 2853046=test_gem_commands_mirror I, [2024-05-04T08:40:17.586571 #2812191] INFO -- : [648/885] 2853046=test_fiber I, [2024-05-04T08:40:23.827736 #2812191] INFO -- : [649/885] 2853046=test_engine I, [2024-05-04T08:40:24.390205 #2812191] INFO -- : [650/885] 2853046=test_custom_command I, [2024-05-04T08:40:24.402519 #2812191] INFO -- : [651/885] 2853046=test_rdoc_parser_markdown I, [2024-05-04T08:40:24.417928 #2812191] INFO -- : [652/885] 2853046=test_cparser I, [2024-05-04T08:40:26.358934 #2812191] INFO -- : [653/885] 2853046=fuzzer_test I, [2024-05-04T08:40:26.372305 #2812191] INFO -- : [654/885] 2853046=test_rubyvm I, [2024-05-04T08:40:26.377292 #2812191] INFO -- : [655/885] 2853046=test_c_struct_entry I, [2024-05-04T08:40:27.208852 #2812191] INFO -- : [656/885] 2853046=test_struct I, [2024-05-04T08:40:27.213628 #2812191] INFO -- : [657/885] 2853046=static_inspect_test I, [2024-05-04T08:40:27.219913 #2812191] INFO -- : [658/885] 2853046=test_config I, [2024-05-04T08:40:27.290338 #2812191] INFO -- : [659/885] 2853046=test_ostruct I, [2024-05-04T08:40:27.411093 #2812191] INFO -- : [660/885] 2853046=test_depth_first I, [2024-05-04T08:40:27.411967 #2812191] INFO -- : [661/885] 2853045=test_change_word I, [2024-05-04T08:40:27.431161 #2812191] INFO -- : [662/885] 2853046=test_gem_source_lock I, [2024-05-04T08:40:27.486986 #2812191] INFO -- : [663/885] 2853045=test_update I, [2024-05-04T08:40:27.488073 #2812191] INFO -- : [664/885] 2853045=test_cipher I, [2024-05-04T08:40:27.516133 #2812191] INFO -- : [665/885] 2853045=test_new I, [2024-05-04T08:40:27.518409 #2812191] INFO -- : [666/885] 2853046=test_win32ole_type I, [2024-05-04T08:40:27.524599 #2812191] INFO -- : [667/885] 2853046=test_rdoc_rd_inline_parser I, [2024-05-04T08:40:27.527302 #2812191] INFO -- : [668/885] 2853045=test_load I, [2024-05-04T08:40:27.530162 #2812191] INFO -- : [669/885] 2853045=test_x509store I, [2024-05-04T08:40:27.569281 #2812191] INFO -- : [670/885] 2853046=test_rdoc_rd_block_parser I, [2024-05-04T08:40:27.606132 #2812191] INFO -- : [671/885] 2853046=test_rdoc_generator_pot I, [2024-05-04T08:40:27.611905 #2812191] INFO -- : [672/885] 2853046=test_rdoc_markup_to_joined_paragraph I, [2024-05-04T08:40:27.624647 #2812191] INFO -- : [673/885] 2853046=test_rdoc_markup_to_markdown I, [2024-05-04T08:40:27.680145 #2812191] INFO -- : [674/885] 2853046=test_rdoc_rd I, [2024-05-04T08:40:27.695402 #2812191] INFO -- : [675/885] 2853046=test_gem_gem_runner I, [2024-05-04T08:40:27.773141 #2812191] INFO -- : [676/885] 2853046=test_require_lib I, [2024-05-04T08:40:28.049039 #2812191] INFO -- : [677/885] 2853045=test_metaclass I, [2024-05-04T08:40:28.065021 #2812191] INFO -- : [678/885] 2853045=test_require I, [2024-05-04T08:40:30.680755 #2812191] INFO -- : [679/885] 2853045=test_objectspace I, [2024-05-04T08:40:30.847931 #2812191] INFO -- : [680/885] 2853046=test_gem_resolver_composed_set I, [2024-05-04T08:40:30.928081 #2812191] INFO -- : [681/885] 2853046=test_my_integer I, [2024-05-04T08:40:30.928574 #2812191] INFO -- : [682/885] 2853046=test_debugger_integration I, [2024-05-04T08:40:30.960565 #2812191] INFO -- : [683/885] 2853046=test_cgi_cookie I, [2024-05-04T08:40:30.963117 #2812191] INFO -- : [684/885] 2853046=test_not I, [2024-05-04T08:40:30.973042 #2812191] INFO -- : [685/885] 2853046=test_tracer I, [2024-05-04T08:40:30.982061 #2812191] INFO -- : [686/885] 2853046=test_wss I, [2024-05-04T08:40:30.992209 #2812191] INFO -- : [687/885] 2853046=test_rdoc_markup_attribute_manager I, [2024-05-04T08:40:31.059041 #2812191] INFO -- : [688/885] 2853046=test_option I, [2024-05-04T08:40:31.156156 #2812191] INFO -- : [689/885] 2853046=test_enc_str_buf_cat I, [2024-05-04T08:40:31.163445 #2812191] INFO -- : [690/885] 2853046=newline_test I, [2024-05-04T08:40:31.250053 #2812191] INFO -- : [691/885] 2853046=test_bignum I, [2024-05-04T08:40:31.603067 #2812191] INFO -- : [692/885] 2853045=test_rdoc_markup_hard_break I, [2024-05-04T08:40:31.610061 #2812191] INFO -- : [693/885] 2853045=test_nesting_parser I, [2024-05-04T08:40:31.626165 #2812191] INFO -- : [694/885] 2853045=ractor_test I, [2024-05-04T08:40:31.690264 #2812191] INFO -- : [695/885] 2853045=test_ancdata I, [2024-05-04T08:40:31.693370 #2812191] INFO -- : [696/885] 2853045=test_marshal I, [2024-05-04T08:40:33.171857 #2812191] INFO -- : [697/885] 2853045=test_gem_resolver_conflict I, [2024-05-04T08:40:33.264777 #2812191] INFO -- : [698/885] 2853045=test_ractor I, [2024-05-04T08:40:33.594758 #2812191] INFO -- : [699/885] 2853045=test_ssl I, [2024-05-04T08:40:33.732294 #2812191] INFO -- : [700/885] 2853045=test_scheduler I, [2024-05-04T08:40:33.915480 #2812191] INFO -- : [701/885] 2853045=test_gem_commands_help_command I, [2024-05-04T08:40:34.050396 #2812191] INFO -- : [702/885] 2853045=test_registry I, [2024-05-04T08:40:34.051552 #2812191] INFO -- : [703/885] 2853045=test_gem I, [2024-05-04T08:40:34.884798 #2812191] INFO -- : [704/885] 2853046=test_ansi_without_terminfo I, [2024-05-04T08:40:34.897307 #2812191] INFO -- : [705/885] 2853046=json_generator_test I, [2024-05-04T08:40:35.013162 #2812191] INFO -- : [706/885] 2853046=test_ractor I, [2024-05-04T08:40:35.013463 #2812191] INFO -- : [707/885] 2853046=test_parser I, [2024-05-04T08:40:35.036024 #2812191] INFO -- : [708/885] 2853046=test_rdoc_markup_to_label I, [2024-05-04T08:40:35.088956 #2812191] INFO -- : [709/885] 2853046=test_gem_resolver_best_set I, [2024-05-04T08:40:35.243052 #2812191] INFO -- : [710/885] 2853046=test_cgi_core I, [2024-05-04T08:40:35.257210 #2812191] INFO -- : [711/885] 2853046=test_rbconfig I, [2024-05-04T08:40:35.263996 #2812191] INFO -- : [712/885] 2853046=test_num2int I, [2024-05-04T08:40:35.283491 #2812191] INFO -- : [713/885] 2853046=test_range I, [2024-05-04T08:40:36.059976 #2812191] INFO -- : [714/885] 2853046=test_gem_commands_signin_command I, [2024-05-04T08:40:36.265343 #2812191] INFO -- : [715/885] 2853046=test_extlibs I, [2024-05-04T08:40:36.629120 #2812191] INFO -- : [716/885] 2853045=test_iter_break I, [2024-05-04T08:40:36.636938 #2812191] INFO -- : [717/885] 2853045=test_rdoc_markup_include I, [2024-05-04T08:40:36.650277 #2812191] INFO -- : [718/885] 2853045=test_enum I, [2024-05-04T08:40:37.714090 #2812191] INFO -- : [719/885] 2853045=test_require I, [2024-05-04T08:40:37.886731 #2812191] INFO -- : [720/885] 2853046=test_recursion I, [2024-05-04T08:40:37.901241 #2812191] INFO -- : [721/885] 2853046=test_stream I, [2024-05-04T08:40:37.911777 #2812191] INFO -- : [722/885] 2853046=test_ractor I, [2024-05-04T08:40:37.988209 #2812191] INFO -- : [723/885] 2853046=test_trick I, [2024-05-04T08:40:39.177580 #2812191] INFO -- : [724/885] 2853045=test_address_resolve I, [2024-05-04T08:40:39.193261 #2812191] INFO -- : [725/885] 2853045=test_rdoc_attr I, [2024-05-04T08:40:39.204990 #2812191] INFO -- : [726/885] 2853045=test_locale I, [2024-05-04T08:40:39.237041 #2812191] INFO -- : [727/885] 2853045=test_ts I, [2024-05-04T08:40:39.589704 #2812191] INFO -- : [728/885] 2853045=test_have_func I, [2024-05-04T08:40:40.588977 #2812191] INFO -- : [729/885] 2853046=test_date_marshal I, [2024-05-04T08:40:40.600205 #2812191] INFO -- : [730/885] 2853046=test_date_new I, [2024-05-04T08:40:40.617799 #2812191] INFO -- : [731/885] 2853046=test_gem_commands_list_command I, [2024-05-04T08:40:40.636344 #2812191] INFO -- : [732/885] 2853046=test_gem_resolver_local_specification I, [2024-05-04T08:40:40.666375 #2812191] INFO -- : [733/885] 2853046=test_configuration I, [2024-05-04T08:40:40.756796 #2812191] INFO -- : [734/885] 2853046=test_gem_commands_search_command I, [2024-05-04T08:40:40.786024 #2812191] INFO -- : [735/885] 2853046=test_symbol I, [2024-05-04T08:40:40.815819 #2812191] INFO -- : [736/885] 2853045=test_coder I, [2024-05-04T08:40:40.837853 #2812191] INFO -- : [737/885] 2853045=test_rdoc_servlet I, [2024-05-04T08:40:40.931063 #2812191] INFO -- : [738/885] 2853045=test_gem_commands_contents_command I, [2024-05-04T08:40:41.080059 #2812191] INFO -- : [739/885] 2853045=test_udp I, [2024-05-04T08:40:41.099641 #2812191] INFO -- : [740/885] 2853045=test_context I, [2024-05-04T08:40:41.213759 #2812191] INFO -- : [741/885] 2853045=test_formatter I, [2024-05-04T08:40:41.254909 #2812191] INFO -- : [742/885] 2853045=test_integer I, [2024-05-04T08:40:43.977540 #2812191] INFO -- : [743/885] 2853045=test_unix I, [2024-05-04T08:40:44.017217 #2812191] INFO -- : [744/885] 2853045=ruby_api_test I, [2024-05-04T08:40:44.252148 #2812191] INFO -- : [745/885] 2853045=test_gem_resolver_index_set I, [2024-05-04T08:40:44.377255 #2812191] INFO -- : [746/885] 2853045=test_sleep I, [2024-05-04T08:40:46.867053 #2812191] INFO -- : [747/885] 2853046=test_webauthn_listener_response I, [2024-05-04T08:40:46.949252 #2812191] INFO -- : [748/885] 2853046=test_folderitem2_invokeverb I, [2024-05-04T08:40:46.955071 #2812191] INFO -- : [749/885] 2853046=test_interned_str I, [2024-05-04T08:40:46.960270 #2812191] INFO -- : [750/885] 2853046=constant_path_node_test I, [2024-05-04T08:40:46.967772 #2812191] INFO -- : [751/885] 2853046=test_set_len I, [2024-05-04T08:40:46.986412 #2812191] INFO -- : [752/885] 2853046=test_pattern_matching I, [2024-05-04T08:40:47.087274 #2812191] INFO -- : [753/885] 2853046=test_gc I, [2024-05-04T08:40:49.321784 #2812191] INFO -- : [754/885] 2853045=test_gem_request_set I, [2024-05-04T08:40:49.807652 #2812191] INFO -- : [755/885] 2853047=test_gem_bundler_version_finder I, [2024-05-04T08:40:49.876523 #2812191] INFO -- : [756/885] 2853047=test_project_sanity I, [2024-05-04T08:40:49.952364 #2812191] INFO -- : [757/885] 2853047=test_symbol I, [2024-05-04T08:40:49.954889 #2812191] INFO -- : [758/885] 2853047=location_test I, [2024-05-04T08:40:49.964478 #2812191] INFO -- : [759/885] 2853045=test_chilled I, [2024-05-04T08:40:49.967004 #2812191] INFO -- : [760/885] 2853045=test_delegate I, [2024-05-04T08:40:50.000887 #2812191] INFO -- : [761/885] 2853045=test_ensured I, [2024-05-04T08:40:50.020188 #2812191] INFO -- : [762/885] 2853047=test_rdoc_markup I, [2024-05-04T08:40:50.048829 #2812191] INFO -- : [763/885] 2853047=test_key_stroke I, [2024-05-04T08:40:50.059650 #2812191] INFO -- : [764/885] 2853047=test_euc_jp I, [2024-05-04T08:40:50.070174 #2812191] INFO -- : [765/885] 2853047=test_alias_and_anchor I, [2024-05-04T08:40:50.072547 #2812191] INFO -- : [766/885] 2853045=test_popen_deadlock I, [2024-05-04T08:40:50.085326 #2812191] INFO -- : [767/885] 2853047=test_time I, [2024-05-04T08:40:50.249871 #2812191] INFO -- : [768/885] 2853047=test_windows_1251 I, [2024-05-04T08:40:50.258845 #2812191] INFO -- : [769/885] 2853047=test_gem_ext_builder I, [2024-05-04T08:40:50.688977 #2812191] INFO -- : [770/885] 2853045=test_history I, [2024-05-04T08:40:50.782326 #2812191] INFO -- : [771/885] 2853045=test_to_ary_concat I, [2024-05-04T08:40:51.392196 #2812191] INFO -- : [772/885] 2853047=test_reline I, [2024-05-04T08:40:51.562346 #2812191] INFO -- : [773/885] 2853047=test_gem_commands_build_command I, [2024-05-04T08:40:51.974432 #2812191] INFO -- : [774/885] 2853047=test_call I, [2024-05-04T08:40:52.181875 #2812191] INFO -- : [775/885] 2853047=test_ellipsize I, [2024-05-04T08:40:52.203355 #2812191] INFO -- : [776/885] 2853047=test_data I, [2024-05-04T08:40:52.282546 #2812191] INFO -- : [777/885] 2853047=test_bug-14834 I, [2024-05-04T08:40:52.285416 #2812191] INFO -- : [778/885] 2853047=test_terminfo I, [2024-05-04T08:40:52.305522 #2812191] INFO -- : [779/885] 2853047=test_socket I, [2024-05-04T08:40:53.304090 #2812191] INFO -- : [780/885] 2853047=test_inlinecache I, [2024-05-04T08:40:53.442886 #2812191] INFO -- : [781/885] 2853047=test_thread I, [2024-05-04T08:40:55.445294 #2812191] INFO -- : [782/885] 2853045=test_time_tz I, [2024-05-04T08:40:55.500949 #2812191] INFO -- : [783/885] 2853045=test_addrinfo I, [2024-05-04T08:40:55.573188 #2812191] INFO -- : [784/885] 2853045=test_to_ruby I, [2024-05-04T08:40:55.613626 #2812191] INFO -- : [785/885] 2853045=test_beginendblock I, [2024-05-04T08:40:55.950411 #2812191] INFO -- : [786/885] 2853045=test_monitor I, [2024-05-04T08:40:56.185022 #2812191] INFO -- : [787/885] 2853045=test_eval I, [2024-05-04T08:40:56.520291 #2812191] INFO -- : [788/885] 2853045=test_regexp I, [2024-05-04T08:40:56.729991 #2812191] INFO -- : [789/885] 2853046=test_whileuntil I, [2024-05-04T08:40:56.738027 #2812191] INFO -- : [790/885] 2853046=test_nofree I, [2024-05-04T08:40:56.747309 #2812191] INFO -- : [791/885] 2853046=test_within_pipe I, [2024-05-04T08:40:56.779677 #2812191] INFO -- : [792/885] 2853046=test_rdoc_normal_class I, [2024-05-04T08:40:56.907179 #2812191] INFO -- : [793/885] 2853046=test_pointer I, [2024-05-04T08:40:58.842378 #2812191] INFO -- : [794/885] 2853046=test_bug_reporter I, [2024-05-04T08:40:59.043308 #2812191] INFO -- : [795/885] 2853046=test_gem_installer I, [2024-05-04T08:41:02.646383 #2812191] INFO -- : [796/885] 2853047=test_ossl I, [2024-05-04T08:41:04.548969 #2812191] INFO -- : [797/885] 2853046=test_buffered_io I, [2024-05-04T08:41:04.556969 #2812191] INFO -- : [798/885] 2853046=compiler_test I, [2024-05-04T08:41:04.559145 #2812191] INFO -- : [799/885] 2853046=test_arith_seq_extract I, [2024-05-04T08:41:04.569921 #2812191] INFO -- : [800/885] 2853046=test_ruby_lex I, [2024-05-04T08:41:04.699204 #2812191] INFO -- : [801/885] 2853046=test_object_references I, [2024-05-04T08:41:04.749461 #2812191] INFO -- : [802/885] 2853046=test_gem_source_subpath_problem I, [2024-05-04T08:41:04.832089 #2812191] INFO -- : [803/885] 2853046=test_helper I, [2024-05-04T08:41:04.850066 #2812191] INFO -- : [804/885] 2853046=test_gem_resolver_api_set I, [2024-05-04T08:41:04.953337 #2812191] INFO -- : [805/885] 2853046=test_duplicate I, [2024-05-04T08:41:04.970751 #2812191] INFO -- : [806/885] 2853046=test_kill_ring I, [2024-05-04T08:41:04.983319 #2812191] INFO -- : [807/885] 2853046=test_mailto I, [2024-05-04T08:41:04.993963 #2812191] INFO -- : [808/885] 2853046=test_addr I, [2024-05-04T08:41:05.008935 #2812191] INFO -- : [809/885] 2853046=test_object I, [2024-05-04T08:41:05.020602 #2812191] INFO -- : [810/885] 2853046=test_member I, [2024-05-04T08:41:05.027428 #2812191] INFO -- : [811/885] 2853046=format_errors_test I, [2024-05-04T08:41:05.037016 #2812191] INFO -- : [812/885] 2853046=test_cgi_header I, [2024-05-04T08:41:05.044919 #2812191] INFO -- : [813/885] 2853046=test_case_options I, [2024-05-04T08:41:05.053762 #2812191] INFO -- : [814/885] 2853046=test_emitter I, [2024-05-04T08:41:05.062669 #2812191] INFO -- : [815/885] 2853046=test_x509ext I, [2024-05-04T08:41:05.164257 #2812191] INFO -- : [816/885] 2853046=test_config I, [2024-05-04T08:41:05.527260 #2812191] INFO -- : [817/885] 2853046=test_file I, [2024-05-04T08:41:10.099903 #2812191] INFO -- : [818/885] 2853047=test_helper_method I, [2024-05-04T08:41:10.118271 #2812191] INFO -- : [819/885] 2853047=test_summary I, [2024-05-04T08:41:10.180808 #2812191] INFO -- : [820/885] 2853047=bom_test I, [2024-05-04T08:41:10.192349 #2812191] INFO -- : [821/885] 2853047=test_foreach I, [2024-05-04T08:41:10.206631 #2812191] INFO -- : [822/885] 2853047=test_rdoc_markup_to_html I, [2024-05-04T08:41:10.319144 #2812191] INFO -- : [823/885] 2853047=test_gem_resolver_installer_set I, [2024-05-04T08:41:10.604304 #2812191] INFO -- : [824/885] 2853047=test_append I, [2024-05-04T08:41:10.613849 #2812191] INFO -- : [825/885] 2853047=test_trace I, [2024-05-04T08:41:10.635017 #2812191] INFO -- : [826/885] 2853047=test_gem_path_support I, [2024-05-04T08:41:10.681095 #2812191] INFO -- : [827/885] 2853047=test_arity I, [2024-05-04T08:41:10.686536 #2812191] INFO -- : [828/885] 2853047=test_win32ole_type_event I, [2024-05-04T08:41:10.739067 #2812191] INFO -- : [829/885] 2853047=test_keyword I, [2024-05-04T08:41:11.228839 #2812191] INFO -- : [830/885] 2853047=test_scalar_scanner I, [2024-05-04T08:41:11.244220 #2812191] INFO -- : [831/885] 2853047=test_lambda I, [2024-05-04T08:41:11.307755 #2812191] INFO -- : [832/885] 2853047=test_rb_str_dup I, [2024-05-04T08:41:11.324626 #2812191] INFO -- : [833/885] 2853047=test_compile_prism I, [2024-05-04T08:41:11.667747 #2812191] INFO -- : [834/885] 2853047=test_helper I, [2024-05-04T08:41:11.671482 #2812191] INFO -- : [835/885] 2853047=test_win32ole_event I, [2024-05-04T08:41:11.678325 #2812191] INFO -- : [836/885] 2853047=test_rdoc_markup_formatter I, [2024-05-04T08:41:11.709594 #2812191] INFO -- : [837/885] 2853047=test_gem_commands_uninstall_command I, [2024-05-04T08:41:11.749339 #2812191] INFO -- : [838/885] 2853046=test_gem_ext_cmake_builder I, [2024-05-04T08:41:11.753189 #2812191] INFO -- : [839/885] 2853046=test_digest_extend I, [2024-05-04T08:41:11.786287 #2812191] INFO -- : [840/885] 2853046=test_last_thread I, [2024-05-04T08:41:12.634393 #2812191] INFO -- : [841/885] 2853047=test_thread_fd_close I, [2024-05-04T08:41:12.644164 #2812191] INFO -- : [842/885] 2853047=test_getopts I, [2024-05-04T08:41:12.760108 #2812191] INFO -- : [843/885] 2853047=test_fips I, [2024-05-04T08:41:12.838425 #2812191] INFO -- : [844/885] 2853046=test_alias I, [2024-05-04T08:41:12.945440 #2812191] INFO -- : [845/885] 2853047=test_emitter I, [2024-05-04T08:41:12.960002 #2812191] INFO -- : [846/885] 2853047=test_pattern_key_name_check I, [2024-05-04T08:41:12.971479 #2812191] INFO -- : [847/885] 2853047=test_profile_frames I, [2024-05-04T08:41:12.998790 #2812191] INFO -- : [848/885] 2853046=test_transcode I, [2024-05-04T08:41:13.169176 #2812191] INFO -- : [849/885] 2853047=test_refinement I, [2024-05-04T08:41:13.180713 #2812191] INFO -- : [850/885] 2853046=test_debug I, [2024-05-04T08:41:13.226853 #2812191] INFO -- : [851/885] 2853046=test_gem_commands_cleanup_command I, [2024-05-04T08:41:13.992794 #2812191] INFO -- : [852/885] 2853046=test_class2name I, [2024-05-04T08:41:14.001835 #2812191] INFO -- : [853/885] 2853046=test_cgi_session I, [2024-05-04T08:41:14.026007 #2812191] INFO -- : [854/885] 2853046=test_notimplement I, [2024-05-04T08:41:14.067217 #2812191] INFO -- : [855/885] 2853046=test_c_union_entity I, [2024-05-04T08:41:14.252174 #2812191] INFO -- : [856/885] 2853046=test_dns I, [2024-05-04T08:41:14.715276 #2812191] INFO -- : [857/885] 2853046=test_x509crl I, [2024-05-04T08:41:14.813076 #2812191] INFO -- : [858/885] 2853046=test_rdoc_markup_heading I, [2024-05-04T08:41:14.828446 #2812191] INFO -- : [859/885] 2853046=test_flip I, [2024-05-04T08:41:14.861605 #2812191] INFO -- : [860/885] 2853046=test_io_console I, [2024-05-04T08:41:17.279232 #2812191] INFO -- : [861/885] 2853047=test_ifunless I, [2024-05-04T08:41:17.290855 #2812191] INFO -- : [862/885] 2853047=test_allocation I, [2024-05-04T08:41:17.441959 #2812191] INFO -- : [863/885] 2853046=test_gem_console_ui I, [2024-05-04T08:41:17.449235 #2812191] INFO -- : [864/885] 2853046=test_insns_leaf I, [2024-05-04T08:41:17.658636 #2812191] INFO -- : [865/885] 2853046=test_readpartial I, [2024-05-04T08:41:17.882408 #2812191] INFO -- : [866/885] 2853046=test_rdoc_parser_ruby I, [2024-05-04T08:41:19.082723 #2812191] INFO -- : [867/885] 2853046=test_httpresponse I, [2024-05-04T08:41:19.114878 #2812191] INFO -- : [868/885] 2853046=test_x509req I, [2024-05-04T08:41:19.143926 #2812191] INFO -- : [869/885] 2853046=test_gem_source_vendor I, [2024-05-04T08:41:19.160725 #2812191] INFO -- : [870/885] 2853046=test_gem_resolver I, [2024-05-04T08:41:19.575300 #2812191] INFO -- : [871/885] 2853046=test_dln I, [2024-05-04T08:41:19.595938 #2812191] INFO -- : [872/885] 2853046=test_object I, [2024-05-04T08:41:19.764747 #2812191] INFO -- : [873/885] 2853047=test_gem_commands_exec_command I, [2024-05-04T08:41:19.948169 #2812191] INFO -- : [874/885] 2853046=unescape_test I, [2024-05-04T08:41:21.318976 #2812191] INFO -- : [875/885] 2853047=test_super I, [2024-05-04T08:41:21.418032 #2812191] INFO -- : [876/885] 2853046=test_color_printer I, [2024-05-04T08:41:21.442589 #2812191] INFO -- : [877/885] 2853046=test_gem_available_set I, [2024-05-04T08:41:21.550464 #2812191] INFO -- : [878/885] 2853046=test_pkg_config I, [2024-05-04T08:41:21.558205 #2812191] INFO -- : [879/885] 2853046=test_modify_expand I, [2024-05-04T08:41:23.787233 #2812191] INFO -- : [880/885] 2853046=test_convertible I, [2024-05-04T08:41:24.009494 #2812191] INFO -- : [881/885] 2853047=errors_test I, [2024-05-04T08:41:24.128626 #2812191] INFO -- : [882/885] 2853047=test_config I, [2024-05-04T08:41:24.255804 #2812191] INFO -- : [883/885] 2853047=test_func I, [2024-05-04T08:41:25.390873 #2812191] INFO -- : [884/885] 2853046=json_encoding_test I, [2024-05-04T08:41:28.237942 #2812191] INFO -- : [885/885] 2853046=test_vm_dump I, [2024-05-04T08:41:32.867901 #2812191] INFO -- : Finished tests in 199.805266s, 131.5331 tests/s, 46780.1685 assertions/s. E, [2024-05-04T08:41:32.868154 #2812191] ERROR -- : Children under /tmp/rubytest.2pfy2k: E, [2024-05-04T08:41:32.868203 #2812191] ERROR -- : * drwx------ 4 28 2024-05-04 08:39:35 +0000 gem_rebuild20240504-2853047-hlrgnk/ E, [2024-05-04T08:41:32.868285 #2812191] ERROR -- : * drwxrwxr-x 2 40 2024-05-04 08:39:35 +0000 old/ E, [2024-05-04T08:41:32.868300 #2812191] ERROR -- : * -rw-rw-r-- 1 4096 2024-05-04 08:39:35 +0000 rebuild_test_gem-1.0.0.gem E, [2024-05-04T08:41:32.868455 #2812191] ERROR -- : * drwxrwxr-x 2 40 2024-05-04 08:39:35 +0000 new/ E, [2024-05-04T08:41:32.868481 #2812191] ERROR -- : * -rw-rw-r-- 1 4096 2024-05-04 08:39:35 +0000 rebuild_test_gem-1.0.0.gem I, [2024-05-04T08:41:32.874868 #2812191] INFO -- : 26281 tests, 9346924 assertions, 0 failures, 0 errors, 328 skips I, [2024-05-04T08:41:32.874914 #2812191] INFO -- : I, [2024-05-04T08:41:32.874926 #2812191] INFO -- : ruby -v: ruby 3.4.0dev (2024-05-04T03:32:34Z master bd42f0898d) [aarch64-linux] I, [2024-05-04T08:41:32.875917 #2812191] INFO -- : $$$[end] "make yes-test-all TESTOPTS='--stderr-on-failure' TESTS='-j3'" exit with 0. I, [2024-05-04T08:41:32.876073 #2812191] INFO -- : $$$[beg] make yes-test-rubyspec MSPECOPT='--error-output stderr --debug -j' TESTS='-j3' I, [2024-05-04T08:41:33.004801 #2812191] INFO -- : BASERUBY = /usr/local/bin/ruby --disable=gems I, [2024-05-04T08:41:33.004883 #2812191] INFO -- : CC = gcc I, [2024-05-04T08:41:33.004895 #2812191] INFO -- : LD = ld I, [2024-05-04T08:41:33.004904 #2812191] INFO -- : LDSHARED = gcc -shared I, [2024-05-04T08:41:33.004916 #2812191] INFO -- : CFLAGS = -O3 -fno-fast-math -ggdb3 -Wall -Wextra -Wdeprecated-declarations -Wdiv-by-zero -Wduplicated-cond -Wimplicit-function-declaration -Wimplicit-int -Wpointer-arith -Wwrite-strings -Wold-style-definition -Wimplicit-fallthrough=0 -Wmissing-noreturn -Wno-cast-function-type -Wno-constant-logical-operand -Wno-long-long -Wno-missing-field-initializers -Wno-overlength-strings -Wno-packed-bitfield-compat -Wno-parentheses-equality -Wno-self-assign -Wno-tautological-compare -Wno-unused-parameter -Wno-unused-value -Wsuggest-attribute=format -Wsuggest-attribute=noreturn -Wunused-variable -Wmisleading-indentation -Wundef I, [2024-05-04T08:41:33.004926 #2812191] INFO -- : XCFLAGS = -U_FORTIFY_SOURCE -D_FORTIFY_SOURCE=2 -fstack-protector-strong -msign-return-address=all -fno-strict-overflow -fvisibility=hidden -fexcess-precision=standard -DRUBY_EXPORT -fPIE -I. -I.ext/include/aarch64-linux -I/home/opc/ruby/src/master/include -I/home/opc/ruby/src/master -I/home/opc/ruby/src/master/prism -I/home/opc/ruby/src/master/enc/unicode/15.0.0 I, [2024-05-04T08:41:33.004935 #2812191] INFO -- : CPPFLAGS = I, [2024-05-04T08:41:33.004943 #2812191] INFO -- : DLDFLAGS = -Wl,--compress-debug-sections=zlib -fstack-protector-strong -pie I, [2024-05-04T08:41:33.004952 #2812191] INFO -- : SOLIBS = -lz -lrt -lrt -ldl -lcrypt -lm -lpthread I, [2024-05-04T08:41:33.004961 #2812191] INFO -- : LANG = en_US.UTF-8 I, [2024-05-04T08:41:33.004969 #2812191] INFO -- : LC_ALL = I, [2024-05-04T08:41:33.004977 #2812191] INFO -- : LC_CTYPE = I, [2024-05-04T08:41:33.004985 #2812191] INFO -- : MFLAGS = I, [2024-05-04T08:41:33.004994 #2812191] INFO -- : RUSTC = rustc I, [2024-05-04T08:41:33.005002 #2812191] INFO -- : YJIT_RUSTC_ARGS = --crate-name=yjit --crate-type=staticlib --edition=2021 -g -C lto=thin -C opt-level=3 -C overflow-checks=on '--out-dir=/home/opc/ruby/build/master/yjit/target/release/' /home/opc/ruby/src/master/yjit/src/lib.rs I, [2024-05-04T08:41:33.005801 #2812191] INFO -- : gcc (GCC) 8.5.0 20210514 (Red Hat 8.5.0-10.1.0.1) I, [2024-05-04T08:41:33.005828 #2812191] INFO -- : Copyright (C) 2018 Free Software Foundation, Inc. I, [2024-05-04T08:41:33.005839 #2812191] INFO -- : This is free software; see the source for copying conditions. There is NO I, [2024-05-04T08:41:33.005849 #2812191] INFO -- : warranty; not even for MERCHANTABILITY or FITNESS FOR A PARTICULAR PURPOSE. I, [2024-05-04T08:41:33.005858 #2812191] INFO -- : I, [2024-05-04T08:41:33.008096 #2812191] INFO -- : generating enc.mk I, [2024-05-04T08:41:33.259718 #2812191] INFO -- : making enc I, [2024-05-04T08:41:33.287517 #2812191] INFO -- : make[1]: Entering directory '/home/opc/ruby/build/master' I, [2024-05-04T08:41:33.287598 #2812191] INFO -- : make[1]: Nothing to be done for 'enc'. I, [2024-05-04T08:41:33.287610 #2812191] INFO -- : make[1]: Leaving directory '/home/opc/ruby/build/master' I, [2024-05-04T08:41:33.288472 #2812191] INFO -- : making srcs under enc I, [2024-05-04T08:41:33.330663 #2812191] INFO -- : make[1]: Entering directory '/home/opc/ruby/build/master' I, [2024-05-04T08:41:33.330719 #2812191] INFO -- : make[1]: Nothing to be done for 'srcs'. I, [2024-05-04T08:41:33.330731 #2812191] INFO -- : make[1]: Leaving directory '/home/opc/ruby/build/master' I, [2024-05-04T08:41:33.331900 #2812191] INFO -- : generating transdb.h I, [2024-05-04T08:41:33.479805 #2812191] INFO -- : transdb.h unchanged I, [2024-05-04T08:41:33.481230 #2812191] INFO -- : making trans I, [2024-05-04T08:41:33.530550 #2812191] INFO -- : make[1]: Entering directory '/home/opc/ruby/build/master' I, [2024-05-04T08:41:33.530624 #2812191] INFO -- : make[1]: Nothing to be done for 'trans'. I, [2024-05-04T08:41:33.530634 #2812191] INFO -- : make[1]: Leaving directory '/home/opc/ruby/build/master' I, [2024-05-04T08:41:33.531155 #2812191] INFO -- : making encs I, [2024-05-04T08:41:33.584343 #2812191] INFO -- : make[1]: Entering directory '/home/opc/ruby/build/master' I, [2024-05-04T08:41:33.584423 #2812191] INFO -- : make[1]: Nothing to be done for 'encs'. I, [2024-05-04T08:41:33.584435 #2812191] INFO -- : make[1]: Leaving directory '/home/opc/ruby/build/master' I, [2024-05-04T08:41:33.586539 #2812191] INFO -- : generating makefiles ext/configure-ext.mk I, [2024-05-04T08:41:33.630256 #2812191] INFO -- : ext/configure-ext.mk updated I, [2024-05-04T08:41:33.633867 #2812191] INFO -- : make[1]: Entering directory '/home/opc/ruby/build/master' I, [2024-05-04T08:41:35.785149 #2812191] INFO -- : make[1]: Leaving directory '/home/opc/ruby/build/master' I, [2024-05-04T08:41:35.785974 #2812191] INFO -- : generating makefile exts.mk I, [2024-05-04T08:41:35.848830 #2812191] INFO -- : exts.mk unchanged I, [2024-05-04T08:41:35.854095 #2812191] INFO -- : make[1]: Entering directory '/home/opc/ruby/build/master' I, [2024-05-04T08:41:36.159301 #2812191] INFO -- : make[2]: Entering directory '/home/opc/ruby/build/master/ext/coverage' I, [2024-05-04T08:41:36.164156 #2812191] INFO -- : make[2]: Leaving directory '/home/opc/ruby/build/master/ext/coverage' I, [2024-05-04T08:41:36.170019 #2812191] INFO -- : make[2]: Entering directory '/home/opc/ruby/build/master/ext/date' I, [2024-05-04T08:41:36.175511 #2812191] INFO -- : make[2]: Leaving directory '/home/opc/ruby/build/master/ext/date' I, [2024-05-04T08:41:36.179019 #2812191] INFO -- : make[2]: Entering directory '/home/opc/ruby/build/master/ext/digest' I, [2024-05-04T08:41:36.188333 #2812191] INFO -- : make[2]: Leaving directory '/home/opc/ruby/build/master/ext/digest' I, [2024-05-04T08:41:36.211795 #2812191] INFO -- : make[2]: Entering directory '/home/opc/ruby/build/master/ext/digest/sha2' I, [2024-05-04T08:41:36.217181 #2812191] INFO -- : make[2]: Leaving directory '/home/opc/ruby/build/master/ext/digest/sha2' I, [2024-05-04T08:41:36.235836 #2812191] INFO -- : make[2]: Entering directory '/home/opc/ruby/build/master/ext/fiddle' I, [2024-05-04T08:41:36.246214 #2812191] INFO -- : make[2]: Leaving directory '/home/opc/ruby/build/master/ext/fiddle' I, [2024-05-04T08:41:36.250730 #2812191] INFO -- : make[2]: Entering directory '/home/opc/ruby/build/master/ext/io/console' I, [2024-05-04T08:41:36.255265 #2812191] INFO -- : make[2]: Leaving directory '/home/opc/ruby/build/master/ext/io/console' I, [2024-05-04T08:41:36.266518 #2812191] INFO -- : make[2]: Entering directory '/home/opc/ruby/build/master/ext/json' I, [2024-05-04T08:41:36.276151 #2812191] INFO -- : make[2]: Leaving directory '/home/opc/ruby/build/master/ext/json' I, [2024-05-04T08:41:36.289626 #2812191] INFO -- : make[2]: Entering directory '/home/opc/ruby/build/master/ext/monitor' I, [2024-05-04T08:41:36.294157 #2812191] INFO -- : make[2]: Leaving directory '/home/opc/ruby/build/master/ext/monitor' I, [2024-05-04T08:41:36.300291 #2812191] INFO -- : make[2]: Entering directory '/home/opc/ruby/build/master/ext/objspace' I, [2024-05-04T08:41:36.306407 #2812191] INFO -- : make[2]: Leaving directory '/home/opc/ruby/build/master/ext/objspace' I, [2024-05-04T08:41:36.325753 #2812191] INFO -- : make[2]: Entering directory '/home/opc/ruby/build/master/ext/openssl' I, [2024-05-04T08:41:36.347436 #2812191] INFO -- : make[2]: Leaving directory '/home/opc/ruby/build/master/ext/openssl' I, [2024-05-04T08:41:36.352078 #2812191] INFO -- : make[2]: Entering directory '/home/opc/ruby/build/master/ext/pathname' I, [2024-05-04T08:41:36.356472 #2812191] INFO -- : make[2]: Leaving directory '/home/opc/ruby/build/master/ext/pathname' I, [2024-05-04T08:41:36.362879 #2812191] INFO -- : make[2]: Entering directory '/home/opc/ruby/build/master/ext/psych' I, [2024-05-04T08:41:36.384460 #2812191] INFO -- : make[2]: Leaving directory '/home/opc/ruby/build/master/ext/psych' I, [2024-05-04T08:41:36.389006 #2812191] INFO -- : make[2]: Entering directory '/home/opc/ruby/build/master/ext/pty' I, [2024-05-04T08:41:36.393450 #2812191] INFO -- : make[2]: Leaving directory '/home/opc/ruby/build/master/ext/pty' I, [2024-05-04T08:41:36.407362 #2812191] INFO -- : make[2]: Entering directory '/home/opc/ruby/build/master/ext/ripper' I, [2024-05-04T08:41:36.416183 #2812191] INFO -- : make[2]: Leaving directory '/home/opc/ruby/build/master/ext/ripper' I, [2024-05-04T08:41:36.418253 #2812191] INFO -- : make[2]: Entering directory '/home/opc/ruby/build/master/ext/rubyvm' I, [2024-05-04T08:41:36.421915 #2812191] INFO -- : make[2]: Leaving directory '/home/opc/ruby/build/master/ext/rubyvm' I, [2024-05-04T08:41:36.434122 #2812191] INFO -- : make[2]: Entering directory '/home/opc/ruby/build/master/ext/socket' I, [2024-05-04T08:41:36.445251 #2812191] INFO -- : make[2]: Leaving directory '/home/opc/ruby/build/master/ext/socket' I, [2024-05-04T08:41:36.461280 #2812191] INFO -- : make[2]: Entering directory '/home/opc/ruby/build/master/.bundle/gems/bigdecimal-3.1.7/ext/bigdecimal' I, [2024-05-04T08:41:36.495115 #2812191] INFO -- : make[2]: Leaving directory '/home/opc/ruby/build/master/.bundle/gems/bigdecimal-3.1.7/ext/bigdecimal' I, [2024-05-04T08:41:36.497849 #2812191] INFO -- : make[2]: Entering directory '/home/opc/ruby/build/master/.bundle/gems/debug-1.9.2/ext/debug' I, [2024-05-04T08:41:36.530804 #2812191] INFO -- : make[2]: Leaving directory '/home/opc/ruby/build/master/.bundle/gems/debug-1.9.2/ext/debug' I, [2024-05-04T08:41:36.533471 #2812191] INFO -- : make[2]: Entering directory '/home/opc/ruby/build/master/.bundle/gems/nkf-0.2.0/ext/nkf' I, [2024-05-04T08:41:36.565888 #2812191] INFO -- : make[2]: Leaving directory '/home/opc/ruby/build/master/.bundle/gems/nkf-0.2.0/ext/nkf' I, [2024-05-04T08:41:36.568569 #2812191] INFO -- : make[2]: Entering directory '/home/opc/ruby/build/master/.bundle/gems/racc-1.7.3/ext/racc/cparse' I, [2024-05-04T08:41:36.600748 #2812191] INFO -- : make[2]: Leaving directory '/home/opc/ruby/build/master/.bundle/gems/racc-1.7.3/ext/racc/cparse' I, [2024-05-04T08:41:36.603862 #2812191] INFO -- : make[2]: Entering directory '/home/opc/ruby/build/master/.bundle/gems/rbs-3.4.4/ext/rbs_extension' I, [2024-05-04T08:41:36.636998 #2812191] INFO -- : make[2]: Leaving directory '/home/opc/ruby/build/master/.bundle/gems/rbs-3.4.4/ext/rbs_extension' I, [2024-05-04T08:41:36.639646 #2812191] INFO -- : make[2]: Entering directory '/home/opc/ruby/build/master/.bundle/gems/syslog-0.1.2/ext/syslog' I, [2024-05-04T08:41:36.671178 #2812191] INFO -- : make[2]: Leaving directory '/home/opc/ruby/build/master/.bundle/gems/syslog-0.1.2/ext/syslog' I, [2024-05-04T08:41:36.709577 #2812191] INFO -- : make[2]: Entering directory '/home/opc/ruby/build/master' I, [2024-05-04T08:41:36.796779 #2812191] INFO -- : make[2]: 'ruby' is up to date. I, [2024-05-04T08:41:36.796861 #2812191] INFO -- : make[2]: Leaving directory '/home/opc/ruby/build/master' I, [2024-05-04T08:41:36.797000 #2812191] INFO -- : make[1]: Leaving directory '/home/opc/ruby/build/master' I, [2024-05-04T08:41:36.801501 #2812191] INFO -- : make[1]: Entering directory '/home/opc/ruby/build/master' I, [2024-05-04T08:41:36.801543 #2812191] INFO -- : make[1]: Nothing to be done for 'note'. I, [2024-05-04T08:41:36.801554 #2812191] INFO -- : make[1]: Leaving directory '/home/opc/ruby/build/master' E, [2024-05-04T08:41:36.879430 #2812191] ERROR -- : $ /home/opc/ruby/build/master/miniruby -I/home/opc/ruby/src/master/lib /home/opc/ruby/src/master/tool/runruby.rb --archdir=/home/opc/ruby/build/master --extout=.ext -- /home/opc/ruby/src/master/spec/mspec/bin/mspec-run -B /home/opc/ruby/src/master/spec/default.mspec --error-output stderr --debug -fy -o /tmp/rubytest.l4jiti/1-mspec-multi-0 E, [2024-05-04T08:41:36.879811 #2812191] ERROR -- : $ /home/opc/ruby/build/master/miniruby -I/home/opc/ruby/src/master/lib /home/opc/ruby/src/master/tool/runruby.rb --archdir=/home/opc/ruby/build/master --extout=.ext -- /home/opc/ruby/src/master/spec/mspec/bin/mspec-run -B /home/opc/ruby/src/master/spec/default.mspec --error-output stderr --debug -fy -o /tmp/rubytest.l4jiti/2-mspec-multi-1 E, [2024-05-04T08:41:36.880079 #2812191] ERROR -- : $ /home/opc/ruby/build/master/miniruby -I/home/opc/ruby/src/master/lib /home/opc/ruby/src/master/tool/runruby.rb --archdir=/home/opc/ruby/build/master --extout=.ext -- /home/opc/ruby/src/master/spec/mspec/bin/mspec-run -B /home/opc/ruby/src/master/spec/default.mspec --error-output stderr --debug -fy -o /tmp/rubytest.l4jiti/3-mspec-multi-2 I, [2024-05-04T08:41:37.022363 #2812191] INFO -- : ruby 3.4.0dev (2024-05-04T03:32:34Z master bd42f0898d) [aarch64-linux] I, [2024-05-04T08:41:42.728908 #2812191] INFO -- : 0 ......................................................................... I, [2024-05-04T08:41:45.335076 #2812191] INFO -- : 73 ......................................................................... I, [2024-05-04T08:41:45.534822 #2812191] INFO -- : 146 ......................................................................... I, [2024-05-04T08:41:45.848917 #2812191] INFO -- : 219 ......................................................................... I, [2024-05-04T08:41:46.011763 #2812191] INFO -- : 292 ......................................................................... I, [2024-05-04T08:41:46.269537 #2812191] INFO -- : 365 ......................................................................... I, [2024-05-04T08:41:46.401391 #2812191] INFO -- : 438 ......................................................................... I, [2024-05-04T08:41:46.465985 #2812191] INFO -- : 511 ......................................................................... I, [2024-05-04T08:41:46.528399 #2812191] INFO -- : 584 ......................................................................... I, [2024-05-04T08:41:47.133098 #2812191] INFO -- : 657 ......................................................................... I, [2024-05-04T08:41:47.254020 #2812191] INFO -- : 730 ......................................................................... I, [2024-05-04T08:41:47.309235 #2812191] INFO -- : 803 ......................................................................... I, [2024-05-04T08:41:47.538966 #2812191] INFO -- : 876 ......................................................................... I, [2024-05-04T08:41:47.658886 #2812191] INFO -- : 949 ......................................................................... I, [2024-05-04T08:41:48.266429 #2812191] INFO -- : 1022 ......................................................................... I, [2024-05-04T08:41:50.586725 #2812191] INFO -- : 1095 ......................................................................... I, [2024-05-04T08:41:51.430654 #2812191] INFO -- : 1168 ......................................................................... I, [2024-05-04T08:41:51.612541 #2812191] INFO -- : 1241 ......................................................................... I, [2024-05-04T08:41:51.795281 #2812191] INFO -- : 1314 ......................................................................... I, [2024-05-04T08:41:51.891362 #2812191] INFO -- : 1387 ......................................................................... I, [2024-05-04T08:41:53.962561 #2812191] INFO -- : 1460 ......................................................................... I, [2024-05-04T08:41:57.532748 #2812191] INFO -- : 1533 ......................................................................... I, [2024-05-04T08:41:57.689877 #2812191] INFO -- : 1606 ......................................................................... I, [2024-05-04T08:41:58.530835 #2812191] INFO -- : 1679 ......................................................................... I, [2024-05-04T08:41:58.835392 #2812191] INFO -- : 1752 ......................................................................... I, [2024-05-04T08:41:59.122397 #2812191] INFO -- : 1825 ......................................................................... I, [2024-05-04T08:41:59.455667 #2812191] INFO -- : 1898 ......................................................................... I, [2024-05-04T08:41:59.859057 #2812191] INFO -- : 1971 ......................................................................... I, [2024-05-04T08:42:00.363367 #2812191] INFO -- : 2044 ......................................................................... I, [2024-05-04T08:42:00.447678 #2812191] INFO -- : 2117 ......................................................................... I, [2024-05-04T08:42:00.508087 #2812191] INFO -- : 2190 ......................................................................... I, [2024-05-04T08:42:00.559075 #2812191] INFO -- : 2263 ......................................................................... I, [2024-05-04T08:42:00.607057 #2812191] INFO -- : 2336 ......................................................................... I, [2024-05-04T08:42:00.698270 #2812191] INFO -- : 2409 ......................................................................... I, [2024-05-04T08:42:00.972682 #2812191] INFO -- : 2482 ......................................................................... I, [2024-05-04T08:42:01.102396 #2812191] INFO -- : 2555 ......................................................................... I, [2024-05-04T08:42:02.386909 #2812191] INFO -- : 2628 ......................................................................... I, [2024-05-04T08:42:02.543515 #2812191] INFO -- : 2701 ......................................................................... I, [2024-05-04T08:42:02.691032 #2812191] INFO -- : 2774 ......................................................................... I, [2024-05-04T08:42:03.015561 #2812191] INFO -- : 2847 ......................................................................... I, [2024-05-04T08:42:03.281747 #2812191] INFO -- : 2920 ......................................................................... I, [2024-05-04T08:42:03.398995 #2812191] INFO -- : 2993 ......................................................................... I, [2024-05-04T08:42:03.465290 #2812191] INFO -- : 3066 ......................................................................... I, [2024-05-04T08:42:03.506916 #2812191] INFO -- : 3139 ......................................................................... I, [2024-05-04T08:42:03.571943 #2812191] INFO -- : 3212 ......................................................................... I, [2024-05-04T08:42:03.645288 #2812191] INFO -- : 3285 ......................................................................... I, [2024-05-04T08:42:07.491682 #2812191] INFO -- : 3358 ........................................................................ I, [2024-05-04T08:42:07.491759 #2812191] INFO -- : I, [2024-05-04T08:42:07.491771 #2812191] INFO -- : Finished in 30.612194 seconds I, [2024-05-04T08:42:07.491780 #2812191] INFO -- : I, [2024-05-04T08:42:07.491789 #2812191] INFO -- : 3429 files, 32606 examples, 190184 expectations, 0 failures, 0 errors, 0 tagged I, [2024-05-04T08:42:07.493644 #2812191] INFO -- : $$$[end] "make yes-test-rubyspec MSPECOPT='--error-output stderr --debug -j' TESTS='-j3'" exit with 0.